SebastianoMoruzzi
type: NamedIndividual
type: Person
name: Sebastiano Moruzzi
workplace homepage: https://www.unibo.it/en

MichaelNoeske
type: NamedIndividual
type: Person
name: Paul-Ludwig Michael Noeske
workplace homepage: https://www.ifam.fraunhofer.de/en

AnnedeBaas
type: NamedIndividual
type: Person
name: Anne de Baas
workplace homepage: https://materialsmodelling.com

unitCode
type: AnnotationProperty
comment: The unit of measurement given using the UN/CEFACT Common Code (3 characters) or a URL.
range: string
see also: The normative list of all codes is available at http://www.unece.org/fileadmin/DAM/cefact/recommendations/rec20/rec20_Rev9e_2014.xls
EMMO 967080e5 2f42 4eb2 a3a9 c58143e835f9: The unit of measurement given using the UN/CEFACT Common Code (3 characters) or a URL.
EMMO c7b62dd7 063a 4c2a 8504 42f7264ba83f: Other codes than the UN/CEFACT Common Code may be used with a prefix followed by a colon.
EMMO c7b62dd7 063a 4c2a 8504 42f7264ba83f: The UN/CEFACT Recommendation 20 provides three character alphabetic and alphanumeric codes for representing units of measurement for length, area, volume/capacity, mass (weight), time, and other quantities used in international trade. The codes are intended for use in manual and/or automated systems for the exchange of information between participants in international trade.

EMMO Maximal (EMAX)
type: Ontology
abstract: EMMO Maximal (EMAX) - the full version of the Elementary Multiperspective Material Ontology (EMMO), including additional mereocausal concepts, the full standard model and non-SI and prefixed units. EMMO is a multidisciplinary effort to develop a standard representational framework (the ontology) based on current materials modelling knowledge, including physical sciences, analytical philosophy and information and communication technologies. It provides the connection between the physical world, materials characterisation world and materials modelling world. EMMO is released under a Creative Commons license Attribution 4.0 International (CC BY 4.0).
alternative: EMMO
bibliographic citation: F. A. Zaccarini, C. Masolo, E. Ghedini, and S. Borgo. From Causation (and Parthood) to Time: The Case of EMMO (2023) doi: 10.3233/FAIA231120
contributor: https://orcid.org/0000-0001-7815-6636
contributor: https://orcid.org/0000-0001-8869-3718
contributor: https://orcid.org/0000-0002-8758-6109
contributor: https://orcid.org/0000-0003-0514-9229
contributor: https://orcid.org/0000-0003-4065-9742
contributor: https://orcid.org/0009-0008-8009-5009
created: 2025-02-20
creator: 0000-0002-1560-809X
creator: https://orcid.org/0000-0002-4181-2852
creator: https://orcid.org/0000-0003-3805-8761
has format: turtle
issued: 2018-05-03
license: legalcode
modified: 2025-03-27
publisher: EMMC ASBL
source: CWA 17815, Materials characterisation - Terminology, metadata and classification. Led by EMMC. 2017. https://www.cencenelec.eu/media/CEN-CENELEC/CWAs/ICT/cwa17815.pdf
source: European Commission, Directorate-General for Research and Innovation, Baas, A., What makes a material function? - Let me compute the ways - Modelling in H2020 LEIT-NMBP programme materials and nanotechnology projects -Sixth version - Short version, Baas, A.(editor), Publications Office of the European Union, 2017, https://data.europa.eu/doi/10.2777/404734
doi: 10.5281/zenodo.5730500
status: published
preferred namespace prefix: emmo
comment: The EMMO should be reasoned in order to visualize all inferences and class hierarchy in Protege (ctrl+R hotkey). It is tested with both the HermiT (preferred) and HermiT reasoners.
prior version: 1.0.2
version IRI: https://w3id.org/emmo/1.0.3
version info: 1.0.3

hasFractionalMember
type: ObjectProperty
comment: The relation between a collection and a non maximal self-connect part of one of its member.
EMMO 967080e5 2f42 4eb2 a3a9 c58143e835f9: The relation between a collection and a non maximal self-connect part of one of its member.

Abampere
type: Class
comment: The Abampere (aA), also called the biot after Jean-Baptiste Biot, is the basic electromagnetic unit of electric current in the emu-cgs system of units (electromagnetic cgs). One abampere is equal to ten amperes in the SI system of units. An abampere is the constant current that produces, when maintained in two parallel conductors of negligible circular section and of infinite length placed 1 centimetre apart, a force of 2 dynes per centimetre between the two conductors. -- QUDT
subclass of: Restriction
  has value: 1e+01
subclass of: Restriction
  has value: 0e+00
qudtReference: http://qudt.org/vocab/unit/A_Ab
ucumCode: Bi
unitSymbol: abA
EMMO 967080e5 2f42 4eb2 a3a9 c58143e835f9: The Abampere (aA), also called the biot after Jean-Baptiste Biot, is the basic electromagnetic unit of electric current in the emu-cgs system of units (electromagnetic cgs). One abampere is equal to ten amperes in the SI system of units. An abampere is the constant current that produces, when maintained in two parallel conductors of negligible circular section and of infinite length placed 1 centimetre apart, a force of 2 dynes per centimetre between the two conductors. -- QUDT
wikipediaReference: http://en.wikipedia.org/wiki/Abampere

AbamperePerSquareCentiMetre
type: Class
comment: Abampere Per Square Centimeter (aA/cm²) is a unit in the category of Electric current density. It is also known as abamperes per square centimeter, abampere/square centimeter, abampere/square centimetre, abamperes per square centimetre, abampere per square centimetre. This unit is commonly used in the cgs unit system. Abampere Per Square Centimeter (aA/cm²) has a dimension of L⁻²I where L is length, and I is electric current. It can be converted to the corresponding standard SI unit A/m² by multiplying its value by a factor of 100000. -- QUDT
subclass of: Restriction
  has value: 0e+00
subclass of: Restriction
  has value: 1e+05
alternative label: Abampere per Square Centimetre
qudtReference: http://qudt.org/vocab/unit/A_Ab-PER-CentiM2
ucumCode: Bi.cm-2
ucumCode: Bi/cm2
unitSymbol: abA/cm²
EMMO 967080e5 2f42 4eb2 a3a9 c58143e835f9: Abampere Per Square Centimeter (aA/cm²) is a unit in the category of Electric current density. It is also known as abamperes per square centimeter, abampere/square centimeter, abampere/square centimetre, abamperes per square centimetre, abampere per square centimetre. This unit is commonly used in the cgs unit system. Abampere Per Square Centimeter (aA/cm²) has a dimension of L⁻²I where L is length, and I is electric current. It can be converted to the corresponding standard SI unit A/m² by multiplying its value by a factor of 100000. -- QUDT

AbampereSquareCentiMetre
type: Class
comment: "Abampere Square centimeter" is the unit of magnetic moment in the electromagnetic centimeter-gram-second system. -- QUDT
subclass of: Restriction
  has value: 1e+09
subclass of: Restriction
  has value: 0e+00
alternative label: Abampere Square centimetre
qudtReference: http://qudt.org/vocab/unit/A_Ab-CentiM2
ucumCode: Bi.cm2
unitSymbol: abA⋅cm²
EMMO 967080e5 2f42 4eb2 a3a9 c58143e835f9: "Abampere Square centimeter" is the unit of magnetic moment in the electromagnetic centimeter-gram-second system. -- QUDT

Abcoulomb
type: Class
comment: "abcoulomb" (abC or aC) or electromagnetic unit of charge (emu of charge) is the basic physical unit of electric charge in the cgs-emu system of units. One abcoulomb is equal to ten coulombs (1 abC = 10 C). -- QUDT
subclass of: Restriction
  has value: 1e+01
subclass of: Restriction
  has value: 0e+00
qudtReference: http://qudt.org/vocab/unit/C_Ab
ucumCode: 10.C
unitSymbol: abC
EMMO 967080e5 2f42 4eb2 a3a9 c58143e835f9: "abcoulomb" (abC or aC) or electromagnetic unit of charge (emu of charge) is the basic physical unit of electric charge in the cgs-emu system of units. One abcoulomb is equal to ten coulombs (1 abC = 10 C). -- QUDT
wikipediaReference: http://en.wikipedia.org/wiki/Abcoulomb

AbcoulombPerSquareCentiMetre
type: Class
comment: Abcoulomb Per Square Centimeter is a unit in the category of Electric charge surface density. It is also known as abcoulombs per square centimeter, abcoulomb per square centimetre, abcoulombs per square centimetre, abcoulomb/square centimeter,abcoulomb/square centimetre. This unit is commonly used in the cgs unit system. Abcoulomb Per Square Centimeter (abcoulomb/cm2) has a dimension of L₂TI. where L is length, T is time, and I is electric current. It can be converted to the corresponding standard SI unit C/m² by multiplying its value by a factor of 100,000. -- QUDT
subclass of: Restriction
  has value: 1e+05
subclass of: Restriction
  has value: 0e+00
alternative label: Abcoulomb per Square Centimetre
qudtReference: http://qudt.org/vocab/unit/C_Ab-PER-CentiM2
ucumCode: 10.C.cm-2
unitSymbol: abC/cm²
EMMO 967080e5 2f42 4eb2 a3a9 c58143e835f9: Abcoulomb Per Square Centimeter is a unit in the category of Electric charge surface density. It is also known as abcoulombs per square centimeter, abcoulomb per square centimetre, abcoulombs per square centimetre, abcoulomb/square centimeter,abcoulomb/square centimetre. This unit is commonly used in the cgs unit system. Abcoulomb Per Square Centimeter (abcoulomb/cm2) has a dimension of L₂TI. where L is length, T is time, and I is electric current. It can be converted to the corresponding standard SI unit C/m² by multiplying its value by a factor of 100,000. -- QUDT

Abfarad
type: Class
comment: An abfarad is an obsolete electromagnetic (CGS) unit of capacitance equal to 10⁹ farads (1,000,000,000 F or 1 GF). The absolute farad of the e.m.u. system, for a steady current identically abC/abV, and identically reciprocal abdaraf. 1 abF = 1 GF. -- QUDT
subclass of: Restriction
  has value: 1e+09
subclass of: Restriction
  has value: 0e+00
qudtReference: http://qudt.org/vocab/unit/FARAD_Ab
ucumCode: GF
unitSymbol: abF
EMMO 967080e5 2f42 4eb2 a3a9 c58143e835f9: An abfarad is an obsolete electromagnetic (CGS) unit of capacitance equal to 10⁹ farads (1,000,000,000 F or 1 GF). The absolute farad of the e.m.u. system, for a steady current identically abC/abV, and identically reciprocal abdaraf. 1 abF = 1 GF. -- QUDT
wikipediaReference: http://en.wikipedia.org/wiki/Abfarad

AbfaradPerCentiMetre
type: Class
comment: The absolute dielectric constant of free space is defined as the ratio of displacement to the electric field intensity. The unit of measure is the abfarad per centimeter, a derived CGS unit. -- QUDT
subclass of: Restriction
  has value: 0e+00
subclass of: Restriction
  has value: 1e+11
alternative label: Abfarad per Centimetre
qudtReference: http://qudt.org/vocab/unit/FARAD_Ab-PER-CentiM
ucumCode: GF.cm-1
unitSymbol: abf/cm
EMMO 967080e5 2f42 4eb2 a3a9 c58143e835f9: The absolute dielectric constant of free space is defined as the ratio of displacement to the electric field intensity. The unit of measure is the abfarad per centimeter, a derived CGS unit. -- QUDT

Abhenry
type: Class
comment: Abhenry is the centimeter-gram-second electromagnetic unit of inductance, equal to one billionth of a henry. -- QUDT
subclass of: Restriction
  has value: 1e-09
subclass of: Restriction
  has value: 0e+00
qudtReference: http://qudt.org/vocab/unit/H_Ab
ucumCode: nH
unitSymbol: abH
EMMO 967080e5 2f42 4eb2 a3a9 c58143e835f9: Abhenry is the centimeter-gram-second electromagnetic unit of inductance, equal to one billionth of a henry. -- QUDT
wikipediaReference: http://en.wikipedia.org/wiki/Abhenry

Abohm
type: Class
comment: `abohm` is the basic unit of electrical resistance in the emu-cgs system of units. One abohm is equal to 10⁻⁹ ohms in the SI system of units; one abohm is a nano ohm. -- QUDT
subclass of: Restriction
  has value: 1e-09
subclass of: Restriction
  has value: 0e+00
qudtReference: http://qudt.org/vocab/unit/OHM_Ab
ucumCode: nOhm
unitSymbol: abΩ
EMMO 967080e5 2f42 4eb2 a3a9 c58143e835f9: `abohm` is the basic unit of electrical resistance in the emu-cgs system of units. One abohm is equal to 10⁻⁹ ohms in the SI system of units; one abohm is a nano ohm. -- QUDT
wikipediaReference: http://en.wikipedia.org/wiki/Abohm

Absiemens
type: Class
comment: The CGS electromagnetic unit of conductance; one absiemen is the conductance at which a potential of one abvolt forces a current of one abampere; equal to 10⁹ siemens. One siemen is the conductance at which a potential of one volt forces a current of one ampere and named for Karl Wilhem Siemens. -- QUDT
subclass of: Restriction
  has value: 1e+09
subclass of: Restriction
  has value: 0e+00
qudtReference: http://qudt.org/vocab/unit/S_Ab
ucumCode: GS
unitSymbol: aS
EMMO 967080e5 2f42 4eb2 a3a9 c58143e835f9: The CGS electromagnetic unit of conductance; one absiemen is the conductance at which a potential of one abvolt forces a current of one abampere; equal to 10⁹ siemens. One siemen is the conductance at which a potential of one volt forces a current of one ampere and named for Karl Wilhem Siemens. -- QUDT

Abtesla
type: Class
comment: The unit of magnetic induction in the cgs system, 10⁻⁴ tesla. Also known as the gauss. -- QUDT
subclass of: Restriction
  has value: 0e+00
subclass of: Restriction
  has value: 1e-04
qudtReference: http://qudt.org/vocab/unit/T_Ab
unitSymbol: abT
EMMO 967080e5 2f42 4eb2 a3a9 c58143e835f9: The unit of magnetic induction in the cgs system, 10⁻⁴ tesla. Also known as the gauss. -- QUDT

Abvolt
type: Class
comment: A unit of electrical potential equal to one hundred millionth of a volt (10⁻⁸ volts), used in the centimeter-gram-second (CGS) system of units. One abV is the potential difference that exists between two points when the work done to transfer one abcoulomb of charge between them equals: 1 erg· 1 abV = 10 nV. -- QUDT
subclass of: Restriction
  has value: 1e-08
subclass of: Restriction
  has value: 0e+00
qudtReference: http://qudt.org/vocab/unit/V_Ab
ucumCode: 10.nV
unitSymbol: abV
EMMO 967080e5 2f42 4eb2 a3a9 c58143e835f9: A unit of electrical potential equal to one hundred millionth of a volt (10⁻⁸ volts), used in the centimeter-gram-second (CGS) system of units. One abV is the potential difference that exists between two points when the work done to transfer one abcoulomb of charge between them equals: 1 erg· 1 abV = 10 nV. -- QUDT
wikipediaReference: http://en.wikipedia.org/wiki/Abvolt

AbvoltPerCentiMetre
type: Class
comment: In the electromagnetic centimeter-gram-second system of units, 'abvolt per centimeter' is the unit of electric field strength. -- QUDT
subclass of: Restriction
  has value: 1e-06
subclass of: Restriction
  has value: 0e+00
alternative label: Abvolt per centimetre
qudtReference: http://qudt.org/vocab/unit/V_Ab-PER-CentiM
ucumCode: 10.nV.cm-1
unitSymbol: abV/cm
EMMO 967080e5 2f42 4eb2 a3a9 c58143e835f9: In the electromagnetic centimeter-gram-second system of units, 'abvolt per centimeter' is the unit of electric field strength. -- QUDT

AbvoltSecond
type: Class
comment: The magnetic flux whose expenditure in 1 second produces 1 abvolt per turn of a linked circuit. Technically defined in a three-dimensional system, it corresponds in the four-dimensional electromagnetic sector of the SI system to 10 nWb, and is an impractically small unit. In use for some years, the name was agreed by the International Electrotechnical Committee in 1930, along with a corresponding practical unit, the pramaxwell (or pro-maxwell) = 10⁸ maxwell. -- QUDT
subclass of: Restriction
  has value: 1e-08
subclass of: Restriction
  has value: 0e+00
alternative label: Abvolt Second
qudtReference: http://qudt.org/vocab/unit/V_Ab-SEC
ucumCode: 10.nV.s
unitSymbol: abv⋅s
EMMO 967080e5 2f42 4eb2 a3a9 c58143e835f9: The magnetic flux whose expenditure in 1 second produces 1 abvolt per turn of a linked circuit. Technically defined in a three-dimensional system, it corresponds in the four-dimensional electromagnetic sector of the SI system to 10 nWb, and is an impractically small unit. In use for some years, the name was agreed by the International Electrotechnical Committee in 1930, along with a corresponding practical unit, the pramaxwell (or pro-maxwell) = 10⁸ maxwell. -- QUDT

pH
type: Class
comment: The negative decadic logarithmus of the concentration of free protons (or hydronium ions) expressed in 1 mol/l. -- QUDT
alternative label: Acidity
qudtReference: http://qudt.org/vocab/unit/PH
ucumCode: [pH]
unitSymbol: pH
EMMO 967080e5 2f42 4eb2 a3a9 c58143e835f9: The negative decadic logarithmus of the concentration of free protons (or hydronium ions) expressed in 1 mol/l. -- QUDT
EMMO c7b62dd7 063a 4c2a 8504 42f7264ba83f: Standard state: c0 is 1 mol/L. c of H+ of pure water is determined by the amount of dissociated water. The dissociation constant of water is 10^-14 and since there are qeal amounts of H+ and OH- we get 10^-7 mol H+ /L. -log(10^-7) = 7. The gamma is the activity coefficient which is assumed to be 1 when we say pH = -log[H+].
EMMO c7b62dd7 063a 4c2a 8504 42f7264ba83f: The proper definition of pH is pH = -log(a) where `a` is the activity of H+ ions in an aqueus solution.

Acre
type: Class
comment: The acre is a unit of area in a number of different systems, including the imperial and U.S. customary systems. Its international symbol is ac. The most commonly used acres today are the international acre and, in the United States, the survey acre. The most common use of the acre is to measure tracts of land. One international acre is equal to 4046.8564224 square metres. -- QUDT
subclass of: Restriction
  has value: 4.046856e+03
subclass of: Restriction
  has value: 0e+00
qudtReference: http://qudt.org/vocab/unit/AC
ucumCode: [acr_br]
unitSymbol: acre
EMMO 967080e5 2f42 4eb2 a3a9 c58143e835f9: The acre is a unit of area in a number of different systems, including the imperial and U.S. customary systems. Its international symbol is ac. The most commonly used acres today are the international acre and, in the United States, the survey acre. The most common use of the acre is to measure tracts of land. One international acre is equal to 4046.8564224 square metres. -- QUDT
wikipediaReference: http://en.wikipedia.org/wiki/Acre

AcreFoot
type: Class
comment: An acre-foot is a unit of volume commonly used in the United States in reference to large-scale water resources, such as reservoirs, aqueducts, canals, sewer flow capacity, and river flows. It is defined by the volume of one acre of surface area to a depth of one foot. Since the acre is defined as a chain by a furlong (66 ft × 660 ft) the acre-foot is exactly 43,560 cubic feet. For irrigation water, the volume of 1 ft × 1 ac = 43,560 ft³ (1,233.482 m³, 325,851 US gal). -- QUDT
subclass of: Restriction
  has value: 1.233482e+03
subclass of: Restriction
  has value: 0e+00
alternative label: Acre Foot
qudtReference: http://qudt.org/vocab/unit/AC-FT
ucumCode: [acr_br].[ft_i]
unitSymbol: ac⋅ft
EMMO 967080e5 2f42 4eb2 a3a9 c58143e835f9: An acre-foot is a unit of volume commonly used in the United States in reference to large-scale water resources, such as reservoirs, aqueducts, canals, sewer flow capacity, and river flows. It is defined by the volume of one acre of surface area to a depth of one foot. Since the acre is defined as a chain by a furlong (66 ft × 660 ft) the acre-foot is exactly 43,560 cubic feet. For irrigation water, the volume of 1 ft × 1 ac = 43,560 ft³ (1,233.482 m³, 325,851 US gal). -- QUDT
wikipediaReference: http://en.wikipedia.org/wiki/Acre-foot

AmpereHourPerKilogram
type: Class
comment: unit of electric charge relative to mass
subclass of: Restriction
  has value: 3.6e+03
subclass of: Restriction
  has value: 0e+00
unitSymbol: A⋅h/kg
EMMO 967080e5 2f42 4eb2 a3a9 c58143e835f9: unit of electric charge relative to mass

AmpereHourPerLitre
type: Class
comment: a unit of electric charge per volume
subclass of: Restriction
  has value: 3.6e+06
subclass of: Restriction
  has value: 0e+00
unitSymbol: A⋅h/L
EMMO 967080e5 2f42 4eb2 a3a9 c58143e835f9: a unit of electric charge per volume

AmperePerCentiMetre
type: Class
comment: SI base unit ampere divided by the 0.01-fold of the SI base unit metre -- QUDT
subclass of: Restriction
  has value: 1e+02
subclass of: Restriction
  has value: 0e+00
alternative label: Ampere Per Centimetre
qudtReference: http://qudt.org/vocab/unit/A-PER-CentiM
ucumCode: A.cm-1
unitSymbol: A/cm
EMMO 967080e5 2f42 4eb2 a3a9 c58143e835f9: SI base unit ampere divided by the 0.01-fold of the SI base unit metre -- QUDT

AmperePerDegreeCelsius
type: Class
comment: A measure used to express how a current is subject to temperature. Originally used in Wien's Law to describe phenomena related to filaments. One use today is to express how a current generator derates with temperature. -- QUDT
subclass of: Restriction
  has value: 5.729578e+01
subclass of: Restriction
  has value: 0e+00
alternative label: Ampere per Degree Celsius
qudtReference: http://qudt.org/vocab/unit/A-PER-DEG_C
ucumCode: A.Cel-1
ucumCode: A/Cel
unitSymbol: A/°C
EMMO 967080e5 2f42 4eb2 a3a9 c58143e835f9: A measure used to express how a current is subject to temperature. Originally used in Wien's Law to describe phenomena related to filaments. One use today is to express how a current generator derates with temperature. -- QUDT

AmperePerGram
type: Class
comment: `Ampere per gram` is a practical unit to describe an (applied) current relative to the involved amount of material. This unit is often found in electrochemistry to standardize test conditions and compare various scales of investigated materials. -- QUDT
subclass of: Restriction
  has value: 1e+03
subclass of: Restriction
  has value: 0e+00
alternative label: Ampere per Gram
qudtReference: http://qudt.org/vocab/unit/A-PER-GM
unitSymbol: A⋅/g
EMMO 967080e5 2f42 4eb2 a3a9 c58143e835f9: `Ampere per gram` is a practical unit to describe an (applied) current relative to the involved amount of material. This unit is often found in electrochemistry to standardize test conditions and compare various scales of investigated materials. -- QUDT

AmperePerJoule
type: Class
comment: The inverse measure of joule-per-ampere or weber. The measure for the reciprical of magnetic flux. -- QUDT
subclass of: Restriction
  has value: 1e+00
subclass of: Restriction
  has value: 0e+00
alternative label: Ampere per Joule
qudtReference: http://qudt.org/vocab/unit/A-PER-J
ucumCode: A.J-1
ucumCode: A/J
unitSymbol: A/J
EMMO 967080e5 2f42 4eb2 a3a9 c58143e835f9: The inverse measure of joule-per-ampere or weber. The measure for the reciprical of magnetic flux. -- QUDT

AmperePerRadian
type: Class
comment: `Ampere per Radian` is a derived unit for measuring the amount of current per unit measure of angle, expressed in ampere per radian. -- QUDT
subclass of: Restriction
  has value: 1e+00
subclass of: Restriction
  has value: 0e+00
alternative label: Ampere per Radian
qudtReference: http://qudt.org/vocab/unit/A-PER-RAD
ucumCode: A.rad-1
ucumCode: A/rad
unitSymbol: A/rad
EMMO 967080e5 2f42 4eb2 a3a9 c58143e835f9: `Ampere per Radian` is a derived unit for measuring the amount of current per unit measure of angle, expressed in ampere per radian. -- QUDT

AmperePerSquareCentiMetre
type: Class
comment: SI base unit ampere divided by the 0.0001-fold of the power of the SI base unit metre by exponent 2 -- QUDT
subclass of: Restriction
  has value: 1e+04
subclass of: Restriction
  has value: 0e+00
alternative label: Ampere Per Square Centimetre
qudtReference: http://qudt.org/vocab/unit/A-PER-CentiM2
ucumCode: A.cm-2
ucumCode: A/cm2
unitSymbol: A/cm²
EMMO 967080e5 2f42 4eb2 a3a9 c58143e835f9: SI base unit ampere divided by the 0.0001-fold of the power of the SI base unit metre by exponent 2 -- QUDT

AmperePerSquareMetreSquareKelvin
type: Class
comment: Ampere per square metre and square Kelvin.
subclass of: Restriction
  has value: 1e+00
subclass of: Restriction
  has value: 0e+00
qudtReference: http://qudt.org/vocab/unit/A-PER-M2-K2
ucumCode: A.m-2.K-2
ucumCode: A/(m2.K2)
unitSymbol: A/m²⋅k²
EMMO 967080e5 2f42 4eb2 a3a9 c58143e835f9: Ampere per square metre and square Kelvin.

AmperePerSquareMilliMetre
type: Class
comment: SI base unit ampere divided by the 0.000 001-fold of the power of the SI base unit metre by exponent 2 -- QUDT
subclass of: Restriction
  has value: 1e+06
subclass of: Restriction
  has value: 0e+00
alternative label: Ampere Per Square Millimetre
qudtReference: http://qudt.org/vocab/unit/A-PER-MilliM2
ucumCode: A.mm-2
ucumCode: A/mm2
unitSymbol: A/mm²
EMMO 967080e5 2f42 4eb2 a3a9 c58143e835f9: SI base unit ampere divided by the 0.000 001-fold of the power of the SI base unit metre by exponent 2 -- QUDT

AmpereSecond
type: Class
comment: product out of the SI base unit ampere and the SI base unit second -- QUDT
subclass of: Restriction
  has value: 1e+00
subclass of: Restriction
  has value: 0e+00
alternative label: Ampere Second
qudtReference: http://qudt.org/vocab/unit/A-SEC
ucumCode: A.s
unitSymbol: A⋅s
EMMO 967080e5 2f42 4eb2 a3a9 c58143e835f9: product out of the SI base unit ampere and the SI base unit second -- QUDT

AmpereSquareMetre
type: Class
comment: The SI unit of electromagnetic moment. -- QUDT
subclass of: Restriction
  has value: 1e+00
subclass of: Restriction
  has value: 0e+00
alternative label: Ampere Square Metre
qudtReference: http://qudt.org/vocab/unit/A-M2
ucumCode: A.m2
unitSymbol: A⋅m²
EMMO 967080e5 2f42 4eb2 a3a9 c58143e835f9: The SI unit of electromagnetic moment. -- QUDT

AmpereSquareMetrePerJouleSecond
type: Class
comment: The SI unit of gyromagnetic ratio. -- QUDT
subclass of: Restriction
  has value: 0e+00
subclass of: Restriction
  has value: 1e+00
alternative label: Ampere Square Metre Per Joule Second
qudtReference: http://qudt.org/vocab/unit/A-M2-PER-J-SEC
ucumCode: A.m2.J-1.s-1
ucumCode: A.m2/(J.s)
unitSymbol: A⋅m²/(J⋅s)
EMMO 967080e5 2f42 4eb2 a3a9 c58143e835f9: The SI unit of gyromagnetic ratio. -- QUDT

AmpereTurn
type: Class
comment: The `ampere-turn` was the MKS unit of magnetomotive force (MMF), represented by a direct current of one ampere flowing in a single-turn loop in a vacuum. "Turns" refers to the winding number of an electrical conductor comprising an inductor. The ampere-turn was replaced by the SI unit, ampere. -- QUDT
alternative label: Ampere Turn
qudtReference: http://qudt.org/vocab/unit/AT
unitSymbol: AT
EMMO 967080e5 2f42 4eb2 a3a9 c58143e835f9: The `ampere-turn` was the MKS unit of magnetomotive force (MMF), represented by a direct current of one ampere flowing in a single-turn loop in a vacuum. "Turns" refers to the winding number of an electrical conductor comprising an inductor. The ampere-turn was replaced by the SI unit, ampere. -- QUDT

AmpereTurnPerInch
type: Class
comment: The `Ampere Turn per Inch` is a measure of magnetic field intensity and is eual to 12.5664 Oersted. -- QUDT
subclass of: Restriction
  has value: 0e+00
subclass of: Restriction
  has value: 3.937008e+01
alternative label: Ampere Turn per Inch
qudtReference: http://qudt.org/vocab/unit/AT-PER-IN
unitSymbol: At/in
EMMO 967080e5 2f42 4eb2 a3a9 c58143e835f9: The `Ampere Turn per Inch` is a measure of magnetic field intensity and is eual to 12.5664 Oersted. -- QUDT

AmpereTurnPerMetre
type: Class
comment: The `Ampere Turn per Metre` is the SI unit of magnetic field strength. One ampere per meter is equal to π/250 oersteds (12.566 371 millioersteds) in CGS units. The ampere per meter is also the SI unit of "magnetization" in the sense of magnetic dipole moment per unit volume; in this context 1 A/m = 0.001 emu per cubic centimeter. -- QUDT
alternative label: Ampere Turn per Metre
qudtReference: http://qudt.org/vocab/unit/AT-PER-M
unitSymbol: At/m
EMMO 967080e5 2f42 4eb2 a3a9 c58143e835f9: The `Ampere Turn per Metre` is the SI unit of magnetic field strength. One ampere per meter is equal to π/250 oersteds (12.566 371 millioersteds) in CGS units. The ampere per meter is also the SI unit of "magnetization" in the sense of magnetic dipole moment per unit volume; in this context 1 A/m = 0.001 emu per cubic centimeter. -- QUDT

Ångström
type: Class
comment: Measure of length defined as 1e-10 metres.
comment: The Angstr`o`m is an internationally recognized unit of length equal to 0.1 nanometre or 1 × 10⁻¹⁰ metres. Although accepted for use, it is not formally defined within the International System of Units(SI). The angstrom is often used in the natural sciences to express the sizes of atoms, lengths of chemical bonds and the wavelengths of electromagnetic radiation, and in technology for the dimensions of parts of integrated circuits. It is also commonly used in structural biology. -- QUDT
comment: Ångström is not mentioned in the SI system and deprecated by the International Bureau of Weights and Measures (BIPM). Dispite of that, it is often used in the natural sciences and technology.
subclass of: Restriction
  has value: 1e-10
subclass of: Restriction
  has value: 0e+00
subclass of: Restriction
  has value: Å
alternative label: Angstrom
unit code: A11
qudtReference: http://qudt.org/vocab/unit/ANGSTROM
ucumCode: Ao
dbpediaReference: http://dbpedia.org/page/%C3%85ngstr%C3%B6m
EMMO 70fe84ff 99b6 4206 a9fc 9a8931836d84: Measure of length defined as 1e-10 metres.
EMMO 967080e5 2f42 4eb2 a3a9 c58143e835f9: The Angstr`o`m is an internationally recognized unit of length equal to 0.1 nanometre or 1 × 10⁻¹⁰ metres. Although accepted for use, it is not formally defined within the International System of Units(SI). The angstrom is often used in the natural sciences to express the sizes of atoms, lengths of chemical bonds and the wavelengths of electromagnetic radiation, and in technology for the dimensions of parts of integrated circuits. It is also commonly used in structural biology. -- QUDT
wikipediaReference: https://en.wikipedia.org/wiki/Angstrom
iupacReference: https://doi.org/10.1351/goldbook.N00350

Arcminute
type: Class
comment: A minute of arc, arcminute, or minute arc (MOA), is a unit of angular measurement equal to one sixtieth (1/60) of one degree (circle/21,600), or π /10,800 radians. In turn, a second of arc or arcsecond is one sixtieth (1/60) of one minute of arc. Since one degree is defined as one three hundred and sixtieth (1/360) of a rotation, one minute of arc is 1/21,600 of a rotation. -- QUDT
subclass of: Restriction
  has value: ′
subclass of: Restriction
  has value: 2.908882e-04
subclass of: Restriction
  has value: 0e+00
alternative label: ArcMinute
alternative label: MinuteOfArc
unit code: D61
qudtReference: http://qudt.org/vocab/unit/ARCMIN
ucumCode: '
unitSymbol: '
EMMO 967080e5 2f42 4eb2 a3a9 c58143e835f9: A minute of arc, arcminute, or minute arc (MOA), is a unit of angular measurement equal to one sixtieth (1/60) of one degree (circle/21,600), or π /10,800 radians. In turn, a second of arc or arcsecond is one sixtieth (1/60) of one minute of arc. Since one degree is defined as one three hundred and sixtieth (1/360) of a rotation, one minute of arc is 1/21,600 of a rotation. -- QUDT
wikipediaReference: http://en.wikipedia.org/wiki/Minute_of_arc

Are
type: Class
comment: An 'are' is a unit of area equal to 0.02471 acre and 100 centare. -- QUDT
subclass of: Restriction
  has value: 1e+02
subclass of: Restriction
  has value: 0e+00
alternative label: are
qudtReference: http://qudt.org/vocab/unit/ARE
ucumCode: ar
unitSymbol: a
EMMO 967080e5 2f42 4eb2 a3a9 c58143e835f9: An 'are' is a unit of area equal to 0.02471 acre and 100 centare. -- QUDT

AssayTon
type: Class
comment: In the United States, a unit of mass, approximately 29.167 grams. The number of milligrams of precious metal in one assay ton of the ore being tested is equal to the number of troy ounces of pure precious metal in one 2000-pound ton of the ore. i.e. a bead is obtained that weights 3 milligrams, thus the precious metals in the bead would equal three troy ounces to each ton of ore with the understanding that this varies considerably in the real world as the amount of precious values in each ton of ore varies considerably. -- QUDT
subclass of: Restriction
  has value: 2.916667e-02
subclass of: Restriction
  has value: 0e+00
alternative label: Assay Ton
qudtReference: http://qudt.org/vocab/unit/TON_Assay
unitSymbol: AT
EMMO 967080e5 2f42 4eb2 a3a9 c58143e835f9: In the United States, a unit of mass, approximately 29.167 grams. The number of milligrams of precious metal in one assay ton of the ore being tested is equal to the number of troy ounces of pure precious metal in one 2000-pound ton of the ore. i.e. a bead is obtained that weights 3 milligrams, thus the precious metals in the bead would equal three troy ounces to each ton of ore with the understanding that this varies considerably in the real world as the amount of precious values in each ton of ore varies considerably. -- QUDT

AstronomicalUnit
type: Class
comment: An astronomical unit (abbreviated as AU, au, a.u., or ua) is a unit of length equal to 149,597,870,700 metres (92,955,807.273 mi) or approximately the mean Earth Sun distance. The symbol ua is recommended by the International Bureau of Weights and Measures, and the international standard ISO 80000, while au is recommended by the International Astronomical Union, and is more common in Anglosphere countries. In general, the International System of Units only uses capital letters for the symbols of units which are named after individual scientists, while au or a.u. can also mean atomic unit or even arbitrary unit. However, the use of AU to refer to the astronomical unit is widespread. The astronomical constant whose value is one astronomical unit is referred to as unit distance and is given the symbol A. [Wikipedia] -- QUDT
comment: One astronomical unit is defined as exactly 149597870700 m, which is roughly the distance from earth to sun.
subclass of: Restriction
  has value: 1.495979e+11
subclass of: Restriction
  has value: au
alternative label: astronomical-unit
unit code: A12
qudtReference: https://qudt.org/vocab/unit/AU
ucumCode: AU
dbpediaReference: http://dbpedia.org/page/Astronomical_unit
EMMO 70fe84ff 99b6 4206 a9fc 9a8931836d84: One astronomical unit is defined as exactly 149597870700 m, which is roughly the distance from earth to sun.
unitSymbol: AU
unitSymbol: au
EMMO 967080e5 2f42 4eb2 a3a9 c58143e835f9: An astronomical unit (abbreviated as AU, au, a.u., or ua) is a unit of length equal to 149,597,870,700 metres (92,955,807.273 mi) or approximately the mean Earth Sun distance. The symbol ua is recommended by the International Bureau of Weights and Measures, and the international standard ISO 80000, while au is recommended by the International Astronomical Union, and is more common in Anglosphere countries. In general, the International System of Units only uses capital letters for the symbols of units which are named after individual scientists, while au or a.u. can also mean atomic unit or even arbitrary unit. However, the use of AU to refer to the astronomical unit is widespread. The astronomical constant whose value is one astronomical unit is referred to as unit distance and is given the symbol A. [Wikipedia] -- QUDT
wikipediaReference: http://en.wikipedia.org/wiki/Astronomical_unit

AtmosphereCubicMeterPerMole
type: Class
comment: A unit that consists of the power of the SI base unit metre with the exponent 3 multiplied by the unit atmosphere divided by the SI base unit mol. -- QUDT
subclass of: Restriction
  has value: 0e+00
subclass of: Restriction
  has value: 1.01325e+05
alternative label: Atmosphere Cubic Meter per Mole
qudtReference: http://qudt.org/vocab/unit/ATM-M3-PER-MOL
unitSymbol: atm⋅m³/mol
EMMO 967080e5 2f42 4eb2 a3a9 c58143e835f9: A unit that consists of the power of the SI base unit metre with the exponent 3 multiplied by the unit atmosphere divided by the SI base unit mol. -- QUDT

MoleFraction
type: Class
comment: Number of one type of species divided by the number of all species.
subclass of: Restriction
  has value: 1e+00
subclass of: Restriction
  has value: 0e+00
alternative label: AtomFraction
alternative label: MolePerMole
alternative label: Moles per mole
qudtReference: http://qudt.org/vocab/unit/MOL-PER-MOL
ucumCode: mol.mol-1
unitSymbol: atom-fraction
unitSymbol: atom_fraction
unitSymbol: mol/mol
unitSymbol: mole-fraction
unitSymbol: mole_fraction
EMMO 967080e5 2f42 4eb2 a3a9 c58143e835f9: Number of one type of species divided by the number of all species.

AttoCoulomb
type: Class
comment: An AttoColomb is 10⁻¹⁸ C. -- QUDT
subclass of: Restriction
  has value: 0e+00
subclass of: Restriction
  some values from: Coulomb
subclass of: Restriction
  has value: 1e-18
qudtReference: http://qudt.org/vocab/unit/AttoC
ucumCode: aC
unitSymbol: aC
EMMO 967080e5 2f42 4eb2 a3a9 c58143e835f9: An AttoColomb is 10⁻¹⁸ C. -- QUDT

AttoFarad
type: Class
comment: 0,000 000 000 000 000 001-fold of the SI derived unit farad -- QUDT
subclass of: Restriction
  some values from: Farad
subclass of: Restriction
  has value: 0e+00
subclass of: Restriction
  has value: 1e-18
qudtReference: http://qudt.org/vocab/unit/AttoFARAD
ucumCode: aF
unitSymbol: aF
EMMO 967080e5 2f42 4eb2 a3a9 c58143e835f9: 0,000 000 000 000 000 001-fold of the SI derived unit farad -- QUDT

AttoJoule
type: Class
comment: 0,000 000 000 000 000 001-fold of the derived SI unit joule -- QUDT
subclass of: Restriction
  some values from: Joule
subclass of: Restriction
  has value: 1e-18
subclass of: Restriction
  has value: 0e+00
qudtReference: http://qudt.org/vocab/unit/AttoJ
ucumCode: aJ
unitSymbol: aJ
EMMO 967080e5 2f42 4eb2 a3a9 c58143e835f9: 0,000 000 000 000 000 001-fold of the derived SI unit joule -- QUDT

AttoJouleSecond
type: Class
comment: unit of the Planck's constant as product of the SI derived unit joule and the SI base unit second -- QUDT
subclass of: Restriction
  some values from: JouleSecond
subclass of: Restriction
  has value: 1e-18
subclass of: Restriction
  has value: 0e+00
alternative label: Attojoule Second
qudtReference: http://qudt.org/vocab/unit/AttoJ-SEC
ucumCode: aJ.s
unitSymbol: aJ⋅s
EMMO 967080e5 2f42 4eb2 a3a9 c58143e835f9: unit of the Planck's constant as product of the SI derived unit joule and the SI base unit second -- QUDT

Ban
type: Class
comment: A ban is a logarithmic unit which measures information or entropy, based on base 10 logarithms and powers of 10, rather than the powers of 2 and base 2 logarithms which define the bit. One ban is approximately 3.32 (log₂ 10) bits. -- QUDT
subclass of: Restriction
  has value: 2.302585e+00
subclass of: Restriction
  has value: 0e+00
subclass of: Restriction
  has value: Ban
qudtReference: http://qudt.org/vocab/unit/BAN
unitSymbol: ban
EMMO 967080e5 2f42 4eb2 a3a9 c58143e835f9: A ban is a logarithmic unit which measures information or entropy, based on base 10 logarithms and powers of 10, rather than the powers of 2 and base 2 logarithms which define the bit. One ban is approximately 3.32 (log₂ 10) bits. -- QUDT
wikipediaReference: http://en.wikipedia.org/wiki/Ban

Barad
type: Class
comment: A barad is a dyne per square centimetre (dyn · cm⁻²), and is equal to 0.1 Pa (1 micro bar, 0.000014504 p.s.i.). Note that this is precisely the microbar, the confusable bar being related in size to the normal atmospheric pressure, at 100 dyn · cm⁻². Accordingly barad was not abbreviated, so occurs prefixed as in cbarad = centibarad. Despite being the coherent unit for pressure in c.g.s., barad was probably much less common than the non-coherent bar. Barad is sometimes called barye, a name also used for bar. -- QUDT
subclass of: Restriction
  has value: 1e-01
subclass of: Restriction
  has value: 0e+00
qudtReference: http://qudt.org/vocab/unit/BARAD
unitSymbol: Ba
EMMO 967080e5 2f42 4eb2 a3a9 c58143e835f9: A barad is a dyne per square centimetre (dyn · cm⁻²), and is equal to 0.1 Pa (1 micro bar, 0.000014504 p.s.i.). Note that this is precisely the microbar, the confusable bar being related in size to the normal atmospheric pressure, at 100 dyn · cm⁻². Accordingly barad was not abbreviated, so occurs prefixed as in cbarad = centibarad. Despite being the coherent unit for pressure in c.g.s., barad was probably much less common than the non-coherent bar. Barad is sometimes called barye, a name also used for bar. -- QUDT

Barn
type: Class
comment: A barn (symbol b) is a unit of area. Originally used in nuclear physics for expressing the cross sectional area of nuclei and nuclear reactions, today it is used in all fields of high energy physics to express the cross sections of any scattering process, and is best understood as a measure of the probability of interaction between small particles. A barn is defined as 10⁻²⁸ m² (100 fm²) and is approximately the cross sectional area of a uranium nucleus. The barn is also the unit of area used in nuclear quadrupole resonance and nuclear magnetic resonance to quantify the interaction of a nucleus with an electric field gradient. While the barn is not an SI unit, it is accepted for use with the SI due to its continued use in particle physics. -- QUDT
subclass of: Restriction
  has value: 1e-28
subclass of: Restriction
  has value: 0e+00
qudtReference: http://qudt.org/vocab/unit/BARN
ucumCode: b
unitSymbol: b
EMMO 967080e5 2f42 4eb2 a3a9 c58143e835f9: A barn (symbol b) is a unit of area. Originally used in nuclear physics for expressing the cross sectional area of nuclei and nuclear reactions, today it is used in all fields of high energy physics to express the cross sections of any scattering process, and is best understood as a measure of the probability of interaction between small particles. A barn is defined as 10⁻²⁸ m² (100 fm²) and is approximately the cross sectional area of a uranium nucleus. The barn is also the unit of area used in nuclear quadrupole resonance and nuclear magnetic resonance to quantify the interaction of a nucleus with an electric field gradient. While the barn is not an SI unit, it is accepted for use with the SI due to its continued use in particle physics. -- QUDT
wikipediaReference: http://en.wikipedia.org/wiki/Barn_(unit)

Barrel
type: Class
comment: A barrel is one of several units of volume, with dry barrels, fluid barrels (UK beer barrel, U.S. beer barrel), oil barrel, etc. The volume of some barrel units is double others, with various volumes in the range of about 100-200 litres (22-44 imp gal; 26-53 US gal). -- QUDT
subclass of: Restriction
  has value: 1e+00
subclass of: Restriction
  has value: 0e+00
qudtReference: http://qudt.org/vocab/unit/BBL
ucumCode: [bbl_us]
unitSymbol: bbl
EMMO 967080e5 2f42 4eb2 a3a9 c58143e835f9: A barrel is one of several units of volume, with dry barrels, fluid barrels (UK beer barrel, U.S. beer barrel), oil barrel, etc. The volume of some barrel units is double others, with various volumes in the range of about 100-200 litres (22-44 imp gal; 26-53 US gal). -- QUDT
wikipediaReference: http://en.wikipedia.org/wiki/Barrel

Barye
type: Class
comment: The barye, or sometimes barad, barrie, bary, baryd, baryed, or barie, is the centimetre-gram-second (CGS) unit of pressure. It is equal to 1 dyne per square centimetre. -- QUDT
subclass of: Restriction
  has value: 1e-01
subclass of: Restriction
  has value: 0e+00
qudtReference: http://qudt.org/vocab/unit/BARYE
unitSymbol: Ba
EMMO 967080e5 2f42 4eb2 a3a9 c58143e835f9: The barye, or sometimes barad, barrie, bary, baryd, baryed, or barie, is the centimetre-gram-second (CGS) unit of pressure. It is equal to 1 dyne per square centimetre. -- QUDT
wikipediaReference: http://en.wikipedia.org/wiki/Barye

Bbl_Uk_Pet
type: Class
comment: unit of the volume for crude oil according to the Imperial system of units -- QUDT
subclass of: Restriction
  has value: 1.591132e-01
subclass of: Restriction
  has value: 0e+00
alternative label: Barrel (UK Petroleum)
qudtReference: http://qudt.org/vocab/unit/BBL_UK_PET
unitSymbol: bbl{UK petroleum}
EMMO 967080e5 2f42 4eb2 a3a9 c58143e835f9: unit of the volume for crude oil according to the Imperial system of units -- QUDT

Bbl_Uk_Pet_Per_Day
type: Class
comment: unit of the volume barrel (UK petroleum) for crude oil according to the Imperial system of units divided by the unit day -- QUDT
subclass of: Restriction
  has value: 0e+00
subclass of: Restriction
  has value: 1.841587e-06
alternative label: Barrel (UK Petroleum) Per Day
qudtReference: http://qudt.org/vocab/unit/BBL_UK_PET-PER-DAY
unitSymbol: bbl{UK petroleum}/day
EMMO 967080e5 2f42 4eb2 a3a9 c58143e835f9: unit of the volume barrel (UK petroleum) for crude oil according to the Imperial system of units divided by the unit day -- QUDT

Bbl_Uk_Pet_Per_Hr
type: Class
comment: unit of the volume barrel (UK petroleum) for crude oil according to the Imperial system of units divided by the unit hour -- QUDT
subclass of: Restriction
  has value: 4.41981e-05
subclass of: Restriction
  has value: 0e+00
alternative label: Barrel (UK Petroleum) Per Hour
qudtReference: http://qudt.org/vocab/unit/BBL_UK_PET-PER-HR
unitSymbol: bbl{UK petroleum}/hr
EMMO 967080e5 2f42 4eb2 a3a9 c58143e835f9: unit of the volume barrel (UK petroleum) for crude oil according to the Imperial system of units divided by the unit hour -- QUDT

Bbl_Uk_Pet_Per_Min
type: Class
comment: unit of the volume barrel (UK petroleum) for crude oil according to the Imperial system of units divided by the unit minute -- QUDT
subclass of: Restriction
  has value: 2.651886e-03
subclass of: Restriction
  has value: 0e+00
alternative label: Barrel (UK Petroleum) Per Minute
qudtReference: http://qudt.org/vocab/unit/BBL_UK_PET-PER-MIN
unitSymbol: bbl{UK petroleum}/min
EMMO 967080e5 2f42 4eb2 a3a9 c58143e835f9: unit of the volume barrel (UK petroleum) for crude oil according to the Imperial system of units divided by the unit minute -- QUDT

Bbl_Uk_Pet_Per_Sec
type: Class
comment: unit of the volume barrel (UK petroleum) for crude oil according to the Imperial system of units divided by the SI base unit second -- QUDT
subclass of: Restriction
  has value: 1.591132e-01
subclass of: Restriction
  has value: 0e+00
alternative label: Barrel (UK Petroleum) Per Second
qudtReference: http://qudt.org/vocab/unit/BBL_UK_PET-PER-SEC
unitSymbol: bbl{UK petroleum}
EMMO 967080e5 2f42 4eb2 a3a9 c58143e835f9: unit of the volume barrel (UK petroleum) for crude oil according to the Imperial system of units divided by the SI base unit second -- QUDT

Bbl_Us
type: Class
comment: unit of the volume for crude oil according to the Anglo-American system of units -- QUDT
subclass of: Restriction
  has value: 1.589873e-01
subclass of: Restriction
  has value: 0e+00
alternative label: Barrel (US)
qudtReference: http://qudt.org/vocab/unit/BBL_US
ucumCode: [bbl_us]
unitSymbol: bbl{US petroleum}
EMMO 967080e5 2f42 4eb2 a3a9 c58143e835f9: unit of the volume for crude oil according to the Anglo-American system of units -- QUDT

Bbl_Us_Dry
type: Class
comment: non SI-conform unit of the volume in the USA which applies to a resolution from 1912: 1 dry barrel (US) equals approximately to 115,63 litre -- QUDT
subclass of: Restriction
  has value: 0e+00
subclass of: Restriction
  has value: 1.156282e-01
alternative label: Dry Barrel (US)
qudtReference: http://qudt.org/vocab/unit/BBL_US_DRY
unitSymbol: bbl{US dry}
EMMO 967080e5 2f42 4eb2 a3a9 c58143e835f9: non SI-conform unit of the volume in the USA which applies to a resolution from 1912: 1 dry barrel (US) equals approximately to 115,63 litre -- QUDT

Bbl_Us_Per_Day
type: Class
comment: unit of the volume barrel (US petroleum) for crude oil according to the Anglo-American system of units divided by the unit day -- QUDT
subclass of: Restriction
  has value: 1.84e-06
subclass of: Restriction
  has value: 0e+00
alternative label: Barrel (US) Per Day
qudtReference: http://qudt.org/vocab/unit/BBL_US-PER-DAY
ucumCode: [bbl_us].d-1
ucumCode: [bbl_us]/d
unitSymbol: bsh{US petroleum}/day
EMMO 967080e5 2f42 4eb2 a3a9 c58143e835f9: unit of the volume barrel (US petroleum) for crude oil according to the Anglo-American system of units divided by the unit day -- QUDT

Bbl_Us_Per_Min
type: Class
comment: unit of the volume barrel (US petroleum) for crude oil according to the Anglo-American system of units divided by the unit minute -- QUDT
subclass of: Restriction
  has value: 2.6498e-03
subclass of: Restriction
  has value: 0e+00
alternative label: Barrel (US) Per Minute
qudtReference: http://qudt.org/vocab/unit/BBL_US-PER-MIN
ucumCode: [bbl_us].min-1
ucumCode: [bbl_us]/min
unitSymbol: bbl{US petroleum}/min
EMMO 967080e5 2f42 4eb2 a3a9 c58143e835f9: unit of the volume barrel (US petroleum) for crude oil according to the Anglo-American system of units divided by the unit minute -- QUDT

Bbl_Us_Pet_Per_Hr
type: Class
comment: unit of the volume barrel (US petroleum) for crude oil according to the Anglo-American system of units divided by the unit hour -- QUDT
subclass of: Restriction
  has value: 4.4163e-05
subclass of: Restriction
  has value: 0e+00
alternative label: Barrel (US Petroleum) Per Hour
qudtReference: http://qudt.org/vocab/unit/BBL_US_PET-PER-HR
ucumCode: [bbl_us].h-1
ucumCode: [bbl_us]/h
unitSymbol: bbl{UK petroleum}/hr
EMMO 967080e5 2f42 4eb2 a3a9 c58143e835f9: unit of the volume barrel (US petroleum) for crude oil according to the Anglo-American system of units divided by the unit hour -- QUDT

Bbl_Us_Pet_Per_Sec
type: Class
comment: unit of the volume barrel (US petroleum) for crude oil according to the Anglo-American system of units divided by the SI base unit second -- QUDT
subclass of: Restriction
  has value: 1.589873e-01
subclass of: Restriction
  has value: 0e+00
alternative label: Barrel (US Petroleum) Per Second
qudtReference: http://qudt.org/vocab/unit/BBL_US_PET-PER-SEC
ucumCode: [bbl_us].s-1
ucumCode: [bbl_us]/s
unitSymbol: bbl{UK petroleum}/s
EMMO 967080e5 2f42 4eb2 a3a9 c58143e835f9: unit of the volume barrel (US petroleum) for crude oil according to the Anglo-American system of units divided by the SI base unit second -- QUDT

Beaufort
type: Class
comment: unit for classification of winds according to their speed, developed by Sir Francis Beaufort as measure for the over-all behaviour of a ship's sail at different wind speeds -- QUDT
subclass of: Restriction
  has value: 1e+00
subclass of: Restriction
  has value: 0e+00
qudtReference: http://qudt.org/vocab/unit/BFT
unitSymbol: Beufort
EMMO 967080e5 2f42 4eb2 a3a9 c58143e835f9: unit for classification of winds according to their speed, developed by Sir Francis Beaufort as measure for the over-all behaviour of a ship's sail at different wind speeds -- QUDT

BecquerelPerCubicMetre
type: Class
comment: The SI derived unit of unit in the category of Radioactivity concentration. -- QUDT
subclass of: Restriction
  has value: 1e+00
subclass of: Restriction
  has value: 0e+00
alternative label: Becquerel per Cubic Metre
qudtReference: http://qudt.org/vocab/unit/BQ-PER-M3
ucumCode: Bq.m-3
ucumCode: Bq/m3
unitSymbol: Bq/m³
EMMO 967080e5 2f42 4eb2 a3a9 c58143e835f9: The SI derived unit of unit in the category of Radioactivity concentration. -- QUDT

BecquerelPerSquareMetre
type: Class
comment: Becquerel per square metre.
subclass of: Restriction
  has value: 0e+00
subclass of: Restriction
  has value: 1e+00
qudtReference: http://qudt.org/vocab/unit/BQ-PER-M2
ucumCode: Bq.m-2
ucumCode: Bq/m2
unitSymbol: Bq/m²
EMMO 967080e5 2f42 4eb2 a3a9 c58143e835f9: Becquerel per square metre.

BecquerelSecondPerCubicMetre
type: Class
comment: Becquerels second per cubic metre.
subclass of: Restriction
  has value: 1e+00
subclass of: Restriction
  has value: 0e+00
qudtReference: http://qudt.org/vocab/unit/BQ-SEC-PER-M3
ucumCode: Bq.s.m-3
unitSymbol: Bq⋅s/m³
EMMO 967080e5 2f42 4eb2 a3a9 c58143e835f9: Becquerels second per cubic metre.

Biot
type: Class
comment: "Biot" is another name for the abampere (aA), which is the basic electromagnetic unit of electric current in the emu-cgs (centimeter-gram-second) system of units. It is called after a French physicist, astronomer, and mathematician Jean-Baptiste Biot. One abampere is equal to ten amperes in the SI system of units. One abampere is the current, which produces a force of 2 dyne/cm between two infinitively long parallel wires that are 1 cm apart. -- QUDT
subclass of: Restriction
  has value: 0e+00
subclass of: Restriction
  has value: 1e+01
qudtReference: http://qudt.org/vocab/unit/BIOT
ucumCode: Bi
unitSymbol: Bi
EMMO 967080e5 2f42 4eb2 a3a9 c58143e835f9: "Biot" is another name for the abampere (aA), which is the basic electromagnetic unit of electric current in the emu-cgs (centimeter-gram-second) system of units. It is called after a French physicist, astronomer, and mathematician Jean-Baptiste Biot. One abampere is equal to ten amperes in the SI system of units. One abampere is the current, which produces a force of 2 dyne/cm between two infinitively long parallel wires that are 1 cm apart. -- QUDT
wikipediaReference: http://en.wikipedia.org/wiki/Biot

Bit
type: Class
comment: A bit (binary digit) is the smallest unit of data that a computer can process and store. A bit is always in one of two physical states, similar to an on/off light switch. The state is represented by a single binary value, usually a 0 or 1. -- Wikipedia
subclass of: Restriction
  has value: 1e+00
subclass of: Restriction
  has value: 0e+00
qudtReference: http://qudt.org/vocab/unit/BIT
ucumCode: bit
unitSymbol: b
EMMO 967080e5 2f42 4eb2 a3a9 c58143e835f9: A bit (binary digit) is the smallest unit of data that a computer can process and store. A bit is always in one of two physical states, similar to an on/off light switch. The state is represented by a single binary value, usually a 0 or 1. -- Wikipedia
EMMO c7b62dd7 063a 4c2a 8504 42f7264ba83f: In information theory, a bit is the amount of information that, on average, can be stored in a discrete bit. It is thus the amount of information carried by a choice between two equally likely outcomes. One bit corresponds to about 0.693 nats (ln(2)), or 0.301 hartleys (log10(2)). -- QUDT
wikipediaReference: http://en.wikipedia.org/wiki/Bit

BoardFoot
type: Class
comment: The board-foot is a specialized unit of measure for the volume of lumber in the United States and Canada. It is the volume of a one-foot length of a board one foot wide and one inch thick. Board-foot can be abbreviated FBM (for 'foot, board measure'), BDFT, or BF. Thousand board-feet can be abbreviated as MFBM, MBFT or MBF. -- QUDT
subclass of: Restriction
  has value: 2.36e-03
subclass of: Restriction
  has value: 0e+00
alternative label: Board Foot
qudtReference: http://qudt.org/vocab/unit/FBM
ucumCode: [bf_i]
unitSymbol: BDFT
EMMO 967080e5 2f42 4eb2 a3a9 c58143e835f9: The board-foot is a specialized unit of measure for the volume of lumber in the United States and Canada. It is the volume of a one-foot length of a board one foot wide and one inch thick. Board-foot can be abbreviated FBM (for 'foot, board measure'), BDFT, or BF. Thousand board-feet can be abbreviated as MFBM, MBFT or MBF. -- QUDT

BoilerHorsepower
type: Class
comment: "Boiler Horsepower" is a unit for 'Power' expressed as hp_boiler. -- QUDT
subclass of: Restriction
  has value: 0e+00
subclass of: Restriction
  has value: 9.8095e+03
alternative label: Boiler Horsepower
qudtReference: http://qudt.org/vocab/unit/HP_Boiler
unitSymbol: HP{boiler}
EMMO 967080e5 2f42 4eb2 a3a9 c58143e835f9: "Boiler Horsepower" is a unit for 'Power' expressed as hp_boiler. -- QUDT

BreathPerMinute
type: Class
comment: A unit of respiratory rate. -- QUDT
alternative label: Breath per Minute
qudtReference: http://qudt.org/vocab/unit/BREATH-PER-MIN
ucumCode: /min{breath}
ucumCode: min-1{breath}
unitSymbol: breath/min
EMMO 967080e5 2f42 4eb2 a3a9 c58143e835f9: A unit of respiratory rate. -- QUDT

BtuFoot
type: Class
comment: BTU Foot is an Imperial unit for `Thermal Energy Length` expressed as Btu-ft. -- QUDT
subclass of: Restriction
  has value: 3.21581e+02
subclass of: Restriction
  has value: 0e+00
alternative label: BTU Foot
qudtReference: http://qudt.org/vocab/unit/BTU_IT-FT
ucumCode: [Btu_IT].[ft_i]
unitSymbol: Btu⋅ft
EMMO 967080e5 2f42 4eb2 a3a9 c58143e835f9: BTU Foot is an Imperial unit for `Thermal Energy Length` expressed as Btu-ft. -- QUDT

BtuInch
type: Class
comment: BTU Inch is an Imperial unit for 'Thermal Energy Length' expressed as Btu-in. -- QUDT
subclass of: Restriction
  has value: 0e+00
subclass of: Restriction
  has value: 2.679842e+01
alternative label: BTU Inch
qudtReference: http://qudt.org/vocab/unit/BTU_IT-IN
ucumCode: [Btu_IT].[in_i]
unitSymbol: Btu⋅in
EMMO 967080e5 2f42 4eb2 a3a9 c58143e835f9: BTU Inch is an Imperial unit for 'Thermal Energy Length' expressed as Btu-in. -- QUDT

BtuPerDegreeRankine
type: Class
comment: 'BTU per Degree Rankine' is an Imperial unit for 'Heat Capacity' expressed as Btu/degR. -- QUDT
subclass of: Restriction
  has value: 1.899101e+03
subclass of: Restriction
  has value: 0e+00
alternative label: BTU per Degree Rankine
qudtReference: http://qudt.org/vocab/unit/BTU_IT-PER-DEG_R
ucumCode: [Btu_IT].[degR]-1
ucumCode: [Btu_IT]/[degR]
unitSymbol: Btu{IT}/°R
EMMO 967080e5 2f42 4eb2 a3a9 c58143e835f9: 'BTU per Degree Rankine' is an Imperial unit for 'Heat Capacity' expressed as Btu/degR. -- QUDT

BtuPerHour
type: Class
comment: The British thermal unit (BTU or Btu) is a traditional unit of energy equal to about 1 055.05585 joules. It is approximately the amount of energy needed to heat 1 pound (0.454 kg) of water from 39°F (3.9°C) to 40°F (4.4°C). The unit is most often used in the power, steam generation, heating and air conditioning industries. In scientific contexts the BTU has largely been replaced by the SI unit of energy, the joule, though it may be used as a measure of agricultural energy production (BTU/kg). -- QUDT
subclass of: Restriction
  has value: 0e+00
subclass of: Restriction
  has value: 2.930711e-01
alternative label: BTU per Hour
qudtReference: http://qudt.org/vocab/unit/BTU_IT-PER-HR
ucumCode: [Btu_IT].h-1
ucumCode: [Btu_IT]/h
unitSymbol: Btu{IT}/hr
EMMO 967080e5 2f42 4eb2 a3a9 c58143e835f9: The British thermal unit (BTU or Btu) is a traditional unit of energy equal to about 1 055.05585 joules. It is approximately the amount of energy needed to heat 1 pound (0.454 kg) of water from 39°F (3.9°C) to 40°F (4.4°C). The unit is most often used in the power, steam generation, heating and air conditioning industries. In scientific contexts the BTU has largely been replaced by the SI unit of energy, the joule, though it may be used as a measure of agricultural energy production (BTU/kg). -- QUDT

BtuPerHourSquareFoot
type: Class
comment: `BTU per Hour Square Foot` is an Imperial unit for 'Power Per Area' expressed as Btu/(hr-ft²). -- QUDT
subclass of: Restriction
  has value: 3.154591e+00
subclass of: Restriction
  has value: 0e+00
alternative label: BTU per Hour Square Foot
qudtReference: http://qudt.org/vocab/unit/BTU_IT-PER-HR-FT2
ucumCode: [Btu_IT].h-1.[ft_i]-2
ucumCode: [Btu_IT]/(h.[ft_i]2)
unitSymbol: Btu{IT}/(hr⋅ft²)
EMMO 967080e5 2f42 4eb2 a3a9 c58143e835f9: `BTU per Hour Square Foot` is an Imperial unit for 'Power Per Area' expressed as Btu/(hr-ft²). -- QUDT

BtuPerPoundDegreeFahrenheit
type: Class
comment: British Thermal Unit (therm.) Per Pound Per Fahrenheit Degree (Btu (therm.)/lb- degF) is a unit in the category of Specific heat. This unit is commonly used in the UK unit system. British Thermal Unit (therm.) Per Pound Per Fahrenheit Degree (Btu (therm.)/lb-degF) has a dimension of L2T⁻²Q⁻¹ where L is length, T is time, and Q is temperature. It can be converted to the corresponding standard SI unit J/kg-K by multiplying its value by a factor of 4183.99895. -- QUDT
alternative label: BTU per Pound Degree Fahrenheit
qudtReference: http://qudt.org/vocab/unit/BTU_IT-PER-LB-DEG_F
ucumCode: [Btu_IT].[lb_av]-1.[degF]-1
ucumCode: [Btu_IT]/([lb_av].[degF])
unitSymbol: Btu{IT}/(lb⋅°F)
EMMO 967080e5 2f42 4eb2 a3a9 c58143e835f9: British Thermal Unit (therm.) Per Pound Per Fahrenheit Degree (Btu (therm.)/lb- degF) is a unit in the category of Specific heat. This unit is commonly used in the UK unit system. British Thermal Unit (therm.) Per Pound Per Fahrenheit Degree (Btu (therm.)/lb-degF) has a dimension of L2T⁻²Q⁻¹ where L is length, T is time, and Q is temperature. It can be converted to the corresponding standard SI unit J/kg-K by multiplying its value by a factor of 4183.99895. -- QUDT

BtuPerPoundDegreeRankine
type: Class
comment: 'BTU per Pound Degree Rankine' is a unit for 'Specific Heat Capacity' expressed as Btu/(lb-degR). -- QUDT
alternative label: BTU per Pound Degree Rankine
qudtReference: http://qudt.org/vocab/unit/BTU_IT-PER-LB-DEG_R
ucumCode: [Btu_IT].[lb_av]-1.[degR]-1
ucumCode: [Btu_IT]/([lb_av].[degR])
unitSymbol: Btu{IT}/(lb⋅°R)
EMMO 967080e5 2f42 4eb2 a3a9 c58143e835f9: 'BTU per Pound Degree Rankine' is a unit for 'Specific Heat Capacity' expressed as Btu/(lb-degR). -- QUDT

BtuPerPoundMole
type: Class
comment: 'BTU per Pound Mole' is an Imperial unit for 'Energy And Work Per Mass Amount Of Substance' expressed as Btu/(lb-mol). -- QUDT
alternative label: BTU per Pound Mole
qudtReference: http://qudt.org/vocab/unit/BTU_IT-PER-LB-MOL
ucumCode: [Btu_IT].[lb_av]-1.mol-1
ucumCode: [Btu_IT]/([lb_av].mol)
unitSymbol: Btu{IT}/(lb⋅mol)
EMMO 967080e5 2f42 4eb2 a3a9 c58143e835f9: 'BTU per Pound Mole' is an Imperial unit for 'Energy And Work Per Mass Amount Of Substance' expressed as Btu/(lb-mol). -- QUDT

BtuPerPoundMoleDegreeFahrenheit
type: Class
comment: 'BTU per Pound Mole Degree Fahrenheit' is an Imperial unit for 'Molar Heat Capacity' expressed as Btu/(lb-mol-degF). -- QUDT
alternative label: BTU per Pound Mole Degree Fahrenheit
qudtReference: http://qudt.org/vocab/unit/BTU_IT-PER-MOL-DEG_F
ucumCode: [Btu_IT].mol-1.[degF]-1
ucumCode: [Btu_IT]/(mol.[degF])
unitSymbol: Btu{IT}/(lb⋅mol⋅°F)
EMMO 967080e5 2f42 4eb2 a3a9 c58143e835f9: 'BTU per Pound Mole Degree Fahrenheit' is an Imperial unit for 'Molar Heat Capacity' expressed as Btu/(lb-mol-degF). -- QUDT

BtuPerSecond
type: Class
comment: 'BTU per Second' is an Imperial unit for 'Heat Flow Rate' expressed as Btu/s. -- QUDT
subclass of: Restriction
  has value: 1.055056e+03
subclass of: Restriction
  has value: 0e+00
alternative label: BTU per Second
qudtReference: http://qudt.org/vocab/unit/BTU_IT-PER-SEC
ucumCode: [Btu_IT].s-1
ucumCode: [Btu_IT]/s
unitSymbol: Btu{IT}/s
EMMO 967080e5 2f42 4eb2 a3a9 c58143e835f9: 'BTU per Second' is an Imperial unit for 'Heat Flow Rate' expressed as Btu/s. -- QUDT

BtuPerSecondSquareFoot
type: Class
comment: `BTU per Second Square Foot` is an Imperial unit for 'Power Per Area' expressed as Btu/(s· ft²). -- QUDT
subclass of: Restriction
  has value: 1.135653e+04
subclass of: Restriction
  has value: 0e+00
alternative label: BTU per Second Square Foot
qudtReference: http://qudt.org/vocab/unit/BTU_IT-PER-SEC-FT2
ucumCode: [Btu_IT].s-1.[ft_i]-2
ucumCode: [Btu_IT]/(s.[ft_i]2)
unitSymbol: Btu{IT}/(s⋅ft²)
EMMO 967080e5 2f42 4eb2 a3a9 c58143e835f9: `BTU per Second Square Foot` is an Imperial unit for 'Power Per Area' expressed as Btu/(s· ft²). -- QUDT

BtuPerSquareFoot
type: Class
comment: `BTU per Square Foot` is an Imperial unit for 'Energy Per Area' expressed as Btu/ft². -- QUDT
subclass of: Restriction
  has value: 1.135653e+04
subclass of: Restriction
  has value: 0e+00
alternative label: BTU per Square Foot
qudtReference: http://qudt.org/vocab/unit/BTU_IT-PER-FT2
ucumCode: [Btu_IT].[ft_i]-2
ucumCode: [Btu_IT]/[ft_i]2
unitSymbol: Btu{IT}/ft²
EMMO 967080e5 2f42 4eb2 a3a9 c58143e835f9: `BTU per Square Foot` is an Imperial unit for 'Energy Per Area' expressed as Btu/ft². -- QUDT

BtuPerSquareFootHourDegreeFahrenheit
type: Class
comment: 'BTU per Square Foot Hour Degree Fahrenheit' is an Imperial unit for 'Coefficient Of Heat Transfer' expressed as Btu/(hr-ft²-degF). -- QUDT
alternative label: BTU per Square Foot Hour Degree Fahrenheit
qudtReference: http://qudt.org/vocab/unit/BTU_IT-PER-FT2-HR-DEG_F
ucumCode: [Btu_IT].[ft_i]-2.h-1.[degF]-1
ucumCode: [Btu_IT]/([ft_i]2.h.[degF])
unitSymbol: Btu{IT}/(hr⋅ft²⋅°F)
EMMO 967080e5 2f42 4eb2 a3a9 c58143e835f9: 'BTU per Square Foot Hour Degree Fahrenheit' is an Imperial unit for 'Coefficient Of Heat Transfer' expressed as Btu/(hr-ft²-degF). -- QUDT

BtuPerSquareFootSecondDegreeFahrenheit
type: Class
comment: 'BTU per Square Foot Second Degree Fahrenheit' is an Imperial unit for 'Coefficient Of Heat Transfer' expressed as Btu/(ft²-s-degF). -- QUDT
alternative label: BTU per Square Foot Second Degree Fahrenheit
qudtReference: http://qudt.org/vocab/unit/BTU_IT-PER-FT2-SEC-DEG_F
ucumCode: [Btu_IT].[ft_i]-2.s-1.[degF]-1
ucumCode: [Btu_IT]/([ft_i]2.s.[degF])
unitSymbol: Btu{IT}/(ft²⋅s⋅°F)
EMMO 967080e5 2f42 4eb2 a3a9 c58143e835f9: 'BTU per Square Foot Second Degree Fahrenheit' is an Imperial unit for 'Coefficient Of Heat Transfer' expressed as Btu/(ft²-s-degF). -- QUDT

Btu_It_Ft_Per_Ft2_Hr_Deg_F
type: Class
comment: British thermal unit (international table) foot per hour Square foot degree Fahrenheit is the unit of the thermal conductivity according to the Imperial system of units. -- QUDT
subclass of: Restriction
  has value: 1.730735e+00
subclass of: Restriction
  has value: 0e+00
alternative label: BTU (IT) Foot per Square Foot Hour Degree Fahrenheit
qudtReference: http://qudt.org/vocab/unit/BTU_IT-FT-PER-FT2-HR-DEG_F
ucumCode: [Btu_IT].[ft_i].[ft_i]-2.h-1.[degF]-1
ucumCode: [Btu_IT].[ft_i]/([ft_i]2.h.[degF])
unitSymbol: Btu{IT}⋅ft/(ft²⋅hr⋅°F)
EMMO 967080e5 2f42 4eb2 a3a9 c58143e835f9: British thermal unit (international table) foot per hour Square foot degree Fahrenheit is the unit of the thermal conductivity according to the Imperial system of units. -- QUDT
wikipediaReference: http://en.wikipedia.org/wiki/Thermal_conductivity

Btu_It_In_Per_Ft2_Hr_Deg_F
type: Class
comment: BTU (th) Inch per Square Foot Hour Degree Fahrenheit is an Imperial unit for 'Thermal Conductivity', an International British thermal unit inch per second per square foot per degree Fahrenheit is a unit of thermal conductivity in the US Customary Units and British Imperial Units. -- QUDT
subclass of: Restriction
  has value: 1.442279e-01
subclass of: Restriction
  has value: 0e+00
alternative label: British Thermal Unit (international Table) Inch Per Hour Square Foot Degree Fahrenheit
qudtReference: http://qudt.org/vocab/unit/BTU_IT-IN-PER-FT2-HR-DEG_F
ucumCode: [Btu_IT].[in_i].[ft_i]-2.h-1.[degF]-1
ucumCode: [Btu_IT].[in_i]/([ft_i]2.h.[degF])
unitSymbol: Btu{IT}⋅in/(ft²⋅hr⋅°F)
EMMO 967080e5 2f42 4eb2 a3a9 c58143e835f9: BTU (th) Inch per Square Foot Hour Degree Fahrenheit is an Imperial unit for 'Thermal Conductivity', an International British thermal unit inch per second per square foot per degree Fahrenheit is a unit of thermal conductivity in the US Customary Units and British Imperial Units. -- QUDT

Btu_It_In_Per_Ft2_Sec_Deg_F
type: Class
comment: British thermal unit (international table) inch per second Square foot degree Fahrenheit is the unit of the thermal conductivity according to the Imperial system of units. -- QUDT
subclass of: Restriction
  has value: 5.192204e+02
subclass of: Restriction
  has value: 0e+00
alternative label: BTU (IT) Inch per Square Foot Second Degree Fahrenheit
qudtReference: http://qudt.org/vocab/unit/BTU_IT-IN-PER-FT2-SEC-DEG_F
ucumCode: [Btu_IT].[in_i].[ft_i]-2.s-1.[degF]-1
ucumCode: [Btu_IT].[in_i]/([ft_i]2.s.[degF])
unitSymbol: Btu{IT}⋅in/(ft²⋅s⋅°F)
EMMO 967080e5 2f42 4eb2 a3a9 c58143e835f9: British thermal unit (international table) inch per second Square foot degree Fahrenheit is the unit of the thermal conductivity according to the Imperial system of units. -- QUDT

Btu_It_In_Per_Hr_Ft2_Deg_F
type: Class
comment: unit of the thermal conductivity according to the Imperial system of units -- QUDT
subclass of: Restriction
  has value: 1.442279e-01
subclass of: Restriction
  has value: 0e+00
alternative label: British Thermal Unit (international Table) Inch Per Hour Square Foot degree Fahrenheit
qudtReference: http://qudt.org/vocab/unit/BTU_IT-IN-PER-HR-FT2-DEG_F
ucumCode: [Btu_IT].[in_i].h-1.[ft_i]-2.[degF]-1
ucumCode: [Btu_IT].[in_i]/(h.[ft_i]2.[degF])
unitSymbol: Btu{IT}⋅in/(hr⋅ft²⋅°F)
EMMO 967080e5 2f42 4eb2 a3a9 c58143e835f9: unit of the thermal conductivity according to the Imperial system of units -- QUDT

Btu_It_In_Per_Sec_Ft2_Deg_F
type: Class
comment: unit of the thermal conductivity according to the Imperial system of units -- QUDT
subclass of: Restriction
  has value: 5.192204e+02
subclass of: Restriction
  has value: 0e+00
alternative label: British Thermal Unit (international Table) Inch Per Second Square Foot degree Fahrenheit
qudtReference: http://qudt.org/vocab/unit/BTU_IT-IN-PER-SEC-FT2-DEG_F
ucumCode: [Btu_IT].[in_i].s-1.[ft_i]-2.[degF]-1
ucumCode: [Btu_IT].[in_i]/(s.[ft_i]2.[degF])
unitSymbol: Btu{IT}⋅in/(s⋅ft²⋅°F)
EMMO 967080e5 2f42 4eb2 a3a9 c58143e835f9: unit of the thermal conductivity according to the Imperial system of units -- QUDT

Btu_It_Per_Deg_F
type: Class
comment: British Thermal Unit (IT) Per Fahrenheit Degree (Btu (IT)/°F) is a measure of heat capacity. It can be converted to the corresponding standard SI unit J/K by multiplying its value by a factor of 1899.10534. -- QUDT
subclass of: Restriction
  has value: 1.899101e+03
subclass of: Restriction
  has value: 0e+00
alternative label: BTU (IT) per Degree Fahrenheit
qudtReference: http://qudt.org/vocab/unit/BTU_IT-PER-DEG_F
ucumCode: [Btu_IT].[degF]-1
ucumCode: [Btu_IT]/[degF]
unitSymbol: Btu{IT}/°F
EMMO 967080e5 2f42 4eb2 a3a9 c58143e835f9: British Thermal Unit (IT) Per Fahrenheit Degree (Btu (IT)/°F) is a measure of heat capacity. It can be converted to the corresponding standard SI unit J/K by multiplying its value by a factor of 1899.10534. -- QUDT

Btu_It_Per_Ft3
type: Class
comment: `British Thermal Unit (IT) Per Cubic Foot` (Btu (IT)/ft³) is a unit in the category of Energy density. It is also known as Btu per cubic foot, Btu/cubic foot. This unit is commonly used in the UK, US unit systems. It has a dimension of ML⁻¹T⁻² where M is mass, L is length, and T is time. It can be converted to the corresponding standard SI unit J/m³ by multiplying its value by a factor of 37258.94579. -- QUDT
subclass of: Restriction
  has value: 3.725895e+04
subclass of: Restriction
  has value: 0e+00
alternative label: British Thermal Unit (IT) Per Cubic Foot
qudtReference: http://qudt.org/vocab/unit/BTU_IT-PER-FT3
ucumCode: [Btu_IT].[ft_i]-3
ucumCode: [Btu_IT]/[ft_i]3
unitSymbol: Btu{IT}/ft³
EMMO 967080e5 2f42 4eb2 a3a9 c58143e835f9: `British Thermal Unit (IT) Per Cubic Foot` (Btu (IT)/ft³) is a unit in the category of Energy density. It is also known as Btu per cubic foot, Btu/cubic foot. This unit is commonly used in the UK, US unit systems. It has a dimension of ML⁻¹T⁻² where M is mass, L is length, and T is time. It can be converted to the corresponding standard SI unit J/m³ by multiplying its value by a factor of 37258.94579. -- QUDT

Btu_It_Per_Hr_Ft2_Deg_R
type: Class
comment: unit of the heat transfer coefficient according to the Imperial system of units -- QUDT
subclass of: Restriction
  has value: 5.55556e-01
subclass of: Restriction
  has value: 0e+00
alternative label: British Thermal Unit (international Table) Per Hour Square Foot degree Rankine
qudtReference: http://qudt.org/vocab/unit/BTU_IT-PER-HR-FT2-DEG_R
ucumCode: [Btu_IT].h-1.[ft_i]-2.[degR]-1
ucumCode: [Btu_IT]/(h.[ft_i]2.[degR])
unitSymbol: Btu{IT}/(hr⋅ft²⋅°R)
EMMO 967080e5 2f42 4eb2 a3a9 c58143e835f9: unit of the heat transfer coefficient according to the Imperial system of units -- QUDT

Btu_It_Per_Lb
type: Class
comment: The amount of energy generated by a pound of substance is measured in British thermal units (IT) per pound of mass. 1 Btu_{IT}/lb is equivalent to 2.326 × 10³ joule per kilogram (J/kg). -- QUDT
subclass of: Restriction
  has value: 2.326e+03
subclass of: Restriction
  has value: 0e+00
alternative label: BTU-IT-PER-lb
qudtReference: http://qudt.org/vocab/unit/BTU_IT-PER-LB
ucumCode: [Btu_IT].[lb_av]-1
ucumCode: [Btu_IT]/[lb_av]
unitSymbol: Btu{IT}/lb
EMMO 967080e5 2f42 4eb2 a3a9 c58143e835f9: The amount of energy generated by a pound of substance is measured in British thermal units (IT) per pound of mass. 1 Btu_{IT}/lb is equivalent to 2.326 × 10³ joule per kilogram (J/kg). -- QUDT

Btu_It_Per_Lb_F
type: Class
comment: unit of the heat energy according to the Imperial system of units divided by the unit avoirdupois pound of force according to the avoirdupois system of units -- QUDT
subclass of: Restriction
  has value: 2.37186e+02
subclass of: Restriction
  has value: 0e+00
alternative label: British Thermal Unit (international Table) Per Pound of Force
qudtReference: http://qudt.org/vocab/unit/BTU_IT-PER-LB_F
ucumCode: [Btu_IT].[lbf_av]-1
ucumCode: [Btu_IT]/[lbf_av]
unitSymbol: Btu{IT}/lbf
EMMO 967080e5 2f42 4eb2 a3a9 c58143e835f9: unit of the heat energy according to the Imperial system of units divided by the unit avoirdupois pound of force according to the avoirdupois system of units -- QUDT

Btu_It_Per_Lb_F_Deg_F
type: Class
comment: unit of the heat energy according to the Imperial system of units divided by the product of the units avoirdupois pound according to the avoirdupois system of units and degree Fahrenheit -- QUDT
subclass of: Restriction
  has value: 4.1868e+03
subclass of: Restriction
  has value: 0e+00
alternative label: British Thermal Unit (international Table) Per Pound Degree Fahrenheit
qudtReference: http://qudt.org/vocab/unit/BTU_IT-PER-LB_F-DEG_F
ucumCode: [Btu_IT].[lbf_av]-1.[degF]-1
ucumCode: [Btu_IT]/([lbf_av].[degF])
unitSymbol: Btu{IT}/(lbf⋅°F)
EMMO 967080e5 2f42 4eb2 a3a9 c58143e835f9: unit of the heat energy according to the Imperial system of units divided by the product of the units avoirdupois pound according to the avoirdupois system of units and degree Fahrenheit -- QUDT

Btu_It_Per_Lb_F_Deg_R
type: Class
comment: unit of the heat capacity as British thermal unit according to the international table related to degree Rankine according to the Imperial system of units divided by the unit avoirdupois pound according to the avoirdupois system of units -- QUDT
subclass of: Restriction
  has value: 4.269e+02
subclass of: Restriction
  has value: 0e+00
alternative label: British Thermal Unit (international Table) Per Pound Degree Rankine
qudtReference: http://qudt.org/vocab/unit/BTU_IT-PER-LB_F-DEG_R
ucumCode: [Btu_IT].[lbf_av]-1.[degR]-1
ucumCode: [Btu_IT]/([lbf_av].[degR])
unitSymbol: Btu{IT}/(lbf⋅°R)
EMMO 967080e5 2f42 4eb2 a3a9 c58143e835f9: unit of the heat capacity as British thermal unit according to the international table related to degree Rankine according to the Imperial system of units divided by the unit avoirdupois pound according to the avoirdupois system of units -- QUDT

Btu_It_Per_Min
type: Class
comment: unit of the heat energy according to the Imperial system of units divided by the unit minute -- QUDT
subclass of: Restriction
  has value: 1.758e+01
subclass of: Restriction
  has value: 0e+00
alternative label: British Thermal Unit (international Table) Per Minute
qudtReference: http://qudt.org/vocab/unit/BTU_IT-PER-MIN
ucumCode: [Btu_IT].min-1
ucumCode: [Btu_IT]/min
unitSymbol: Btu{IT}/min
EMMO 967080e5 2f42 4eb2 a3a9 c58143e835f9: unit of the heat energy according to the Imperial system of units divided by the unit minute -- QUDT

Btu_It_Per_Sec_Ft2_Deg_R
type: Class
comment: unit of the heat transfer coefficient according to the Imperial system of units -- QUDT
subclass of: Restriction
  has value: 1.489e+01
subclass of: Restriction
  has value: 0e+00
alternative label: British Thermal Unit (international Table) Per Second Square Foot degree Rankine
qudtReference: http://qudt.org/vocab/unit/BTU_IT-PER-SEC-FT2-DEG_R
ucumCode: [Btu_IT].s-1.[ft_i]-2.[degR]-1
ucumCode: [Btu_IT]/(s.[ft_i]2.[degR])
unitSymbol: Btu{IT}/(s⋅ft²⋅°R)
EMMO 967080e5 2f42 4eb2 a3a9 c58143e835f9: unit of the heat transfer coefficient according to the Imperial system of units -- QUDT

Btu_It_Per_Sec_Ft_Deg_R
type: Class
comment: unit of the thermal conductivity according to the Imperial system of units -- QUDT
subclass of: Restriction
  has value: 1.7866e+02
subclass of: Restriction
  has value: 0e+00
alternative label: British Thermal Unit (international Table) Per Second Foot Degree Rankine
qudtReference: http://qudt.org/vocab/unit/BTU_IT-PER-SEC-FT-DEG_R
ucumCode: [Btu_IT].s-1.[ft_i]-1.[degR]-1
ucumCode: [Btu_IT]/(s.[ft_i].[degR])
unitSymbol: Btu{IT}/(s⋅ft⋅°R)
EMMO 967080e5 2f42 4eb2 a3a9 c58143e835f9: unit of the thermal conductivity according to the Imperial system of units -- QUDT

Btu_Mean
type: Class
comment: unit of the heat energy according to the Imperial system of units -- QUDT
subclass of: Restriction
  has value: 1.055056e+03
subclass of: Restriction
  has value: 0e+00
alternative label: British Thermal Unit (mean)
qudtReference: http://qudt.org/vocab/unit/BTU_MEAN
ucumCode: [Btu_m]
unitSymbol: BTU{mean}
EMMO 967080e5 2f42 4eb2 a3a9 c58143e835f9: unit of the heat energy according to the Imperial system of units -- QUDT

Btu_Th_Ft_Per_Ft2_Hr_Deg_F
type: Class
comment: 'BTU_TH Foot per Square Foot Hour Degree Fahrenheit' is an Imperial unit for 'Thermal Conductivity' expressed as Btu_{th} · ft/(hr · ft² · degF). -- QUDT
subclass of: Restriction
  has value: 1.729577e+00
subclass of: Restriction
  has value: 0e+00
alternative label: BTU (TH) Foot per Square Foot Hour Degree Fahrenheit
qudtReference: http://qudt.org/vocab/unit/BTU_TH-FT-PER-FT2-HR-DEG_F
ucumCode: [Btu_IT].[ft_i]-2.h-1.[degF]-1
ucumCode: [Btu_IT]/([ft_i]2.h.[degF])
unitSymbol: Btu{th}⋅ft/(ft²⋅hr⋅°F)
EMMO 967080e5 2f42 4eb2 a3a9 c58143e835f9: 'BTU_TH Foot per Square Foot Hour Degree Fahrenheit' is an Imperial unit for 'Thermal Conductivity' expressed as Btu_{th} · ft/(hr · ft² · degF). -- QUDT
wikipediaReference: http://en.wikipedia.org/wiki/Thermal_conductivity

Btu_Th_Ft_Per_Hr_Ft2_Deg_F
type: Class
comment: unit of the thermal conductivity according to the Imperial system of units -- QUDT
subclass of: Restriction
  has value: 1.73e+00
subclass of: Restriction
  has value: 0e+00
alternative label: British Thermal Unit (thermochemical) Foot Per Hour Square Foot degree Fahrenheit
qudtReference: http://qudt.org/vocab/unit/BTU_TH-FT-PER-HR-FT2-DEG_F
ucumCode: [Btu_th].[ft_i].h-1.[ft_i]-2.[degF]-1
ucumCode: [Btu_th].[ft_i]/(h.[ft_i]2.[degF])
unitSymbol: Btu{th}⋅ft/(hr⋅ft²⋅°F)
EMMO 967080e5 2f42 4eb2 a3a9 c58143e835f9: unit of the thermal conductivity according to the Imperial system of units -- QUDT

Btu_Th_In_Per_Ft2_Hr_Deg_F
type: Class
comment: Unit of thermal conductivity according to the Imperial system of units -- QUDT
subclass of: Restriction
  has value: 1.441314e-01
subclass of: Restriction
  has value: 0e+00
alternative label: BTU (TH) Inch per Square Foot Hour Degree Fahrenheit
qudtReference: http://qudt.org/vocab/unit/BTU_TH-IN-PER-FT2-HR-DEG_F
ucumCode: [Btu_th].[in_i].[ft_i]-2.h-1.[degF]-1
ucumCode: [Btu_th].[in_i]/([ft_i]2.h.[degF])
unitSymbol: Btu{th}⋅in/(ft²⋅hr⋅°F)
EMMO 967080e5 2f42 4eb2 a3a9 c58143e835f9: Unit of thermal conductivity according to the Imperial system of units -- QUDT

Btu_Th_In_Per_Ft2_Sec_Deg_F
type: Class
comment: Unit of thermal conductivity according to the Imperial system of units -- QUDT
subclass of: Restriction
  has value: 5.188732e+02
subclass of: Restriction
  has value: 0e+00
alternative label: BTU (TH) Inch per Square Foot Second Degree Fahrenheit
qudtReference: http://qudt.org/vocab/unit/BTU_TH-IN-PER-FT2-SEC-DEG_F
ucumCode: [Btu_th].[in_i].[ft_i]-2.s-1.[degF]-1
ucumCode: [Btu_th].[in_i]/([ft_i]2.s.[degF])
unitSymbol: Btu{th}⋅in/(ft²⋅s⋅°F)
EMMO 967080e5 2f42 4eb2 a3a9 c58143e835f9: Unit of thermal conductivity according to the Imperial system of units -- QUDT

Btu_Th_Per_Ft3
type: Class
comment: British Thermal Unit (TH) Per Cubic Foot (Btu (TH)/ft³) is a unit in the category of Energy density. It is also known as Btu per cubic foot, Btu/cubic foot. This unit is commonly used in the UK, US unit systems. It has a dimension of ML⁻¹T⁻² where M is mass, L is length, and T is time. It can be converted to the corresponding standard SI unit J/m³ by multiplying its value by a factor of 37234.03. -- QUDT
subclass of: Restriction
  has value: 3.723403e+04
subclass of: Restriction
  has value: 0e+00
alternative label: British Thermal Unit (TH) Per Cubic Foot
qudtReference: http://qudt.org/vocab/unit/BTU_TH-PER-FT3
ucumCode: [Btu_th].[ft_i]-3
ucumCode: [Btu_th]/[ft_i]3
unitSymbol: Btu{th}/ft³
EMMO 967080e5 2f42 4eb2 a3a9 c58143e835f9: British Thermal Unit (TH) Per Cubic Foot (Btu (TH)/ft³) is a unit in the category of Energy density. It is also known as Btu per cubic foot, Btu/cubic foot. This unit is commonly used in the UK, US unit systems. It has a dimension of ML⁻¹T⁻² where M is mass, L is length, and T is time. It can be converted to the corresponding standard SI unit J/m³ by multiplying its value by a factor of 37234.03. -- QUDT

Btu_Th_Per_Lb
type: Class
comment: 'Btu_th / lbm', British Thermal Unit (therm.) Per Pound Mass, is a unit in the category of Thermal heat capacity. It is also known as Btu per pound, Btu/pound, Btu/lb. This unit is commonly used in the UK unit system. British Thermal Unit (therm.) Per Pound Mass (Btu (therm.)/lbm) has a dimension of L²T⁻² where L is length, and T is time. It can be converted to the corresponding standard SI unit J/kg by multiplying its value by a factor of 2324.443861. -- QUDT
subclass of: Restriction
  has value: 0e+00
subclass of: Restriction
  has value: 2.324444e+03
alternative label: British Thermal Unit (TH) Per Pound
qudtReference: http://qudt.org/vocab/unit/BTU_TH-PER-LB
ucumCode: [Btu_th].[lb_av]-1
ucumCode: [Btu_th]/[lb_av]
unitSymbol: btu{th}/lb
EMMO 967080e5 2f42 4eb2 a3a9 c58143e835f9: 'Btu_th / lbm', British Thermal Unit (therm.) Per Pound Mass, is a unit in the category of Thermal heat capacity. It is also known as Btu per pound, Btu/pound, Btu/lb. This unit is commonly used in the UK unit system. British Thermal Unit (therm.) Per Pound Mass (Btu (therm.)/lbm) has a dimension of L²T⁻² where L is length, and T is time. It can be converted to the corresponding standard SI unit J/kg by multiplying its value by a factor of 2324.443861. -- QUDT

Btu_Th_Per_Lb_Deg_F
type: Class
comment: unit of the thermal conductivity according to the Imperial system of units divided by the units pound and degree Fahrenheit -- QUDT
subclass of: Restriction
  has value: 4.26654e+02
subclass of: Restriction
  has value: 0e+00
alternative label: British Thermal Unit (thermochemical) Per Pound Degree Fahrenheit
qudtReference: http://qudt.org/vocab/unit/BTU_TH-PER-LB-DEG_F
ucumCode: [Btu_th].[lb_av]-1.[degF]-1
ucumCode: [Btu_th]/([lb_av].[degF])
unitSymbol: Btu{th}/(lb⋅°F)
EMMO 967080e5 2f42 4eb2 a3a9 c58143e835f9: unit of the thermal conductivity according to the Imperial system of units divided by the units pound and degree Fahrenheit -- QUDT

Btu_Th_Per_Min
type: Class
comment: unit of the heat energy according to the Imperial system of units divided by the unit minute -- QUDT
subclass of: Restriction
  has value: 1.7573e+01
subclass of: Restriction
  has value: 0e+00
alternative label: British Thermal Unit (thermochemical) Per Minute
qudtReference: http://qudt.org/vocab/unit/BTU_TH-PER-MIN
ucumCode: [Btu_th].min-1
ucumCode: [Btu_th]/min
unitSymbol: Btu{th}/min
EMMO 967080e5 2f42 4eb2 a3a9 c58143e835f9: unit of the heat energy according to the Imperial system of units divided by the unit minute -- QUDT

Btu_Th_Per_Sec
type: Class
comment: unit of the heat energy according to the Imperial system of units divided by the SI base unit second -- QUDT
subclass of: Restriction
  has value: 1.05435e+03
subclass of: Restriction
  has value: 0e+00
alternative label: British Thermal Unit (thermochemical) Per Second
qudtReference: http://qudt.org/vocab/unit/BTU_TH-PER-SEC
ucumCode: [Btu_th].s-1
ucumCode: [Btu_th]/s
unitSymbol: Btu{th}/s
EMMO 967080e5 2f42 4eb2 a3a9 c58143e835f9: unit of the heat energy according to the Imperial system of units divided by the SI base unit second -- QUDT

Bu_Uk
type: Class
comment: A bushel is an imperial unit of dry volume, equivalent in each of these systems to 4 pecks or 8 gallons. It is used for volumes of dry commodities (not liquids), most often in agriculture. It is abbreviated as bsh. or bu. In modern usage, the dry volume is usually only nominal, with bushels referring to standard weights instead. -- QUDT
subclass of: Restriction
  has value: 3.636872e-02
subclass of: Restriction
  has value: 0e+00
alternative label: bushel (UK)
qudtReference: http://qudt.org/vocab/unit/BU_UK
ucumCode: [bu_br]
unitSymbol: bsh{UK}
EMMO 967080e5 2f42 4eb2 a3a9 c58143e835f9: A bushel is an imperial unit of dry volume, equivalent in each of these systems to 4 pecks or 8 gallons. It is used for volumes of dry commodities (not liquids), most often in agriculture. It is abbreviated as bsh. or bu. In modern usage, the dry volume is usually only nominal, with bushels referring to standard weights instead. -- QUDT
wikipediaReference: http://en.wikipedia.org/wiki/Bushel

Bu_Uk_Per_Day
type: Class
comment: unit of the volume bushel (UK) (for fluids and for dry measures) according to the Imperial system of units divided by the unit for time day -- QUDT
subclass of: Restriction
  has value: 0e+00
subclass of: Restriction
  has value: 4.209343e-07
alternative label: Bushel (UK) Per Day
qudtReference: http://qudt.org/vocab/unit/BU_UK-PER-DAY
ucumCode: [bu_br].d-1
ucumCode: [bu_br]/d
unitSymbol: bsh{UK}/day
EMMO 967080e5 2f42 4eb2 a3a9 c58143e835f9: unit of the volume bushel (UK) (for fluids and for dry measures) according to the Imperial system of units divided by the unit for time day -- QUDT

Bu_Uk_Per_Hr
type: Class
comment: unit of the volume bushel (UK) (for fluids and for dry measures) according to the Imperial system of units divided by the unit for time hour -- QUDT
subclass of: Restriction
  has value: 1.010242e-05
subclass of: Restriction
  has value: 0e+00
alternative label: Bushel (UK) Per Hour
qudtReference: http://qudt.org/vocab/unit/BU_UK-PER-HR
unitSymbol: bsh{UK}/hr
EMMO 967080e5 2f42 4eb2 a3a9 c58143e835f9: unit of the volume bushel (UK) (for fluids and for dry measures) according to the Imperial system of units divided by the unit for time hour -- QUDT

Bu_Uk_Per_Min
type: Class
comment: unit of the volume bushel (UK) (for fluids and for dry measures) according to the Imperial system of units divided by the unit for time minute -- QUDT
subclass of: Restriction
  has value: 6.061453e-04
subclass of: Restriction
  has value: 0e+00
alternative label: Bushel (UK) Per Minute
qudtReference: http://qudt.org/vocab/unit/BU_UK-PER-MIN
ucumCode: [bu_br].min-1
ucumCode: [bu_br]/min
unitSymbol: bsh{UK}/min
EMMO 967080e5 2f42 4eb2 a3a9 c58143e835f9: unit of the volume bushel (UK) (for fluids and for dry measures) according to the Imperial system of units divided by the unit for time minute -- QUDT

Bu_Uk_Per_Sec
type: Class
comment: unit of the volume bushel (UK) (for fluids and for dry measures) according to the Imperial system of units divided by the SI base unit second -- QUDT
subclass of: Restriction
  has value: 3.636872e-02
subclass of: Restriction
  has value: 0e+00
alternative label: Bushel (UK) Per Second
qudtReference: http://qudt.org/vocab/unit/BU_UK-PER-SEC
ucumCode: [bu_br].s-1
ucumCode: [bu_br]/s
unitSymbol: bsh{UK}/s
EMMO 967080e5 2f42 4eb2 a3a9 c58143e835f9: unit of the volume bushel (UK) (for fluids and for dry measures) according to the Imperial system of units divided by the SI base unit second -- QUDT

Bu_Us
type: Class
comment: A bushel is an imperial and U.S. customary unit of dry volume, equivalent in each of these systems to 4 pecks or 8 gallons. It is used for volumes of dry commodities (not liquids), most often in agriculture. It is abbreviated as bsh. or bu. In modern usage, the dry volume is usually only nominal, with bushels referring to standard weights instead. -- QUDT
subclass of: Restriction
  has value: 3.523907e-02
subclass of: Restriction
  has value: 0e+00
alternative label: bushel (US)
qudtReference: http://qudt.org/vocab/unit/BU_US
ucumCode: [bu_us]
unitSymbol: bsh{US}
EMMO 967080e5 2f42 4eb2 a3a9 c58143e835f9: A bushel is an imperial and U.S. customary unit of dry volume, equivalent in each of these systems to 4 pecks or 8 gallons. It is used for volumes of dry commodities (not liquids), most often in agriculture. It is abbreviated as bsh. or bu. In modern usage, the dry volume is usually only nominal, with bushels referring to standard weights instead. -- QUDT
wikipediaReference: http://en.wikipedia.org/wiki/Bushel

Bu_Us_Dry_Per_Day
type: Class
comment: unit of the volume bushel (US dry) for dry measure according to the Anglo-American system of units divided by the unit for time day -- QUDT
subclass of: Restriction
  has value: 4.0786e-07
subclass of: Restriction
  has value: 0e+00
alternative label: Bushel (US Dry) Per Day
qudtReference: http://qudt.org/vocab/unit/BU_US_DRY-PER-DAY
ucumCode: [bu_us].d-1
ucumCode: [bu_us]/d
unitSymbol: bsh{US}/day
EMMO 967080e5 2f42 4eb2 a3a9 c58143e835f9: unit of the volume bushel (US dry) for dry measure according to the Anglo-American system of units divided by the unit for time day -- QUDT

Bu_Us_Dry_Per_Hr
type: Class
comment: unit of the volume bushel (US dry) for dry measure according to the Anglo-American system of units divided by the unit for time hour -- QUDT
subclass of: Restriction
  has value: 9.789e-06
subclass of: Restriction
  has value: 0e+00
alternative label: Bushel (US Dry) Per Hour
qudtReference: http://qudt.org/vocab/unit/BU_US_DRY-PER-HR
ucumCode: [bu_us].h-1
ucumCode: [bu_us]/h
unitSymbol: bsh{US}/hr
EMMO 967080e5 2f42 4eb2 a3a9 c58143e835f9: unit of the volume bushel (US dry) for dry measure according to the Anglo-American system of units divided by the unit for time hour -- QUDT

Bu_Us_Dry_Per_Min
type: Class
comment: unit of the volume bushel (US dry) for dry measure according to the Anglo-American system of units divided by the unit for time minute -- QUDT
subclass of: Restriction
  has value: 0e+00
subclass of: Restriction
  has value: 5.8732e-04
alternative label: Bushel (US Dry) Per Minute
qudtReference: http://qudt.org/vocab/unit/BU_US_DRY-PER-MIN
ucumCode: [bu_us].min-1
ucumCode: [bu_us]/min
unitSymbol: bsh{US}/min
EMMO 967080e5 2f42 4eb2 a3a9 c58143e835f9: unit of the volume bushel (US dry) for dry measure according to the Anglo-American system of units divided by the unit for time minute -- QUDT

Bu_Us_Dry_Per_Sec
type: Class
comment: unit of the volume bushel (US dry) for dry measure according to the Anglo-American system of units divided by the SI base unit second -- QUDT
subclass of: Restriction
  has value: 3.523907e-02
subclass of: Restriction
  has value: 0e+00
alternative label: Bushel (US Dry) Per Second
qudtReference: http://qudt.org/vocab/unit/BU_US_DRY-PER-SEC
ucumCode: [bu_us].s-1
ucumCode: [bu_us]/s
unitSymbol: bsh{US}/s
EMMO 967080e5 2f42 4eb2 a3a9 c58143e835f9: unit of the volume bushel (US dry) for dry measure according to the Anglo-American system of units divided by the SI base unit second -- QUDT

Cal_15_Deg_C
type: Class
comment: unit for the quantity of heat which is required to warm up 1 g of water, which is free of air, at a constant pressure of 101.325 kPa (the pressure of the standard atmosphere on sea level) from 14.5 degrees Celsius to 15.5 degrees Celsius -- QUDT
subclass of: Restriction
  has value: 0e+00
subclass of: Restriction
  has value: 4.1855e+00
alternative label: Calorie (15 Degrees C)
qudtReference: http://qudt.org/vocab/unit/CAL_15_DEG_C
ucumCode: cal_[15]
unitSymbol: cal{15 °C}
EMMO 967080e5 2f42 4eb2 a3a9 c58143e835f9: unit for the quantity of heat which is required to warm up 1 g of water, which is free of air, at a constant pressure of 101.325 kPa (the pressure of the standard atmosphere on sea level) from 14.5 degrees Celsius to 15.5 degrees Celsius -- QUDT

Cal_It_Per_Gm
type: Class
comment: unit calorie according to the international steam table divided by the 0.001-fold of the SI base unit kilogram -- QUDT
subclass of: Restriction
  has value: 4.1868e+03
subclass of: Restriction
  has value: 0e+00
alternative label: Calorie (international Table) Per Gram
qudtReference: http://qudt.org/vocab/unit/CAL_IT-PER-GM
ucumCode: cal_IT.g-1
ucumCode: cal_IT/g
unitSymbol: cal{IT}/g
EMMO 967080e5 2f42 4eb2 a3a9 c58143e835f9: unit calorie according to the international steam table divided by the 0.001-fold of the SI base unit kilogram -- QUDT

Cal_It_Per_Gm_Deg_C
type: Class
comment: unit calorieIT divided by the products of the units gram and degree Celsius -- QUDT
subclass of: Restriction
  has value: 4.1868e+03
subclass of: Restriction
  has value: 0e+00
alternative label: Calorie (international Table) Per Gram Degree Celsius
qudtReference: http://qudt.org/vocab/unit/CAL_IT-PER-GM-DEG_C
ucumCode: cal_IT.g-1.Cel-1
ucumCode: cal_IT/(g.Cel)
unitSymbol: cal{IT}/(g⋅°C)
EMMO 967080e5 2f42 4eb2 a3a9 c58143e835f9: unit calorieIT divided by the products of the units gram and degree Celsius -- QUDT

Cal_It_Per_Gm_K
type: Class
comment: unit calorieIT divided by the product of the SI base unit gram and Kelvin -- QUDT
subclass of: Restriction
  has value: 4.1868e+03
subclass of: Restriction
  has value: 0e+00
alternative label: Calorie (international Table) Per Gram Kelvin
qudtReference: http://qudt.org/vocab/unit/CAL_IT-PER-GM-K
ucumCode: cal_IT.g-1.K-1
ucumCode: cal_IT/(g.K)
unitSymbol: cal{IT}/(g⋅K)
EMMO 967080e5 2f42 4eb2 a3a9 c58143e835f9: unit calorieIT divided by the product of the SI base unit gram and Kelvin -- QUDT

Cal_It_Per_Sec_CentiM2_K
type: Class
comment: unit of the heat transfer coefficient according to the Imperial system of units -- QUDT
subclass of: Restriction
  has value: 4.1868e+04
subclass of: Restriction
  has value: 0e+00
alternative label: Calorie (international Table) Per Second Square Centimetre kelvin
qudtReference: http://qudt.org/vocab/unit/CAL_IT-PER-SEC-CentiM2-K
ucumCode: cal_IT.s-1.cm-2.K-1
ucumCode: cal_IT/(s.cm2.K)
unitSymbol: cal{IT}/(s⋅cm²⋅K)
EMMO 967080e5 2f42 4eb2 a3a9 c58143e835f9: unit of the heat transfer coefficient according to the Imperial system of units -- QUDT

Cal_It_Per_Sec_CentiM_K
type: Class
comment: unit of the thermal conductivity according to the Imperial system of units -- QUDT
subclass of: Restriction
  has value: 4.1868e+02
subclass of: Restriction
  has value: 0e+00
alternative label: Calorie (international Table) Per Second Centimetre Kelvin
qudtReference: http://qudt.org/vocab/unit/CAL_IT-PER-SEC-CentiM-K
ucumCode: cal_IT.s-1.cm-1.K-1
ucumCode: cal_IT/(s.cm.K)
unitSymbol: cal{IT}/(s⋅cm⋅K)
EMMO 967080e5 2f42 4eb2 a3a9 c58143e835f9: unit of the thermal conductivity according to the Imperial system of units -- QUDT

Cal_Th_Per_CentiM_Sec_Deg_C
type: Class
comment: unit of the thermal conductivity according to the Imperial system of units -- QUDT
subclass of: Restriction
  has value: 4.184e+02
subclass of: Restriction
  has value: 0e+00
alternative label: Calorie (thermochemical) Per Centimetre Second Degree Celsius
qudtReference: http://qudt.org/vocab/unit/CAL_TH-PER-CentiM-SEC-DEG_C
ucumCode: cal_th.cm-1.s-1.Cel-1
ucumCode: cal_th/(cm.s.Cel)
unitSymbol: cal{th}/(cm⋅s⋅°C)
EMMO 967080e5 2f42 4eb2 a3a9 c58143e835f9: unit of the thermal conductivity according to the Imperial system of units -- QUDT

Cal_Th_Per_Gm
type: Class
comment: unit thermochemical calorie divided by the 0.001-fold of the SI base unit kilogram -- QUDT
subclass of: Restriction
  has value: 4.184e+03
subclass of: Restriction
  has value: 0e+00
alternative label: Calorie (thermochemical) Per Gram
qudtReference: http://qudt.org/vocab/unit/CAL_TH-PER-GM
ucumCode: cal_th.g-1
ucumCode: cal_th/g
unitSymbol: cal{th}/g
EMMO 967080e5 2f42 4eb2 a3a9 c58143e835f9: unit thermochemical calorie divided by the 0.001-fold of the SI base unit kilogram -- QUDT

Cal_Th_Per_Gm_Deg_C
type: Class
comment: unit calorie (thermochemical) divided by the product of the unit gram and degree Celsius -- QUDT
subclass of: Restriction
  has value: 4.184e+03
subclass of: Restriction
  has value: 0e+00
alternative label: Calorie (thermochemical) Per Gram Degree Celsius
qudtReference: http://qudt.org/vocab/unit/CAL_TH-PER-GM-DEG_C
ucumCode: cal_th.g-1.Cel-1
ucumCode: cal_th/(g.Cel)
unitSymbol: cal{th}/(g⋅°C)
EMMO 967080e5 2f42 4eb2 a3a9 c58143e835f9: unit calorie (thermochemical) divided by the product of the unit gram and degree Celsius -- QUDT

Cal_Th_Per_Gm_K
type: Class
comment: unit calorie (thermochemical) divided by the product of the SI derived unit gram and the SI base unit Kelvin -- QUDT
subclass of: Restriction
  has value: 4.184e+03
subclass of: Restriction
  has value: 0e+00
alternative label: Calorie (thermochemical) Per Gram Kelvin
qudtReference: http://qudt.org/vocab/unit/CAL_TH-PER-GM-K
ucumCode: cal_th.g-1.K-1
ucumCode: cal_th/(g.K)
unitSymbol: cal{th}/(g⋅K)
EMMO 967080e5 2f42 4eb2 a3a9 c58143e835f9: unit calorie (thermochemical) divided by the product of the SI derived unit gram and the SI base unit Kelvin -- QUDT

Cal_Th_Per_Sec_CentiM2_K
type: Class
comment: unit of the heat transfer coefficient according to the Imperial system of units -- QUDT
subclass of: Restriction
  has value: 4.184e+04
subclass of: Restriction
  has value: 0e+00
alternative label: Calorie (thermochemical) Per Second Square Centimetre kelvin
qudtReference: http://qudt.org/vocab/unit/CAL_TH-PER-SEC-CentiM2-K
ucumCode: cal_th.s-1.cm-2.K-1
ucumCode: cal_th/(s.cm2.K)
unitSymbol: cal{th}/(s⋅cm²⋅K)
EMMO 967080e5 2f42 4eb2 a3a9 c58143e835f9: unit of the heat transfer coefficient according to the Imperial system of units -- QUDT

Cal_Th_Per_Sec_CentiM_K
type: Class
comment: unit of the thermal conductivity according to the Imperial system of units -- QUDT
subclass of: Restriction
  has value: 4.184e+02
subclass of: Restriction
  has value: 0e+00
alternative label: Calorie (thermochemical) Per Second Centimetre Kelvin
qudtReference: http://qudt.org/vocab/unit/CAL_TH-PER-SEC-CentiM-K
ucumCode: cal_th.s-1.cm-1.K-1
ucumCode: cal_th/(s.cm.K)
unitSymbol: cal{th}/(s⋅cm⋅K)
EMMO 967080e5 2f42 4eb2 a3a9 c58143e835f9: unit of the thermal conductivity according to the Imperial system of units -- QUDT

CaloriePerGramDegreeCelsius
type: Class
comment: `Calorie per Gram Degree Celsius` is a unit for 'Specific Heat Capacity' expressed as kcal/(gm-degC). -- QUDT
alternative label: Calorie per Gram Degree Celsius
qudtReference: http://qudt.org/vocab/unit/KiloCAL-PER-GM-DEG_C
ucumCode: cal.g-1.Cel-1
unitSymbol: kcal/(g⋅°C)
EMMO 967080e5 2f42 4eb2 a3a9 c58143e835f9: `Calorie per Gram Degree Celsius` is a unit for 'Specific Heat Capacity' expressed as kcal/(gm-degC). -- QUDT

CandelaPerLumen
type: Class
comment: Candela per Lumen.
subclass of: Restriction
  has value: 1e+00
subclass of: Restriction
  has value: 0e+00
qudtReference: http://qudt.org/vocab/unit/CD-PER-LM
unitSymbol: cd/lm
EMMO 967080e5 2f42 4eb2 a3a9 c58143e835f9: Candela per Lumen.

CandelaPerSquareInch
type: Class
comment: "Candela per Square Inch" is a unit for 'Luminance' expressed as cd/in². -- QUDT
subclass of: Restriction
  has value: 1.550003e+03
subclass of: Restriction
  has value: 0e+00
alternative label: Candela per Square Inch
qudtReference: http://qudt.org/vocab/unit/CD-PER-IN2
ucumCode: cd.[in_i]-2
ucumCode: cd/[in_i]2
unitSymbol: cd/in²
EMMO 967080e5 2f42 4eb2 a3a9 c58143e835f9: "Candela per Square Inch" is a unit for 'Luminance' expressed as cd/in². -- QUDT

CandelaPerSquareMetre
type: Class
comment: The candela per square metre (cd/m²) is the derived SI unit of luminance. The unit is based on the candela, the SI unit of luminous intensity, and the square metre, the SI unit of area. Nit (nt) is a deprecated non-SI name also used for this unit (1 nit = 1 cd/m²). As a measure of light emitted per unit area, this unit is frequently used to specify the brightness of a display device. Most consumer desktop liquid crystal displays have luminances of 200 to 300 cd/m²; the sRGB spec for monitors targets 80 cd/m2. HDTVs range from 450 to about 1000 cd/m2. Typically, calibrated monitors should have a brightness of 120 cd/m². Nit is believed to come from the Latin word nitere, to shine. -- QUDT
subclass of: Restriction
  has value: 1e+00
subclass of: Restriction
  has value: 0e+00
alternative label: candela per square metre
qudtReference: http://qudt.org/vocab/unit/CD-PER-M2
ucumCode: cd.m-2
ucumCode: cd/m2
unitSymbol: cd/m²
EMMO 967080e5 2f42 4eb2 a3a9 c58143e835f9: The candela per square metre (cd/m²) is the derived SI unit of luminance. The unit is based on the candela, the SI unit of luminous intensity, and the square metre, the SI unit of area. Nit (nt) is a deprecated non-SI name also used for this unit (1 nit = 1 cd/m²). As a measure of light emitted per unit area, this unit is frequently used to specify the brightness of a display device. Most consumer desktop liquid crystal displays have luminances of 200 to 300 cd/m²; the sRGB spec for monitors targets 80 cd/m2. HDTVs range from 450 to about 1000 cd/m2. Typically, calibrated monitors should have a brightness of 120 cd/m². Nit is believed to come from the Latin word nitere, to shine. -- QUDT

Candlepower
type: Class
comment: "Candlepower" (abbreviated as cp) is a now-obsolete unit which was used to express levels of light intensity in terms of the light emitted by a candle of specific size and constituents. In modern usage Candlepower equates directly to the unit known as the candela. -- QUDT
subclass of: Restriction
  has value: 1e+00
subclass of: Restriction
  has value: 0e+00
qudtReference: http://qudt.org/vocab/unit/CP
unitSymbol: cp
EMMO 967080e5 2f42 4eb2 a3a9 c58143e835f9: "Candlepower" (abbreviated as cp) is a now-obsolete unit which was used to express levels of light intensity in terms of the light emitted by a candle of specific size and constituents. In modern usage Candlepower equates directly to the unit known as the candela. -- QUDT
wikipediaReference: http://en.wikipedia.org/wiki/Candlepower

Carat
type: Class
comment: The carat is a unit of mass equal to 200 mg and is used for measuring gemstones and pearls. The current definition, sometimes known as the metric carat, was adopted in 1907 at the Fourth General Conference on Weights and Measures, and soon afterward in many countries around the world. The carat is divisible into one hundred points of two milligrams each. Other subdivisions, and slightly different mass values, have been used in the past in different locations. In terms of diamonds, a paragon is a flawless stone of at least 100 carats (20 g). The ANSI X.12 EDI standard abbreviation for the carat is CD. -- QUDT
subclass of: Restriction
  has value: 2e-04
subclass of: Restriction
  has value: 0e+00
qudtReference: http://qudt.org/vocab/unit/CARAT
ucumCode: [car_m]
unitSymbol: ct
EMMO 967080e5 2f42 4eb2 a3a9 c58143e835f9: The carat is a unit of mass equal to 200 mg and is used for measuring gemstones and pearls. The current definition, sometimes known as the metric carat, was adopted in 1907 at the Fourth General Conference on Weights and Measures, and soon afterward in many countries around the world. The carat is divisible into one hundred points of two milligrams each. Other subdivisions, and slightly different mass values, have been used in the past in different locations. In terms of diamonds, a paragon is a flawless stone of at least 100 carats (20 g). The ANSI X.12 EDI standard abbreviation for the carat is CD. -- QUDT
wikipediaReference: http://en.wikipedia.org/wiki/Carat

CasesPer1000IndividualsPerYear
type: Class
comment: The typical expression of morbidity rate, expressed as cases per 1000 individuals, per year. -- QUDT
subclass of: Restriction
  has value: 1e-03
subclass of: Restriction
  has value: 0e+00
alternative label: Cases per 1000 individuals per year
qudtReference: http://qudt.org/vocab/unit/CASES-PER-KiloINDIV-YR
unitSymbol: Cases/1000 individuals/year
EMMO 967080e5 2f42 4eb2 a3a9 c58143e835f9: The typical expression of morbidity rate, expressed as cases per 1000 individuals, per year. -- QUDT
wikipediaReference: https://en.wikipedia.org/wiki/Incidence_(epidemiology)

CentiBar
type: Class
comment: The bar is a non-SI unit of pressure, defined by the IUPAC as exactly equal to 100,000 Pa. It is about equal to the atmospheric pressure on Earth at sea level, and since 1982 the IUPAC has recommended that the standard for atmospheric pressure should be harmonized to 100,000 Pa = 1 bar ≈ 750.0616827 Torr. Units derived from the bar are the megabar (symbol: Mbar), kilobar (symbol: kbar), decibar (symbol: dbar), centibar (symbol: cbar), and millibar (symbol: mbar or mb). They are not SI or cgs units, but they are accepted for use with the SI. -- QUDT
subclass of: Restriction
  has value: 0e+00
subclass of: Restriction
  some values from: Bar
subclass of: Restriction
  has value: 1e+03
qudtReference: http://qudt.org/vocab/unit/CentiBAR
ucumCode: cbar
unitSymbol: cbar
EMMO 967080e5 2f42 4eb2 a3a9 c58143e835f9: The bar is a non-SI unit of pressure, defined by the IUPAC as exactly equal to 100,000 Pa. It is about equal to the atmospheric pressure on Earth at sea level, and since 1982 the IUPAC has recommended that the standard for atmospheric pressure should be harmonized to 100,000 Pa = 1 bar ≈ 750.0616827 Torr. Units derived from the bar are the megabar (symbol: Mbar), kilobar (symbol: kbar), decibar (symbol: dbar), centibar (symbol: cbar), and millibar (symbol: mbar or mb). They are not SI or cgs units, but they are accepted for use with the SI. -- QUDT
wikipediaReference: http://en.wikipedia.org/wiki/Bar_(unit)

CentiCoulomb
type: Class
comment: A CentiCoulomb is 10⁻² C. -- QUDT
subclass of: Restriction
  has value: 0e+00
subclass of: Restriction
  some values from: Coulomb
subclass of: Restriction
  has value: 1e-02
qudtReference: http://qudt.org/vocab/unit/CentiC
ucumCode: cC
unitSymbol: cC
EMMO 967080e5 2f42 4eb2 a3a9 c58143e835f9: A CentiCoulomb is 10⁻² C. -- QUDT

CentiGram
type: Class
comment: 0,000 01-fold of the SI base unit kilogram -- QUDT
subclass of: Restriction
  some values from: Gram
subclass of: Restriction
  has value: 0e+00
subclass of: Restriction
  has value: 1e-05
qudtReference: http://qudt.org/vocab/unit/CentiGM
ucumCode: cg
unitSymbol: cg
EMMO 967080e5 2f42 4eb2 a3a9 c58143e835f9: 0,000 01-fold of the SI base unit kilogram -- QUDT

CentiLitre
type: Class
comment: 0,01-fold of the unit litre -- QUDT
subclass of: Restriction
  has value: 1e-05
subclass of: Restriction
  some values from: Litre
subclass of: Restriction
  has value: 0e+00
qudtReference: http://qudt.org/vocab/unit/CentiL
ucumCode: cL
unitSymbol: cL
EMMO 967080e5 2f42 4eb2 a3a9 c58143e835f9: 0,01-fold of the unit litre -- QUDT

CentiMetre
type: Class
comment: A centimetre is a unit of length in the metric system, equal to one hundredth of a metre, which is the SI base unit of length. Centi is the SI prefix for a factor of 10. The centimetre is the base unit of length in the now deprecated centimetre-gram-second (CGS) system of units. -- QUDT
subclass of: Restriction
  has value: 1e-02
subclass of: Restriction
  some values from: Metre
subclass of: Restriction
  has value: 0e+00
qudtReference: http://qudt.org/vocab/unit/CentiM
ucumCode: cm
unitSymbol: cm
EMMO 967080e5 2f42 4eb2 a3a9 c58143e835f9: A centimetre is a unit of length in the metric system, equal to one hundredth of a metre, which is the SI base unit of length. Centi is the SI prefix for a factor of 10. The centimetre is the base unit of length in the now deprecated centimetre-gram-second (CGS) system of units. -- QUDT
wikipediaReference: http://en.wikipedia.org/wiki/Centimetre

CentiMetreOfMercury
type: Class
comment: not SI conform unit of the pressure, that corresponds with the static pressure generated by a mercury column with the height of 1 centimetre -- QUDT
subclass of: Restriction
  has value: 1.333224e+03
subclass of: Restriction
  has value: 0e+00
alternative label: Centimetre Of Mercury
qudtReference: http://qudt.org/vocab/unit/CentiM_HG
ucumCode: cm[Hg]
unitSymbol: cmHg
EMMO 967080e5 2f42 4eb2 a3a9 c58143e835f9: not SI conform unit of the pressure, that corresponds with the static pressure generated by a mercury column with the height of 1 centimetre -- QUDT

CentiMetrePerHour
type: Class
comment: 0,01-fold of the SI base unit metre divided by the unit hour -- QUDT
subclass of: Restriction
  some values from: MetrePerHour
subclass of: Restriction
  has value: 2.777778e-06
subclass of: Restriction
  has value: 0e+00
alternative label: Centimetre Per Hour
qudtReference: http://qudt.org/vocab/unit/CentiM-PER-HR
ucumCode: cm.h-1
ucumCode: cm/h
unitSymbol: cm/h
EMMO 967080e5 2f42 4eb2 a3a9 c58143e835f9: 0,01-fold of the SI base unit metre divided by the unit hour -- QUDT

CentiMetrePerKelvin
type: Class
comment: 0,01-fold of the SI base unit metre divided by the SI base unit kelvin -- QUDT
subclass of: Restriction
  some values from: MetrePerKelvin
subclass of: Restriction
  has value: 1e-02
subclass of: Restriction
  has value: 0e+00
alternative label: Centimetre Per Kelvin
qudtReference: http://qudt.org/vocab/unit/CentiM-PER-K
ucumCode: cm.K-1
ucumCode: cm/K
unitSymbol: cm/K
EMMO 967080e5 2f42 4eb2 a3a9 c58143e835f9: 0,01-fold of the SI base unit metre divided by the SI base unit kelvin -- QUDT

CentiMetrePerSecond
type: Class
comment: "Centimeter per Second" is a C.G.S System unit for 'Linear Velocity' expressed as cm/s. -- QUDT
subclass of: Restriction
  some values from: MetrePerSecond
subclass of: Restriction
  has value: 1e-02
subclass of: Restriction
  has value: 0e+00
alternative label: centimetre per second
qudtReference: http://qudt.org/vocab/unit/CentiM-PER-SEC
ucumCode: cm.s-1
ucumCode: cm/s
unitSymbol: cm/s
EMMO 967080e5 2f42 4eb2 a3a9 c58143e835f9: "Centimeter per Second" is a C.G.S System unit for 'Linear Velocity' expressed as cm/s. -- QUDT

CentiMetrePerSquareSecond
type: Class
comment: `Centimeter per Square Second` is a C.G.S System unit for `Linear Acceleration` expressed as cm/s². -- QUDT
subclass of: Restriction
  some values from: MetrePerSquareSecond
subclass of: Restriction
  has value: 1e-02
subclass of: Restriction
  has value: 0e+00
alternative label: Centimetre per Square Second
qudtReference: http://qudt.org/vocab/unit/CentiM-PER-SEC2
ucumCode: cm.s-2
ucumCode: cm/s2
unitSymbol: cm/s²
EMMO 967080e5 2f42 4eb2 a3a9 c58143e835f9: `Centimeter per Square Second` is a C.G.S System unit for `Linear Acceleration` expressed as cm/s². -- QUDT

CentiMetrePerThousandYear
type: Class
subclass of: Restriction
  has value: 0e+00
subclass of: Restriction
  has value: 3.168809e-13
alternative label: Centimetres per thousand years
qudtReference: http://qudt.org/vocab/unit/CentiM-PER-KiloYR
ucumCode: cm.ka-1
unitSymbol: cm/(1000 yr)

CentiMetrePerYear
type: Class
subclass of: Restriction
  some values from: MetrePerYear
subclass of: Restriction
  has value: 3.168809e-10
subclass of: Restriction
  has value: 0e+00
alternative label: Centimetres per year
qudtReference: http://qudt.org/vocab/unit/CentiM-PER-YR
ucumCode: cm.a-1
unitSymbol: cm/yr

CentiMetreSecondDegreeCelsius
type: Class
comment: `Centimeter Second Degree Celsius` is a C.G.S System unit for 'Length Temperature Time' expressed as cm-s-degC. -- QUDT
alternative label: Centimetre Second Degree Celsius
qudtReference: http://qudt.org/vocab/unit/CentiM-SEC-DEG_C
ucumCode: cm.s.Cel-1
ucumCode: cm.s/Cel
unitSymbol: cm⋅s⋅°C
EMMO 967080e5 2f42 4eb2 a3a9 c58143e835f9: `Centimeter Second Degree Celsius` is a C.G.S System unit for 'Length Temperature Time' expressed as cm-s-degC. -- QUDT

CentiMole
type: Class
comment: A centimole 0.01 N.
subclass of: Restriction
  some values from: Mole
subclass of: Restriction
  has value: 1e-02
subclass of: Restriction
  has value: 0e+00
alternative label: centimole
qudtReference: http://qudt.org/vocab/unit/CentiMOL
unitSymbol: cmol
EMMO 967080e5 2f42 4eb2 a3a9 c58143e835f9: A centimole 0.01 N.

CentiMolePerKilogram
type: Class
comment: 1/100 of SI unit of amount of substance per kilogram -- QUDT
subclass of: Restriction
  has value: 1e-02
subclass of: Restriction
  has value: 0e+00
alternative label: Centimole per kilogram
qudtReference: http://qudt.org/vocab/unit/CentiMOL-PER-KiloGM
ucumCode: cmol.kg-1
ucumCode: cmol/kg
unitSymbol: cmol/kg
EMMO 967080e5 2f42 4eb2 a3a9 c58143e835f9: 1/100 of SI unit of amount of substance per kilogram -- QUDT

CentiNewton
type: Class
comment: A CentiNewton 0.01 N.
subclass of: Restriction
  has value: 0e+00
subclass of: Restriction
  some values from: Newton
subclass of: Restriction
  has value: 1e-02
qudtReference: http://qudt.org/vocab/unit/CentiN
unitSymbol: cN
EMMO 967080e5 2f42 4eb2 a3a9 c58143e835f9: A CentiNewton 0.01 N.

CentiNewtonMetre
type: Class
comment: 0,01-fold of the product of the SI derived unit newton and SI base unit metre -- QUDT
subclass of: Restriction
  some values from: NewtonMetre
subclass of: Restriction
  has value: 1e-02
subclass of: Restriction
  has value: 0e+00
alternative label: Centinewton Metre
qudtReference: http://qudt.org/vocab/unit/CentiN-M
ucumCode: cN.m
unitSymbol: cN⋅m
EMMO 967080e5 2f42 4eb2 a3a9 c58143e835f9: 0,01-fold of the product of the SI derived unit newton and SI base unit metre -- QUDT

CentiPoise
type: Class
comment: 0,01-fold of the CGS unit of the dynamic viscosity poise -- QUDT
subclass of: Restriction
  some values from: Poise
subclass of: Restriction
  has value: 1e-03
subclass of: Restriction
  has value: 0e+00
qudtReference: http://qudt.org/vocab/unit/CentiPOISE
ucumCode: cP
unitSymbol: cP
EMMO 967080e5 2f42 4eb2 a3a9 c58143e835f9: 0,01-fold of the CGS unit of the dynamic viscosity poise -- QUDT

CentiPoisePerBar
type: Class
comment: 0.01-fold of the CGS unit of the dynamic viscosity poise divided by the unit of the pressure bar -- QUDT
subclass of: Restriction
  some values from: PoisePerBar
subclass of: Restriction
  has value: 1e-08
subclass of: Restriction
  has value: 0e+00
alternative label: Centipoise Per Bar
qudtReference: http://qudt.org/vocab/unit/CentiPOISE-PER-BAR
ucumCode: cP.bar-1
ucumCode: cP/bar
unitSymbol: cP/bar
EMMO 967080e5 2f42 4eb2 a3a9 c58143e835f9: 0.01-fold of the CGS unit of the dynamic viscosity poise divided by the unit of the pressure bar -- QUDT

CentiStokes
type: Class
comment: `Centistokes` is a C.G.S System unit for 'Kinematic Viscosity' expressed as cSt. -- QUDT
subclass of: Restriction
  some values from: Stokes
subclass of: Restriction
  has value: 1e-06
subclass of: Restriction
  has value: 0e+00
qudtReference: http://qudt.org/vocab/unit/CentiST
ucumCode: cSt
unitSymbol: cSt
EMMO 967080e5 2f42 4eb2 a3a9 c58143e835f9: `Centistokes` is a C.G.S System unit for 'Kinematic Viscosity' expressed as cSt. -- QUDT

Chain
type: Class
comment: A chain is a unit of length. It measures 66 feet, or 22 yards, or 100 links, or 4 rods. There are 10 chains in a furlong, and 80 chains in one statute mile. An acre is the area of 10 square chains (that is, an area of one chain by one furlong). The chain has been used for several centuries in Britain and in some other countries influenced by British practice. -- QUDT
subclass of: Restriction
  has value: 2.01168e+01
subclass of: Restriction
  has value: 0e+00
alternative label: chain
qudtReference: http://qudt.org/vocab/unit/CH
ucumCode: [ch_br]
unitSymbol: ch
EMMO 967080e5 2f42 4eb2 a3a9 c58143e835f9: A chain is a unit of length. It measures 66 feet, or 22 yards, or 100 links, or 4 rods. There are 10 chains in a furlong, and 80 chains in one statute mile. An acre is the area of 10 square chains (that is, an area of one chain by one furlong). The chain has been used for several centuries in Britain and in some other countries influenced by British practice. -- QUDT
wikipediaReference: http://en.wikipedia.org/wiki/Chain

CircularMil
type: Class
comment: A circular mil is a unit of area, equal to the area of a circle with a diameter of one mil (one thousandth of an inch). It is a convenient unit for referring to the area of a wire with a circular cross section, because the area in circular mils can be calculated without reference to pi (π). The area in circular mils, A, of a circle with a diameter of d mils, is given by the formula: Electricians in Canada and the United States are familiar with the circular mil because the National Electrical Code (NEC) uses the circular mil to define wire sizes larger than 0000 AWG. In many NEC publications and uses, large wires may be expressed in thousands of circular mils, which is abbreviated in two different ways: MCM or kcmil. For example, one common wire size used in the NEC has a cross-section of 250,000 circular mils, written as 250 kcmil or 250 MCM, which is the first size larger than 0000 AWG used within the NEC. -- QUDT
subclass of: Restriction
  has value: 5.067075e-10
subclass of: Restriction
  has value: 0e+00
alternative label: Circular Mil
qudtReference: http://qudt.org/vocab/unit/MIL_Circ
ucumCode: [cml_i]
unitSymbol: cmil
EMMO 967080e5 2f42 4eb2 a3a9 c58143e835f9: A circular mil is a unit of area, equal to the area of a circle with a diameter of one mil (one thousandth of an inch). It is a convenient unit for referring to the area of a wire with a circular cross section, because the area in circular mils can be calculated without reference to pi (π). The area in circular mils, A, of a circle with a diameter of d mils, is given by the formula: Electricians in Canada and the United States are familiar with the circular mil because the National Electrical Code (NEC) uses the circular mil to define wire sizes larger than 0000 AWG. In many NEC publications and uses, large wires may be expressed in thousands of circular mils, which is abbreviated in two different ways: MCM or kcmil. For example, one common wire size used in the NEC has a cross-section of 250,000 circular mils, written as 250 kcmil or 250 MCM, which is the first size larger than 0000 AWG used within the NEC. -- QUDT

Clo
type: Class
comment: A C.G.S System unit for `Thermal Insulance` expressed as "clo". -- QUDT
subclass of: Restriction
  has value: 0e+00
subclass of: Restriction
  has value: 1.55e-01
qudtReference: http://qudt.org/vocab/unit/CLO
unitSymbol: clo
EMMO 967080e5 2f42 4eb2 a3a9 c58143e835f9: A C.G.S System unit for `Thermal Insulance` expressed as "clo". -- QUDT

ColonyFormingUnit
type: Class
comment: "Colony Forming Unit" is a unit for 'Microbial Formation' expressed as CFU. -- QUDT
alternative label: Colony Forming Unit
qudtReference: http://qudt.org/vocab/unit/CFU
ucumCode: [CFU]
unitSymbol: CFU
EMMO 967080e5 2f42 4eb2 a3a9 c58143e835f9: "Colony Forming Unit" is a unit for 'Microbial Formation' expressed as CFU. -- QUDT
wikipediaReference: http://en.wikipedia.org/wiki/Colony-forming_unit

CommonYear
type: Class
comment: 31,536,000-fold of the SI base unit second according a common year with 365 days -- QUDT
subclass of: Restriction
  has value: 3.1536e+07
subclass of: Restriction
  has value: 0e+00
alternative label: Common Year
qudtReference: http://qudt.org/vocab/unit/YR_Common
unitSymbol: yr
EMMO 967080e5 2f42 4eb2 a3a9 c58143e835f9: 31,536,000-fold of the SI base unit second according a common year with 365 days -- QUDT

ConventionalCentiMetreOfWater
type: Class
comment: non SI conforming unit of pressure that corresponds to the static pressure generated by a water column with a height of 1 centimetre -- QUDT
subclass of: Restriction
  has value: 9.80665e+01
subclass of: Restriction
  has value: 0e+00
alternative label: Conventional Centimetre Of Water
qudtReference: http://qudt.org/vocab/unit/CentiM_H2O
ucumCode: cm[H2O]
unitSymbol: cmH₂0
EMMO 967080e5 2f42 4eb2 a3a9 c58143e835f9: non SI conforming unit of pressure that corresponds to the static pressure generated by a water column with a height of 1 centimetre -- QUDT
wikipediaReference: http://en.wikipedia.org/wiki/Centimetre_of_water

ConventionalMilliMetreOfWater
type: Class
comment: unit of pressure - 1 mmH2O is the static pressure exerted by a water column with a height of 1 mm -- QUDT
subclass of: Restriction
  has value: 9.80665e+00
subclass of: Restriction
  has value: 0e+00
alternative label: Conventional Millimetre Of Water
qudtReference: http://qudt.org/vocab/unit/MilliM_H2O
ucumCode: mm[H2O]
unitSymbol: mmH₂0
EMMO 967080e5 2f42 4eb2 a3a9 c58143e835f9: unit of pressure - 1 mmH2O is the static pressure exerted by a water column with a height of 1 mm -- QUDT

Cord
type: Class
comment: The cord is a unit of measure of dry volume used in Canada and the United States to measure firewood and pulpwood. A cord is the amount of wood that, when 'ranked and well stowed' (arranged so pieces are aligned, parallel, touching and compact), occupies a volume of 128 cubic feet (3.62 cubic metres). This corresponds to a well stacked woodpile 4 feet (122 cm) wide, 4 feet (122 cm) high, and 8 feet (244 cm) long; or any other arrangement of linear measurements that yields the same volume. The name cord probably comes from the use of a cord or string to measure it. -- QUDT
subclass of: Restriction
  has value: 3.62e+00
subclass of: Restriction
  has value: 0e+00
qudtReference: http://qudt.org/vocab/unit/CORD
ucumCode: [crd_us]
unitSymbol: cord
EMMO 967080e5 2f42 4eb2 a3a9 c58143e835f9: The cord is a unit of measure of dry volume used in Canada and the United States to measure firewood and pulpwood. A cord is the amount of wood that, when 'ranked and well stowed' (arranged so pieces are aligned, parallel, touching and compact), occupies a volume of 128 cubic feet (3.62 cubic metres). This corresponds to a well stacked woodpile 4 feet (122 cm) wide, 4 feet (122 cm) high, and 8 feet (244 cm) long; or any other arrangement of linear measurements that yields the same volume. The name cord probably comes from the use of a cord or string to measure it. -- QUDT
wikipediaReference: http://en.wikipedia.org/wiki/Cord

CoulombMetre
type: Class
comment: Coulomb Meter (C-m) is a unit in the category of Electric dipole moment. It is also known as atomic unit, u.a., au, ua. This unit is commonly used in the SI unit system. Coulomb Meter (C-m) has a dimension of LTI where L is length, T is time, and I is electric current. This unit is the standard SI unit in this category. -- QUDT
subclass of: Restriction
  has value: 1e+00
subclass of: Restriction
  has value: 0e+00
unit code: A26
qudtReference: http://qudt.org/vocab/unit/C-M
ucumCode: C.m
unitSymbol: C⋅m
EMMO 967080e5 2f42 4eb2 a3a9 c58143e835f9: Coulomb Meter (C-m) is a unit in the category of Electric dipole moment. It is also known as atomic unit, u.a., au, ua. This unit is commonly used in the SI unit system. Coulomb Meter (C-m) has a dimension of LTI where L is length, T is time, and I is electric current. This unit is the standard SI unit in this category. -- QUDT
EMMO c7b62dd7 063a 4c2a 8504 42f7264ba83f: It is also known as atomic unit, u.a., au, ua. This unit is commonly used in the SI unit system. Coulomb Meter (C-m) has a dimension of LTI where L is length, T is time, and I is electric current. This unit is the standard SI unit in this category.

CoulombPerCubicCentiMetre
type: Class
comment: derived SI unit coulomb divided by the 0.000 001-fold of the power of the SI base unit metre by exponent 3 -- QUDT
subclass of: Restriction
  has value: 1e+06
subclass of: Restriction
  has value: 0e+00
alternative label: Coulomb Per Cubic Centimetre
qudtReference: http://qudt.org/vocab/unit/C-PER-CentiM3
ucumCode: C.cm-3
ucumCode: C/cm3
unitSymbol: C/cm³
EMMO 967080e5 2f42 4eb2 a3a9 c58143e835f9: derived SI unit coulomb divided by the 0.000 001-fold of the power of the SI base unit metre by exponent 3 -- QUDT

CoulombPerCubicMilliMetre
type: Class
comment: derived SI unit coulomb divided by the 0.000 000 001-fold of the power of the SI base unit metre by exponent 3 -- QUDT
subclass of: Restriction
  has value: 1e+09
subclass of: Restriction
  has value: 0e+00
alternative label: Coulomb Per Cubic Millimetre
qudtReference: http://qudt.org/vocab/unit/C-PER-MilliM3
ucumCode: C.mm-3
ucumCode: C/mm3
unitSymbol: C/mm³
EMMO 967080e5 2f42 4eb2 a3a9 c58143e835f9: derived SI unit coulomb divided by the 0.000 000 001-fold of the power of the SI base unit metre by exponent 3 -- QUDT

CoulombPerKilogramSecond
type: Class
comment: The SI unit of exposure rate -- QUDT
subclass of: Restriction
  has value: 0e+00
subclass of: Restriction
  has value: 1e+00
alternative label: Coulomb Per Kilogram Second
qudtReference: http://qudt.org/vocab/unit/C-PER-KiloGM-SEC
ucumCode: C.kg-1.s-1
ucumCode: C/(kg.s)
unitSymbol: C/kg⋅s
EMMO 967080e5 2f42 4eb2 a3a9 c58143e835f9: The SI unit of exposure rate -- QUDT

CoulombPerMetre
type: Class
comment: "Coulomb per Meter" is a unit for 'Electric Charge Line Density' expressed as C/m. -- QUDT
subclass of: Restriction
  has value: 1e+00
subclass of: Restriction
  has value: 0e+00
alternative label: Coulomb per Metre
qudtReference: http://qudt.org/vocab/unit/C-PER-M
ucumCode: C.m-1
ucumCode: C/m
unitSymbol: C/m
EMMO 967080e5 2f42 4eb2 a3a9 c58143e835f9: "Coulomb per Meter" is a unit for 'Electric Charge Line Density' expressed as C/m. -- QUDT

CoulombPerMole
type: Class
comment: (C/mol) is a unit in the category of Molar electric charge. It is also known as coulombs/mol. Coulomb Per Mol has a dimension of TN{-1}I where T is time, N is amount of substance, and I is electric current. This unit is the standard SI unit in this category. -- QUDT
subclass of: Restriction
  has value: 1e+00
subclass of: Restriction
  has value: 0e+00
alternative label: Coulomb per Mole
qudtReference: http://qudt.org/vocab/unit/C-PER-MOL
ucumCode: C.mol-1
ucumCode: C/mol
unitSymbol: c/mol
EMMO 967080e5 2f42 4eb2 a3a9 c58143e835f9: (C/mol) is a unit in the category of Molar electric charge. It is also known as coulombs/mol. Coulomb Per Mol has a dimension of TN{-1}I where T is time, N is amount of substance, and I is electric current. This unit is the standard SI unit in this category. -- QUDT

CoulombPerSquareCentiMetre
type: Class
comment: derived SI unit coulomb divided by the 0.0001-fold of the power of the SI base unit metre by exponent 2 -- QUDT
subclass of: Restriction
  has value: 0e+00
subclass of: Restriction
  has value: 1e+04
alternative label: Coulomb Per Square Centimetre
qudtReference: http://qudt.org/vocab/unit/C-PER-CentiM2
ucumCode: C.cm-2
ucumCode: C/cm2
unitSymbol: C/cm²
EMMO 967080e5 2f42 4eb2 a3a9 c58143e835f9: derived SI unit coulomb divided by the 0.0001-fold of the power of the SI base unit metre by exponent 2 -- QUDT

CoulombPerSquareMilliMetre
type: Class
comment: derived SI unit coulomb divided by the 0.000 001-fold of the power of the SI base unit metre by exponent 2 -- QUDT
subclass of: Restriction
  has value: 1e+06
subclass of: Restriction
  has value: 0e+00
alternative label: Coulomb Per Square Millimetre
qudtReference: http://qudt.org/vocab/unit/C-PER-MilliM2
ucumCode: C.mm-2
ucumCode: C/mm2
unitSymbol: C/mm²
EMMO 967080e5 2f42 4eb2 a3a9 c58143e835f9: derived SI unit coulomb divided by the 0.000 001-fold of the power of the SI base unit metre by exponent 2 -- QUDT

CoulombSquareMetre
type: Class
comment: Coulomb Square Meter (C-m2) is a unit in the category of Electric quadrupole moment. This unit is commonly used in the SI unit system. Coulomb Square Meter (C-m2) has a dimension of L2TI where L is length, T is time, and I is electric current. This unit is the standard SI unit in this category. -- QUDT
subclass of: Restriction
  has value: 1e+00
subclass of: Restriction
  has value: 0e+00
alternative label: Coulomb Square Metre
qudtReference: http://qudt.org/vocab/unit/C-M2
ucumCode: C.m2
unitSymbol: C⋅m²
EMMO 967080e5 2f42 4eb2 a3a9 c58143e835f9: Coulomb Square Meter (C-m2) is a unit in the category of Electric quadrupole moment. This unit is commonly used in the SI unit system. Coulomb Square Meter (C-m2) has a dimension of L2TI where L is length, T is time, and I is electric current. This unit is the standard SI unit in this category. -- QUDT

CoulombSquareMetrePerVolt
type: Class
comment: Coulomb Square Meter (C-m2-per-volt) is a unit in the category of Electric polarizability. -- QUDT
subclass of: Restriction
  has value: 1e+00
subclass of: Restriction
  has value: 0e+00
alternative label: Coulomb Square Metre Per Volt
qudtReference: http://qudt.org/vocab/unit/C-M2-PER-V
ucumCode: C.m2.V-1
ucumCode: C.m2/V
unitSymbol: C⋅m²/V
EMMO 967080e5 2f42 4eb2 a3a9 c58143e835f9: Coulomb Square Meter (C-m2-per-volt) is a unit in the category of Electric polarizability. -- QUDT

CountsPerSecond
type: Class
alternative label: Counts per second
qudtReference: http://qudt.org/vocab/unit/NUM-PER-SEC
ucumCode: {#}.s-1
unitSymbol: /s

CubicAngstrom
type: Class
comment: A unit that is a non-SI unit, specifically a CGS unit, of polarizability known informally as polarizability volume. The SI defined units for polarizability are C*m²/V and can be converted to Ångström³ by multiplying the SI value by 4 times pi times the vacuum permittivity and then converting the resulting m³ to Ångström³ through the SI base 10 conversion (multiplying by 10⁻³⁰). -- QUDT
subclass of: Restriction
  has value: 1e-40
subclass of: Restriction
  has value: 0e+00
alternative label: Cubic Angstrom
alternative label: Cubic Ångström
alternative label: CubicÅngström
qudtReference: http://qudt.org/vocab/unit/ANGSTROM3
unitSymbol: Å³
EMMO 967080e5 2f42 4eb2 a3a9 c58143e835f9: A unit that is a non-SI unit, specifically a CGS unit, of polarizability known informally as polarizability volume. The SI defined units for polarizability are C*m²/V and can be converted to Ångström³ by multiplying the SI value by 4 times pi times the vacuum permittivity and then converting the resulting m³ to Ångström³ through the SI base 10 conversion (multiplying by 10⁻³⁰). -- QUDT

CubicCentiMetre
type: Class
comment: The CGS unit of volume, equal to 10-6 cubic meter, 1 milliliter, or about 0.061 023 7 cubic inch -- QUDT
subclass of: Restriction
  has value: 1e-06
subclass of: Restriction
  has value: 0e+00
alternative label: cubic centimetre
qudtReference: http://qudt.org/vocab/unit/CentiM3
ucumCode: cm3
unitSymbol: cm³
EMMO 967080e5 2f42 4eb2 a3a9 c58143e835f9: The CGS unit of volume, equal to 10-6 cubic meter, 1 milliliter, or about 0.061 023 7 cubic inch -- QUDT

CubicCentiMetrePerCubicCentiMetre
type: Class
comment: volume ratio consisting of the 0.000 001-fold of the power of the SI base unit metre with the exponent 3 divided by the power of the SI base unit metre with the exponent 3 -- QUDT
subclass of: Restriction
  has value: 0e+00
subclass of: Restriction
  has value: 1e+00
alternative label: Cubic Centimetre Per Cubic Centimetre
qudtReference: http://qudt.org/vocab/unit/CentiM3-PER-CentiM3
ucumCode: cm3.cm-3
ucumCode: cm3/cm3
unitSymbol: cm³/cm³
EMMO 967080e5 2f42 4eb2 a3a9 c58143e835f9: volume ratio consisting of the 0.000 001-fold of the power of the SI base unit metre with the exponent 3 divided by the power of the SI base unit metre with the exponent 3 -- QUDT

CubicCentiMetrePerCubicMetre
type: Class
comment: volume ratio consisting of the 0.000 001-fold of the power of the SI base unit metre with the exponent 3 divided by the power of the SI base unit metre with the exponent 3 -- QUDT
subclass of: Restriction
  has value: 1e-06
subclass of: Restriction
  has value: 0e+00
alternative label: Cubic Centimetre Per Cubic Metre
qudtReference: http://qudt.org/vocab/unit/CentiM3-PER-M3
ucumCode: cm3.m-3
ucumCode: cm3/m3
unitSymbol: cm³/m³
EMMO 967080e5 2f42 4eb2 a3a9 c58143e835f9: volume ratio consisting of the 0.000 001-fold of the power of the SI base unit metre with the exponent 3 divided by the power of the SI base unit metre with the exponent 3 -- QUDT

CubicCentiMetrePerDay
type: Class
comment: 0,000 001-fold of the power of the SI base unit metre with the exponent 3 divided by the unit day -- QUDT
subclass of: Restriction
  has value: 1.157407e-11
subclass of: Restriction
  has value: 0e+00
alternative label: Cubic Centimetre Per Day
qudtReference: http://qudt.org/vocab/unit/CentiM3-PER-DAY
ucumCode: cm3.d-1
ucumCode: cm3/d
unitSymbol: cm³/day
EMMO 967080e5 2f42 4eb2 a3a9 c58143e835f9: 0,000 001-fold of the power of the SI base unit metre with the exponent 3 divided by the unit day -- QUDT

CubicCentiMetrePerHour
type: Class
comment: 0,000 001-fold of the power of the SI base unit metre with the exponent 3 divided by the unit hour -- QUDT
subclass of: Restriction
  has value: 2.777778e-10
subclass of: Restriction
  has value: 0e+00
alternative label: Cubic Centimetre Per Hour
qudtReference: http://qudt.org/vocab/unit/CentiM3-PER-HR
ucumCode: cm3.h-1
ucumCode: cm3/h
unitSymbol: cm³/h
EMMO 967080e5 2f42 4eb2 a3a9 c58143e835f9: 0,000 001-fold of the power of the SI base unit metre with the exponent 3 divided by the unit hour -- QUDT

CubicCentiMetrePerKelvin
type: Class
comment: 0,000 001-fold of the power of the SI base unit metre with the exponent 3 divided by the SI base unit kelvin -- QUDT
subclass of: Restriction
  has value: 1e-06
subclass of: Restriction
  has value: 0e+00
alternative label: Cubic Centimetre Per Kelvin
qudtReference: http://qudt.org/vocab/unit/CentiM3-PER-K
ucumCode: cm3.K-1
ucumCode: cm3/K
unitSymbol: cm³/K
EMMO 967080e5 2f42 4eb2 a3a9 c58143e835f9: 0,000 001-fold of the power of the SI base unit metre with the exponent 3 divided by the SI base unit kelvin -- QUDT

CubicCentiMetrePerMinute
type: Class
comment: 0,000 001-fold of the power of the SI base unit metre with the exponent 3 divided by the unit minute -- QUDT
subclass of: Restriction
  has value: 1.666667e-08
subclass of: Restriction
  has value: 0e+00
alternative label: Cubic Centimetre Per Minute
qudtReference: http://qudt.org/vocab/unit/CentiM3-PER-MIN
ucumCode: cm3.min-1
ucumCode: cm3/min
unitSymbol: cm³/min
EMMO 967080e5 2f42 4eb2 a3a9 c58143e835f9: 0,000 001-fold of the power of the SI base unit metre with the exponent 3 divided by the unit minute -- QUDT

CubicCentiMetrePerMole
type: Class
comment: 0.000 001-fold of the power of the SI base unit metre with the exponent 3 divided by the SI base unit mol -- QUDT
subclass of: Restriction
  has value: 1e-06
subclass of: Restriction
  has value: 0e+00
alternative label: Cubic Centimetre Per Mole
qudtReference: http://qudt.org/vocab/unit/CentiM3-PER-MOL
ucumCode: cm3.mol-1
ucumCode: cm3/mol
unitSymbol: cm³/mol
EMMO 967080e5 2f42 4eb2 a3a9 c58143e835f9: 0.000 001-fold of the power of the SI base unit metre with the exponent 3 divided by the SI base unit mol -- QUDT

CubicCentiMetrePerMoleSecond
type: Class
comment: A unit that is the 0.000001-fold of the power of the SI base unit metre with the exponent 3 divided by the SI base unit mol multiplied by the SI base unit second. -- QUDT
subclass of: Restriction
  has value: 1e-06
subclass of: Restriction
  has value: 0e+00
alternative label: Cubic centimeter per mole second
qudtReference: http://qudt.org/vocab/unit/CentiM3-PER-MOL-SEC
unitSymbol: cm³/(mol⋅s)
EMMO 967080e5 2f42 4eb2 a3a9 c58143e835f9: A unit that is the 0.000001-fold of the power of the SI base unit metre with the exponent 3 divided by the SI base unit mol multiplied by the SI base unit second. -- QUDT

CubicCentiMetrePerSecond
type: Class
comment: 0,000 001-fold of the power of the SI base unit metre with the exponent 3 divided by the SI base unit second -- QUDT
subclass of: Restriction
  has value: 1e-06
subclass of: Restriction
  has value: 0e+00
alternative label: Cubic Centimetre Per Second
qudtReference: http://qudt.org/vocab/unit/CentiM3-PER-SEC
ucumCode: cm3.s-1
ucumCode: cm3/s
unitSymbol: cm³/s
EMMO 967080e5 2f42 4eb2 a3a9 c58143e835f9: 0,000 001-fold of the power of the SI base unit metre with the exponent 3 divided by the SI base unit second -- QUDT

CubicCoulombMetrePerSquareJoule
type: Class
comment: "Cubic Coulomb Meter per Square Joule" is a unit for 'Cubic Electric Dipole Moment Per Square Energy' expressed as C³ m³ J⁻². -- QUDT
subclass of: Restriction
  has value: 1e+00
subclass of: Restriction
  has value: 0e+00
alternative label: Cubic Coulomb Metre per Square Joule
qudtReference: http://qudt.org/vocab/unit/C3-M-PER-J2
ucumCode: C3.m.J-2
ucumCode: C3.m/J2
unitSymbol: C³⋅m/J²
EMMO 967080e5 2f42 4eb2 a3a9 c58143e835f9: "Cubic Coulomb Meter per Square Joule" is a unit for 'Cubic Electric Dipole Moment Per Square Energy' expressed as C³ m³ J⁻². -- QUDT

CubicDecaMetre
type: Class
comment: 1 000-fold of the power of the SI base unit metre by exponent 3 -- QUDT
subclass of: Restriction
  has value: 1e+03
subclass of: Restriction
  has value: 0e+00
alternative label: Cubic Decametre
qudtReference: http://qudt.org/vocab/unit/DecaM3
ucumCode: dam3
unitSymbol: dam³
EMMO 967080e5 2f42 4eb2 a3a9 c58143e835f9: 1 000-fold of the power of the SI base unit metre by exponent 3 -- QUDT

CubicDeciMetre
type: Class
comment: 0.1-fold of the power of the SI base unit metre with the exponent 3 -- QUDT
subclass of: Restriction
  has value: 1e-03
subclass of: Restriction
  has value: 0e+00
alternative label: Cubic Decimetre
qudtReference: http://qudt.org/vocab/unit/DeciM3
ucumCode: dm3
unitSymbol: dm³
EMMO 967080e5 2f42 4eb2 a3a9 c58143e835f9: 0.1-fold of the power of the SI base unit metre with the exponent 3 -- QUDT

CubicDeciMetrePerCubicMetre
type: Class
comment: volume ratio consisting of the 0.001-fold of the power of the SI base unit metre with the exponent 3 divided by the power of the SI base unit metre with the exponent 3 -- QUDT
subclass of: Restriction
  has value: 1e-03
subclass of: Restriction
  has value: 0e+00
alternative label: Cubic Decimetre Per Cubic Metre
qudtReference: http://qudt.org/vocab/unit/DeciM3-PER-M3
ucumCode: dm3.m-3
ucumCode: dm3/m3
unitSymbol: dm³/m³
EMMO 967080e5 2f42 4eb2 a3a9 c58143e835f9: volume ratio consisting of the 0.001-fold of the power of the SI base unit metre with the exponent 3 divided by the power of the SI base unit metre with the exponent 3 -- QUDT

CubicDeciMetrePerDay
type: Class
comment: 0,001-fold of the power of the SI base unit metre with the exponent 3 divided by the unit for time day -- QUDT
subclass of: Restriction
  has value: 1.157407e-08
subclass of: Restriction
  has value: 0e+00
alternative label: Cubic Decimetre Per Day
qudtReference: http://qudt.org/vocab/unit/DeciM3-PER-DAY
ucumCode: dm3.d-1
ucumCode: dm3/d
unitSymbol: dm³/day
EMMO 967080e5 2f42 4eb2 a3a9 c58143e835f9: 0,001-fold of the power of the SI base unit metre with the exponent 3 divided by the unit for time day -- QUDT

CubicDeciMetrePerHour
type: Class
comment: 0,001-fold of the power of the SI base unit metre with the exponent 3 divided by the unit hour -- QUDT
subclass of: Restriction
  has value: 2.777778e-07
subclass of: Restriction
  has value: 0e+00
alternative label: Cubic Decimetre Per Hour
qudtReference: http://qudt.org/vocab/unit/DeciM3-PER-HR
ucumCode: dm3.h-1
ucumCode: dm3/h
unitSymbol: dm³/h
EMMO 967080e5 2f42 4eb2 a3a9 c58143e835f9: 0,001-fold of the power of the SI base unit metre with the exponent 3 divided by the unit hour -- QUDT

CubicDeciMetrePerMinute
type: Class
comment: 0,001-fold of the power of the SI base unit metre with the exponent 3 divided by the unit for time minute -- QUDT
subclass of: Restriction
  has value: 0e+00
subclass of: Restriction
  has value: 1.666667e-05
alternative label: Cubic Decimetre Per Minute
qudtReference: http://qudt.org/vocab/unit/DeciM3-PER-MIN
ucumCode: dm3.min-3
ucumCode: dm3/min3
unitSymbol: dm³/min
EMMO 967080e5 2f42 4eb2 a3a9 c58143e835f9: 0,001-fold of the power of the SI base unit metre with the exponent 3 divided by the unit for time minute -- QUDT

CubicDeciMetrePerMole
type: Class
comment: 0,001-fold of the power of the SI base unit metre with the exponent 3 divided by the SI base unit mol -- QUDT
subclass of: Restriction
  has value: 0e+00
subclass of: Restriction
  has value: 1e-03
alternative label: Cubic Decimetre Per Mole
qudtReference: http://qudt.org/vocab/unit/DeciM3-PER-MOL
ucumCode: dm3.mol-1
ucumCode: dm3/mol
unitSymbol: dm³/mol
EMMO 967080e5 2f42 4eb2 a3a9 c58143e835f9: 0,001-fold of the power of the SI base unit metre with the exponent 3 divided by the SI base unit mol -- QUDT

CubicDeciMetrePerSecond
type: Class
comment: 0,001-fold of the power of the SI base unit metre with the exponent 3 divided by the unit for time second -- QUDT
subclass of: Restriction
  has value: 1e-03
subclass of: Restriction
  has value: 0e+00
alternative label: Cubic Decimetre Per Second
qudtReference: http://qudt.org/vocab/unit/DeciM3-PER-SEC
ucumCode: dm3.s-1
ucumCode: dm3/s
unitSymbol: dm³/s
EMMO 967080e5 2f42 4eb2 a3a9 c58143e835f9: 0,001-fold of the power of the SI base unit metre with the exponent 3 divided by the unit for time second -- QUDT

CubicFoot
type: Class
comment: The cubic foot is an Imperial and US customary unit of volume, used in the United States and the United Kingdom. It is defined as the volume of a cube with sides of one foot (0.3048 m) in length. To calculate cubic feet multiply length X width X height. -- QUDT
subclass of: Restriction
  has value: 2.831685e-02
subclass of: Restriction
  has value: 0e+00
alternative label: Cubic Foot
qudtReference: http://qudt.org/vocab/unit/FT3
ucumCode: [cft_i]
ucumCode: [ft_i]3
unitSymbol: ft³
EMMO 967080e5 2f42 4eb2 a3a9 c58143e835f9: The cubic foot is an Imperial and US customary unit of volume, used in the United States and the United Kingdom. It is defined as the volume of a cube with sides of one foot (0.3048 m) in length. To calculate cubic feet multiply length X width X height. -- QUDT

CubicFootPerDay
type: Class
comment: power of the unit foot according to the Anglo-American and the Imperial system of units with the exponent 3 divided by the unit for time day -- QUDT
subclass of: Restriction
  has value: 3.277413e-07
subclass of: Restriction
  has value: 0e+00
alternative label: Cubic Foot Per Day
qudtReference: http://qudt.org/vocab/unit/FT3-PER-DAY
ucumCode: [cft_i].d-1
unitSymbol: ft³/day
EMMO 967080e5 2f42 4eb2 a3a9 c58143e835f9: power of the unit foot according to the Anglo-American and the Imperial system of units with the exponent 3 divided by the unit for time day -- QUDT

CubicFootPerDegreeFahrenheit
type: Class
comment: power of the unit foot as a linear measure according to the Anglo-American and the Imperial system of units with the exponent 3 divided by the unit for temperature degree Fahrenheit -- QUDT
subclass of: Restriction
  has value: 5.097033e-02
subclass of: Restriction
  has value: 0e+00
alternative label: Cubic Foot Per Degree Fahrenheit
qudtReference: http://qudt.org/vocab/unit/FT3-PER-DEG_F
ucumCode: [cft_i].[degF]-1
unitSymbol: ft³/°F
EMMO 967080e5 2f42 4eb2 a3a9 c58143e835f9: power of the unit foot as a linear measure according to the Anglo-American and the Imperial system of units with the exponent 3 divided by the unit for temperature degree Fahrenheit -- QUDT

CubicFootPerHour
type: Class
comment: power of the unit foot according to the Anglo-American and the Imperial system of units with the exponent 3 divided by the unit hour -- QUDT
subclass of: Restriction
  has value: 7.865792e-06
subclass of: Restriction
  has value: 0e+00
alternative label: Cubic Foot Per Hour
qudtReference: http://qudt.org/vocab/unit/FT3-PER-HR
ucumCode: [cft_i].h-1
unitSymbol: ft³/hr
EMMO 967080e5 2f42 4eb2 a3a9 c58143e835f9: power of the unit foot according to the Anglo-American and the Imperial system of units with the exponent 3 divided by the unit hour -- QUDT

CubicFootPerMinute
type: Class
comment: "Cubic Foot per Minute" is an Imperial unit for 'Volume Per Unit Time' expressed as ft³/min. -- QUDT
subclass of: Restriction
  has value: 4.719474e-04
subclass of: Restriction
  has value: 0e+00
alternative label: Cubic Foot per Minute
qudtReference: http://qudt.org/vocab/unit/FT3-PER-MIN
ucumCode: [cft_i].min-1
ucumCode: [cft_i]/min
ucumCode: [ft_i]3.min-1
ucumCode: [ft_i]3/min
unitSymbol: ft³/min
EMMO 967080e5 2f42 4eb2 a3a9 c58143e835f9: "Cubic Foot per Minute" is an Imperial unit for 'Volume Per Unit Time' expressed as ft³/min. -- QUDT

CubicFootPerMinuteSquareFoot
type: Class
comment: unit of the volume flow rate according to the Anglio-American and imperial system of units cubic foot per minute related to the transfer area according to the Anglian American and Imperial system of units square foot -- QUDT
subclass of: Restriction
  has value: 5.08e-03
subclass of: Restriction
  has value: 0e+00
alternative label: Cubic Foot Per Minute Square Foot
qudtReference: http://qudt.org/vocab/unit/FT3-PER-MIN-FT2
ucumCode: [cft_i].min-1.[sft_i]-1
unitSymbol: ft³/(min⋅ft²)
EMMO 967080e5 2f42 4eb2 a3a9 c58143e835f9: unit of the volume flow rate according to the Anglio-American and imperial system of units cubic foot per minute related to the transfer area according to the Anglian American and Imperial system of units square foot -- QUDT

CubicFootPerSecond
type: Class
comment: "Cubic Foot per Second" is an Imperial unit for `Volume Per Unit Time` expressed as ft³/s. -- QUDT
subclass of: Restriction
  has value: 2.831685e-02
subclass of: Restriction
  has value: 0e+00
alternative label: Cubic Foot per Second
qudtReference: http://qudt.org/vocab/unit/FT3-PER-SEC
ucumCode: [cft_i].s-1
ucumCode: [cft_i]/s
ucumCode: [ft_i]3.s-1
ucumCode: [ft_i]3/s
unitSymbol: ft³/s
EMMO 967080e5 2f42 4eb2 a3a9 c58143e835f9: "Cubic Foot per Second" is an Imperial unit for `Volume Per Unit Time` expressed as ft³/s. -- QUDT

CubicInch
type: Class
comment: The cubic inch is a unit of measurement for volume in the Imperial units and United States customary units systems. It is the volume of a cube with each of its three sides being one inch long. The cubic inch and the cubic foot are still used as units of volume in the United States, although the common SI units of volume, the liter, milliliter, and cubic meter, are continually replacing them, especially in manufacturing and high technology. One cubic foot is equal to exactly 1728 cubic inches. -- QUDT
subclass of: Restriction
  has value: 1.638706e-05
subclass of: Restriction
  has value: 0e+00
alternative label: Cubic Inch
qudtReference: http://qudt.org/vocab/unit/IN3
ucumCode: [cin_i]
ucumCode: [in_i]3
unitSymbol: in³
EMMO 967080e5 2f42 4eb2 a3a9 c58143e835f9: The cubic inch is a unit of measurement for volume in the Imperial units and United States customary units systems. It is the volume of a cube with each of its three sides being one inch long. The cubic inch and the cubic foot are still used as units of volume in the United States, although the common SI units of volume, the liter, milliliter, and cubic meter, are continually replacing them, especially in manufacturing and high technology. One cubic foot is equal to exactly 1728 cubic inches. -- QUDT

CubicInchPerHour
type: Class
comment: power of the unit inch according to the Anglo-American and the Imperial system of units with the exponent 3 divided by the unit hour -- QUDT
subclass of: Restriction
  has value: 4.551961e-09
subclass of: Restriction
  has value: 0e+00
alternative label: Cubic Inch Per Hour
qudtReference: http://qudt.org/vocab/unit/IN3-PER-HR
ucumCode: [cin_i].h-1
unitSymbol: in³/hr
EMMO 967080e5 2f42 4eb2 a3a9 c58143e835f9: power of the unit inch according to the Anglo-American and the Imperial system of units with the exponent 3 divided by the unit hour -- QUDT

CubicInchPerMinute
type: Class
comment: "Cubic Inch per Minute" is an Imperial unit for 'Volume Per Unit Time' expressed as in³/min. -- QUDT
subclass of: Restriction
  has value: 2.731177e-07
subclass of: Restriction
  has value: 0e+00
alternative label: Cubic Inch per Minute
qudtReference: http://qudt.org/vocab/unit/IN3-PER-MIN
ucumCode: [cin_i].min-1
ucumCode: [cin_i]/min
ucumCode: [in_i]3.min-1
ucumCode: [in_i]3/min
unitSymbol: in³/min
EMMO 967080e5 2f42 4eb2 a3a9 c58143e835f9: "Cubic Inch per Minute" is an Imperial unit for 'Volume Per Unit Time' expressed as in³/min. -- QUDT

CubicInchPerSecond
type: Class
comment: power of the unit inch according to the Anglo-American and the Imperial system of units with the exponent 3 divided by the SI base unit second -- QUDT
subclass of: Restriction
  has value: 1.638706e-05
subclass of: Restriction
  has value: 0e+00
alternative label: Cubic Inch Per Second
qudtReference: http://qudt.org/vocab/unit/IN3-PER-SEC
ucumCode: [cin_i].s-1
unitSymbol: in³/s
EMMO 967080e5 2f42 4eb2 a3a9 c58143e835f9: power of the unit inch according to the Anglo-American and the Imperial system of units with the exponent 3 divided by the SI base unit second -- QUDT

CubicKiloMetrePerSquareSecond
type: Class
comment: `Cubic Kilometer per Square Second` is a unit for `Standard Gravitational Parameter` expressed as km³/s². -- QUDT
subclass of: Restriction
  has value: 1e+09
subclass of: Restriction
  has value: 0e+00
alternative label: Cubic Kilometre per Square Second
qudtReference: http://qudt.org/vocab/unit/KiloM3-PER-SEC2
ucumCode: km3.s-2
ucumCode: km3/s2
unitSymbol: km³/s²
EMMO 967080e5 2f42 4eb2 a3a9 c58143e835f9: `Cubic Kilometer per Square Second` is a unit for `Standard Gravitational Parameter` expressed as km³/s². -- QUDT

CubicMetre
type: Class
comment: The SI unit of volume, equal to 1.0e6 cm3, 1000 liters, 35.3147 ft3, or 1.30795 yd3. A cubic meter holds about 264.17 U.S. liquid gallons or 219.99 British Imperial gallons. -- QUDT
subclass of: Restriction
  has value: 1e+00
subclass of: Restriction
  has value: 0e+00
unit code: MTQ
qudtReference: http://qudt.org/vocab/unit/M3
omReference: http://www.ontology-of-units-of-measure.org/resource/om-2/cubicMetre
ucumCode: m3
dbpediaReference: http://dbpedia.org/resource/Cubic_metre
unitSymbol: m³
EMMO 967080e5 2f42 4eb2 a3a9 c58143e835f9: The SI unit of volume, equal to 1.0e6 cm3, 1000 liters, 35.3147 ft3, or 1.30795 yd3. A cubic meter holds about 264.17 U.S. liquid gallons or 219.99 British Imperial gallons. -- QUDT
wikipediaReference: http://en.wikipedia.org/wiki/Cubic_metre

CubicMetrePerCoulomb
type: Class
comment: Cubic metre per Coulomb.
subclass of: Restriction
  has value: 1e+00
subclass of: Restriction
  has value: 0e+00
qudtReference: http://qudt.org/vocab/unit/M3-PER-C
ucumCode: m3.C-1
unitSymbol: m³/C
EMMO 967080e5 2f42 4eb2 a3a9 c58143e835f9: Cubic metre per Coulomb.

CubicMetrePerCubicMetre
type: Class
comment: Power of the SI base unit metre with the exponent 3 divided by the power of the SI base unit metre with the exponent 3. -- QUDT
subclass of: Restriction
  has value: 0e+00
subclass of: Restriction
  has value: 1e+00
alternative label: Cubic Metre Per Cubic Metre
qudtReference: http://qudt.org/vocab/unit/M3-PER-M3
ucumCode: m3.m-3
unitSymbol: m³/m³
EMMO 967080e5 2f42 4eb2 a3a9 c58143e835f9: Power of the SI base unit metre with the exponent 3 divided by the power of the SI base unit metre with the exponent 3. -- QUDT

CubicMetrePerDay
type: Class
comment: power of the SI base unit metre with the exponent 3 divided by the unit day -- QUDT
subclass of: Restriction
  has value: 1.157407e-05
subclass of: Restriction
  has value: 0e+00
alternative label: Cubic Metre Per Day
qudtReference: http://qudt.org/vocab/unit/M3-PER-DAY
ucumCode: m3.d-1
unitSymbol: m³/day
EMMO 967080e5 2f42 4eb2 a3a9 c58143e835f9: power of the SI base unit metre with the exponent 3 divided by the unit day -- QUDT

CubicMetrePerHectare
type: Class
comment: Cubic metre per hectare.
subclass of: Restriction
  has value: 1e-04
subclass of: Restriction
  has value: 0e+00
qudtReference: http://qudt.org/vocab/unit/M3-PER-HA
ucumCode: m3.har-1
unitSymbol: m^3/ha
EMMO 967080e5 2f42 4eb2 a3a9 c58143e835f9: Cubic metre per hectare.

CubicMetrePerHour
type: Class
comment: Cubic Meter Per Hour (m3/h) is a unit in the category of Volume flow rate. It is also known as cubic meters per hour, cubic metre per hour, cubic metres per hour, cubic meter/hour, cubic metre/hour, cubic meter/hr, cubic metre/hr, flowrate. Cubic Meter Per Hour (m3/h) has a dimension of L3T-1 where L is length, and T is time. It can be converted to the corresponding standard SI unit m3/s by multiplying its value by a factor of 0.00027777777. -- QUDT
subclass of: Restriction
  has value: 2.777778e-04
subclass of: Restriction
  has value: 0e+00
alternative label: Cubic Metre per Hour
qudtReference: http://qudt.org/vocab/unit/M3-PER-HR
ucumCode: m3.h-1
ucumCode: m3/h
unitSymbol: m³/h
EMMO 967080e5 2f42 4eb2 a3a9 c58143e835f9: Cubic Meter Per Hour (m3/h) is a unit in the category of Volume flow rate. It is also known as cubic meters per hour, cubic metre per hour, cubic metres per hour, cubic meter/hour, cubic metre/hour, cubic meter/hr, cubic metre/hr, flowrate. Cubic Meter Per Hour (m3/h) has a dimension of L3T-1 where L is length, and T is time. It can be converted to the corresponding standard SI unit m3/s by multiplying its value by a factor of 0.00027777777. -- QUDT

CubicMetrePerKelvin
type: Class
comment: Cubic metre per Kelvin.
subclass of: Restriction
  has value: 1e+00
subclass of: Restriction
  has value: 0e+00
qudtReference: http://qudt.org/vocab/unit/M3-PER-K
ucumCode: m3.K-1
unitSymbol: m³/K
EMMO 967080e5 2f42 4eb2 a3a9 c58143e835f9: Cubic metre per Kelvin.

CubicMetrePerKilogram
type: Class
comment: Cubic Meter Per Kilogram (m3/kg) is a unit in the category of Specific volume. It is also known as cubic meters per kilogram, cubic metre per kilogram, cubic metres per kilogram, cubic meter/kilogram, cubic metre/kilogram. This unit is commonly used in the SI unit system. Cubic Meter Per Kilogram (m3/kg) has a dimension of M-1L3 where M is mass, and L is length. This unit is the standard SI unit in this category. -- QUDT
subclass of: Restriction
  has value: 1e+00
subclass of: Restriction
  has value: 0e+00
alternative label: Cubic Metre per Kilogram
qudtReference: http://qudt.org/vocab/unit/M3-PER-KiloGM
ucumCode: m3.kg-1
ucumCode: m3/kg
unitSymbol: m³/kg
EMMO 967080e5 2f42 4eb2 a3a9 c58143e835f9: Cubic Meter Per Kilogram (m3/kg) is a unit in the category of Specific volume. It is also known as cubic meters per kilogram, cubic metre per kilogram, cubic metres per kilogram, cubic meter/kilogram, cubic metre/kilogram. This unit is commonly used in the SI unit system. Cubic Meter Per Kilogram (m3/kg) has a dimension of M-1L3 where M is mass, and L is length. This unit is the standard SI unit in this category. -- QUDT

CubicMetrePerKilogramSquareSecond
type: Class
comment: Cubic metre per kilogram and square second.
subclass of: Restriction
  has value: 0e+00
subclass of: Restriction
  has value: 1e+00
qudtReference: http://qudt.org/vocab/unit/M3-PER-KiloGM-SEC2
ucumCode: m3.(kg.s2)-1
ucumCode: m3.kg-1.s-2
ucumCode: m3/(kg.s2)
unitSymbol: m³/(kg⋅s²)
EMMO 967080e5 2f42 4eb2 a3a9 c58143e835f9: Cubic metre per kilogram and square second.

CubicMetrePerMinute
type: Class
comment: power of the SI base unit metre with the exponent 3 divided by the unit minute -- QUDT
subclass of: Restriction
  has value: 1.666667e-02
subclass of: Restriction
  has value: 0e+00
alternative label: Cubic Metre Per Minute
qudtReference: http://qudt.org/vocab/unit/M3-PER-MIN
ucumCode: m3.min-1
unitSymbol: m³/min
EMMO 967080e5 2f42 4eb2 a3a9 c58143e835f9: power of the SI base unit metre with the exponent 3 divided by the unit minute -- QUDT

CubicMetrePerMole
type: Class
comment: The molar volume, symbol Vm, is the volume occupied by one mole of a substance (chemical element or chemical compound) at a given temperature and pressure. It is equal to the molar mass (M) divided by the mass density. It has the SI unit cubic metres per mole m3/mol, although it is more practical to use the units cubic decimetres per mole dm3/mol for gases and cubic centimetres per mole cm3/mol for liquids and solids. -- QUDT
subclass of: Restriction
  has value: 1e+00
subclass of: Restriction
  has value: 0e+00
alternative label: Cubic Metre per Mole
qudtReference: http://qudt.org/vocab/unit/M3-PER-MOL
ucumCode: m3.mol-1
ucumCode: m3/mol
unitSymbol: m³/mol
EMMO 967080e5 2f42 4eb2 a3a9 c58143e835f9: The molar volume, symbol Vm, is the volume occupied by one mole of a substance (chemical element or chemical compound) at a given temperature and pressure. It is equal to the molar mass (M) divided by the mass density. It has the SI unit cubic metres per mole m3/mol, although it is more practical to use the units cubic decimetres per mole dm3/mol for gases and cubic centimetres per mole cm3/mol for liquids and solids. -- QUDT

CubicMetrePerSecond
type: Class
comment: A cubic metre per second (m³s⁻¹, m³/s), cumecs or cubic meter per second in American English) is a derived SI unit of flow rate equal to that of a stere or cube with sides of one metre ( u0303 39.37 in) in length exchanged or moving each second. It is popularly used for water flow, especially in rivers and streams, and fractions for HVAC values measuring air flow. -- QUDT
subclass of: Restriction
  has value: 1e+00
subclass of: Restriction
  has value: 0e+00
alternative label: Cubic Metre per Second
qudtReference: http://qudt.org/vocab/unit/M3-PER-SEC
ucumCode: m3.s-1
ucumCode: m3/s
unitSymbol: m³/s
EMMO 967080e5 2f42 4eb2 a3a9 c58143e835f9: A cubic metre per second (m³s⁻¹, m³/s), cumecs or cubic meter per second in American English) is a derived SI unit of flow rate equal to that of a stere or cube with sides of one metre ( u0303 39.37 in) in length exchanged or moving each second. It is popularly used for water flow, especially in rivers and streams, and fractions for HVAC values measuring air flow. -- QUDT

CubicMetrePerSquareMetre
type: Class
comment: power of the SI base unit metre with the exponent 3 divided by the power of the SI base unit metre with the exponent 2 -- QUDT
subclass of: Restriction
  has value: 0e+00
subclass of: Restriction
  has value: 1e+00
alternative label: Cubic Metre Per Square Metre
qudtReference: http://qudt.org/vocab/unit/M3-PER-M2
ucumCode: m3.m-2
unitSymbol: m³/m²
EMMO 967080e5 2f42 4eb2 a3a9 c58143e835f9: power of the SI base unit metre with the exponent 3 divided by the power of the SI base unit metre with the exponent 2 -- QUDT

CubicMetrePerSquareSecond
type: Class
comment: `Cubic Meter per Square Second` is a C.G.S System unit for `Standard Gravitational Parameter` expressed as m³/s² -- QUDT
subclass of: Restriction
  has value: 1e+00
subclass of: Restriction
  has value: 0e+00
alternative label: Cubic Metre per Square Second
qudtReference: http://qudt.org/vocab/unit/M3-PER-SEC2
ucumCode: m3.s-2
ucumCode: m3/s2
unitSymbol: m³/s²
EMMO 967080e5 2f42 4eb2 a3a9 c58143e835f9: `Cubic Meter per Square Second` is a C.G.S System unit for `Standard Gravitational Parameter` expressed as m³/s² -- QUDT

CubicMicroMetrePerCubicMetre
type: Class
comment: Cubic micrometre per cubic metre unit.
subclass of: Restriction
  has value: 0e+00
subclass of: Restriction
  has value: 1e-18
qudtReference: http://qudt.org/vocab/unit/MicroM3-PER-M3
ucumCode: um3.m-3
unitSymbol: µm³/m³
EMMO 967080e5 2f42 4eb2 a3a9 c58143e835f9: Cubic micrometre per cubic metre unit.

CubicMicroMetrePerMilliLitre
type: Class
comment: Cubic micrometre per millilitre.
subclass of: Restriction
  has value: 0e+00
subclass of: Restriction
  has value: 1e-12
qudtReference: http://qudt.org/vocab/unit/MicroM3-PER-MilliL
ucumCode: um3.mL-1
unitSymbol: µm³/mL
EMMO 967080e5 2f42 4eb2 a3a9 c58143e835f9: Cubic micrometre per millilitre.

CubicMile
type: Class
comment: A cubic mile is an imperial / U.S. customary unit of volume, used in the United States, Canada, and the United Kingdom. It is defined as the volume of a cube with sides of 1 mile in length. -- QUDT
subclass of: Restriction
  has value: 4.168182e+09
subclass of: Restriction
  has value: 0e+00
alternative label: Cubic Mile
qudtReference: http://qudt.org/vocab/unit/MI3
ucumCode: [mi_i]3
unitSymbol: mi³
EMMO 967080e5 2f42 4eb2 a3a9 c58143e835f9: A cubic mile is an imperial / U.S. customary unit of volume, used in the United States, Canada, and the United Kingdom. It is defined as the volume of a cube with sides of 1 mile in length. -- QUDT

CubicMilliMetre
type: Class
comment: A metric measure of volume or capacity equal to a cube 1 millimeter on each edge -- QUDT
subclass of: Restriction
  has value: 1e-09
subclass of: Restriction
  has value: 0e+00
alternative label: Cubic Millimetre
qudtReference: http://qudt.org/vocab/unit/MilliM3
ucumCode: mm3
unitSymbol: mm³
EMMO 967080e5 2f42 4eb2 a3a9 c58143e835f9: A metric measure of volume or capacity equal to a cube 1 millimeter on each edge -- QUDT

CubicMilliMetrePerCubicMetre
type: Class
comment: volume ratio consisting of the 0.000000001-fold of the power of the SI base unit metre with the exponent 3 divided by the power of the SI base unit metre with the exponent 3 -- QUDT
subclass of: Restriction
  has value: 1e-09
subclass of: Restriction
  has value: 0e+00
alternative label: Cubic Millimetre Per Cubic Metre
qudtReference: http://qudt.org/vocab/unit/MilliM3-PER-M3
ucumCode: mm3.m-3
unitSymbol: mm³/m³
EMMO 967080e5 2f42 4eb2 a3a9 c58143e835f9: volume ratio consisting of the 0.000000001-fold of the power of the SI base unit metre with the exponent 3 divided by the power of the SI base unit metre with the exponent 3 -- QUDT

CubicYard
type: Class
comment: A cubic yard is an Imperial / U.S. customary unit of volume, used in the United States, Canada, and the UK. It is defined as the volume of a cube with sides of 1 yard in length. -- QUDT
subclass of: Restriction
  has value: 7.645549e-01
subclass of: Restriction
  has value: 0e+00
alternative label: Cubic Yard
qudtReference: http://qudt.org/vocab/unit/YD3
ucumCode: [cyd_i]
ucumCode: [yd_i]3
unitSymbol: yd³
EMMO 967080e5 2f42 4eb2 a3a9 c58143e835f9: A cubic yard is an Imperial / U.S. customary unit of volume, used in the United States, Canada, and the UK. It is defined as the volume of a cube with sides of 1 yard in length. -- QUDT

CubicYardPerDay
type: Class
comment: power of the unit yard according to the Anglo-American and the Imperial system of units with the exponent 3 divided by the unit for time day -- QUDT
subclass of: Restriction
  has value: 8.849015e-06
subclass of: Restriction
  has value: 0e+00
alternative label: Cubic Yard Per Day
qudtReference: http://qudt.org/vocab/unit/YD3-PER-DAY
ucumCode: [cyd_i].d-1
unitSymbol: yd³/day
EMMO 967080e5 2f42 4eb2 a3a9 c58143e835f9: power of the unit yard according to the Anglo-American and the Imperial system of units with the exponent 3 divided by the unit for time day -- QUDT

CubicYardPerDegreeFahrenheit
type: Class
comment: power of the unit yard according to the Anglo-American and the Imperial system of units with the exponent 3 divided by the unit for temperature degree Fahrenheit -- QUDT
subclass of: Restriction
  has value: 1.376199e+00
subclass of: Restriction
  has value: 0e+00
alternative label: Cubic Yard Per Degree Fahrenheit
qudtReference: http://qudt.org/vocab/unit/YD3-PER-DEG_F
ucumCode: [cyd_i].[degF]-1
unitSymbol: yd³/°F
EMMO 967080e5 2f42 4eb2 a3a9 c58143e835f9: power of the unit yard according to the Anglo-American and the Imperial system of units with the exponent 3 divided by the unit for temperature degree Fahrenheit -- QUDT

CubicYardPerHour
type: Class
comment: power of the unit yard according to the Anglo-American and the Imperial system of units with the exponent 3 divided by the unit for the time hour -- QUDT
subclass of: Restriction
  has value: 2.123763e-04
subclass of: Restriction
  has value: 0e+00
alternative label: Cubic Yard Per Hour
qudtReference: http://qudt.org/vocab/unit/YD3-PER-HR
ucumCode: [cyd_i].h-1
unitSymbol: yd³/hr
EMMO 967080e5 2f42 4eb2 a3a9 c58143e835f9: power of the unit yard according to the Anglo-American and the Imperial system of units with the exponent 3 divided by the unit for the time hour -- QUDT

CubicYardPerMinute
type: Class
comment: "Cubic Yard per Minute" is an Imperial unit for 'Volume Per Unit Time' expressed as yd³/min. -- QUDT
subclass of: Restriction
  has value: 1.274258e-02
subclass of: Restriction
  has value: 0e+00
alternative label: Cubic Yard per Minute
qudtReference: http://qudt.org/vocab/unit/YD3-PER-MIN
ucumCode: [cyd_i].min-1
ucumCode: [cyd_i]/min
ucumCode: [yd_i]3.min-1
ucumCode: [yd_i]3/min
unitSymbol: yd³/min
EMMO 967080e5 2f42 4eb2 a3a9 c58143e835f9: "Cubic Yard per Minute" is an Imperial unit for 'Volume Per Unit Time' expressed as yd³/min. -- QUDT

CubicYardPerSecond
type: Class
comment: power of the unit and the Anglo-American and Imperial system of units with the exponent 3 divided by the SI base unit second -- QUDT
subclass of: Restriction
  has value: 7.645549e-01
subclass of: Restriction
  has value: 0e+00
alternative label: Cubic Yard Per Second
qudtReference: http://qudt.org/vocab/unit/YD3-PER-SEC
ucumCode: [cyd_i].s-1
unitSymbol: yd³/s
EMMO 967080e5 2f42 4eb2 a3a9 c58143e835f9: power of the unit and the Anglo-American and Imperial system of units with the exponent 3 divided by the SI base unit second -- QUDT

Cup_Us
type: Class
comment: unit of the volume according to the Anglo-American system of units -- QUDT
subclass of: Restriction
  has value: 2.365882e-04
subclass of: Restriction
  has value: 0e+00
alternative label: Cup (US)
qudtReference: http://qudt.org/vocab/unit/CUP_US
ucumCode: [cup_us]
unitSymbol: cup{US}
EMMO 967080e5 2f42 4eb2 a3a9 c58143e835f9: unit of the volume according to the Anglo-American system of units -- QUDT

Dalton
type: Class
comment: One dalton is defined as one twelfth of the mass of an unbound neutral atom of carbon-12 in its nuclear and electronic ground state.
comment: The unified atomic mass unit (symbol: μ) or dalton (symbol: Da) is a unit that is used for indicating mass on an atomic or molecular scale. It is defined as one twelfth of the rest mass of an unbound atom of carbon-12 in its nuclear and electronic ground state, and has a value of 1.660538782(83) × 10⁻²⁷ kg. One Da is approximately equal to the mass of one proton or one neutron. The CIPM have categorised it as a "non-SI unit whose values in SI units must be obtained experimentally". -- QUDT
subclass of: Restriction
  has value: Da
subclass of: Restriction
  has value: 1.660539e-27
subclass of: Restriction
  has value: 0e+00
alternative label: AtomicMassUnit
unit code: D43
qudtReference: http://qudt.org/vocab/unit/Da
ucumCode: u
dbpediaReference: http://dbpedia.org/page/Unified_atomic_mass_unit
EMMO 70fe84ff 99b6 4206 a9fc 9a8931836d84: One dalton is defined as one twelfth of the mass of an unbound neutral atom of carbon-12 in its nuclear and electronic ground state.
unitSymbol: amu
EMMO 967080e5 2f42 4eb2 a3a9 c58143e835f9: The unified atomic mass unit (symbol: μ) or dalton (symbol: Da) is a unit that is used for indicating mass on an atomic or molecular scale. It is defined as one twelfth of the rest mass of an unbound atom of carbon-12 in its nuclear and electronic ground state, and has a value of 1.660538782(83) × 10⁻²⁷ kg. One Da is approximately equal to the mass of one proton or one neutron. The CIPM have categorised it as a "non-SI unit whose values in SI units must be obtained experimentally". -- QUDT
wikipediaReference: http://en.wikipedia.org/wiki/Atomic_mass_unit
iupacReference: https://doi.org/10.1351/goldbook.D01514

Day
type: Class
comment: A measure of time defined as 86 400 seconds.
comment: Mean solar day -- QUDT
subclass of: Restriction
  has value: 8.64e+04
subclass of: Restriction
  has value: 0e+00
subclass of: Restriction
  has value: d
unit code: DAY
qudtReference: http://qudt.org/vocab/unit/DAY
ucumCode: d
dbpediaReference: http://dbpedia.org/page/Day
EMMO 70fe84ff 99b6 4206 a9fc 9a8931836d84: A measure of time defined as 86 400 seconds.
EMMO 967080e5 2f42 4eb2 a3a9 c58143e835f9: Mean solar day -- QUDT
wikipediaReference: http://en.wikipedia.org/wiki/Day
iupacReference: https://doi.org/10.1351/goldbook.D01527

DeathsPer1000IndividualsPerYear
type: Class
comment: The typical expression of mortality rate, expressed as deaths per 1000 individuals, per year. -- QUDT
subclass of: Restriction
  has value: 1e-03
subclass of: Restriction
  has value: 0e+00
alternative label: Deaths per 1000 individuals per year
qudtReference: http://qudt.org/vocab/unit/DEATHS-PER-KiloINDIV-YR
unitSymbol: deaths/1000 individuals/yr
EMMO 967080e5 2f42 4eb2 a3a9 c58143e835f9: The typical expression of mortality rate, expressed as deaths per 1000 individuals, per year. -- QUDT
wikipediaReference: https://en.wikipedia.org/wiki/Mortality_rate

DeathsPerMillionIndividualsPerYear
type: Class
comment: The expression of mortality rate, expressed as deaths per Million individuals, per year. -- QUDT
subclass of: Restriction
  has value: 1e-06
subclass of: Restriction
  has value: 0e+00
alternative label: Deaths per Million individuals per year
qudtReference: http://qudt.org/vocab/unit/DEATHS-PER-MegaINDIV-YR
unitSymbol: deaths/million individuals/yr
EMMO 967080e5 2f42 4eb2 a3a9 c58143e835f9: The expression of mortality rate, expressed as deaths per Million individuals, per year. -- QUDT
wikipediaReference: https://en.wikipedia.org/wiki/Mortality_rate

Debye
type: Class
comment: "Debye" is a C.G.S System unit for 'Electric Dipole Moment' expressed as D. -- QUDT
subclass of: Restriction
  has value: 3.33564e-30
subclass of: Restriction
  has value: 0e+00
qudtReference: http://qudt.org/vocab/unit/Debye
unitSymbol: D
EMMO 967080e5 2f42 4eb2 a3a9 c58143e835f9: "Debye" is a C.G.S System unit for 'Electric Dipole Moment' expressed as D. -- QUDT
wikipediaReference: http://en.wikipedia.org/wiki/Debye

DecaCoulomb
type: Class
comment: A DecaCoulomb is 10 C. -- QUDT
subclass of: Restriction
  some values from: Coulomb
subclass of: Restriction
  has value: 1e+01
subclass of: Restriction
  has value: 0e+00
qudtReference: http://qudt.org/vocab/unit/DecaC
ucumCode: daC
unitSymbol: daC
EMMO 967080e5 2f42 4eb2 a3a9 c58143e835f9: A DecaCoulomb is 10 C. -- QUDT

DecaGram
type: Class
comment: 0,01-fold of the SI base unit kilogram -- QUDT
subclass of: Restriction
  has value: 1e-02
subclass of: Restriction
  some values from: Gram
subclass of: Restriction
  has value: 0e+00
qudtReference: http://qudt.org/vocab/unit/DecaGM
ucumCode: dag
unitSymbol: dag
EMMO 967080e5 2f42 4eb2 a3a9 c58143e835f9: 0,01-fold of the SI base unit kilogram -- QUDT

DecaLitre
type: Class
comment: 10-fold of the unit litre -- QUDT
subclass of: Restriction
  has value: 0e+00
subclass of: Restriction
  some values from: Litre
subclass of: Restriction
  has value: 1e-02
qudtReference: http://qudt.org/vocab/unit/DecaL
ucumCode: daL
unitSymbol: daL
EMMO 967080e5 2f42 4eb2 a3a9 c58143e835f9: 10-fold of the unit litre -- QUDT

DecaMetre
type: Class
comment: 10-fold of the SI base unit metre -- QUDT
subclass of: Restriction
  some values from: Metre
subclass of: Restriction
  has value: 1e+01
subclass of: Restriction
  has value: 0e+00
qudtReference: http://qudt.org/vocab/unit/DecaM
ucumCode: dam
unitSymbol: dam
EMMO 967080e5 2f42 4eb2 a3a9 c58143e835f9: 10-fold of the SI base unit metre -- QUDT

DecaPascal
type: Class
comment: 10-fold of the derived SI unit pascal -- QUDT
subclass of: Restriction
  has value: 1e+01
subclass of: Restriction
  has value: 0e+00
subclass of: Restriction
  some values from: Pascal
qudtReference: http://qudt.org/vocab/unit/DecaPA
ucumCode: daPa
unitSymbol: daPa
EMMO 967080e5 2f42 4eb2 a3a9 c58143e835f9: 10-fold of the derived SI unit pascal -- QUDT

DecaRe
type: Class
comment: unit of the area which is mainly common in the agriculture and forestry: 1 da = 10 a -- QUDT
subclass of: Restriction
  has value: 1e+03
subclass of: Restriction
  has value: 0e+00
qudtReference: http://qudt.org/vocab/unit/DecaARE
ucumCode: daar
unitSymbol: daa
EMMO 967080e5 2f42 4eb2 a3a9 c58143e835f9: unit of the area which is mainly common in the agriculture and forestry: 1 da = 10 a -- QUDT

Decade
type: Class
comment: One decade is a factor of 10 difference between two numbers (an order of magnitude difference) measured on a logarithmic scale. It is especially useful when referring to frequencies and when describing frequency response of electronic systems, such as audio amplifiers and filters. The factor-of-ten in a decade can be in either direction: so one decade up from 100 Hz is 1000 Hz, and one decade down is 10 Hz. The factor-of-ten is what is important, not the unit used, so 3.14 rad/s is one decade down from 31.4 rad/s. -- QUDT
subclass of: Restriction
  has value: 0e+00
subclass of: Restriction
  has value: 1e+00
qudtReference: http://qudt.org/vocab/unit/DECADE
unitSymbol: dec
EMMO 967080e5 2f42 4eb2 a3a9 c58143e835f9: One decade is a factor of 10 difference between two numbers (an order of magnitude difference) measured on a logarithmic scale. It is especially useful when referring to frequencies and when describing frequency response of electronic systems, such as audio amplifiers and filters. The factor-of-ten in a decade can be in either direction: so one decade up from 100 Hz is 1000 Hz, and one decade down is 10 Hz. The factor-of-ten is what is important, not the unit used, so 3.14 rad/s is one decade down from 31.4 rad/s. -- QUDT
wikipediaReference: http://en.wikipedia.org/wiki/Decade_(log_scale)

DeciBar
type: Class
comment: The bar is a non-SI unit of pressure, defined by the IUPAC as exactly equal to 100,000 Pa. It is about equal to the atmospheric pressure on Earth at sea level, and since 1982 the IUPAC has recommended that the standard for atmospheric pressure should be harmonized to 100,000 Pa = 1 bar ≈ 750.0616827 Torr. Units derived from the bar are the megabar (symbol: Mbar), kilobar (symbol: kbar), decibar (symbol: dbar), centibar (symbol: cbar), and millibar (symbol: mbar or mb). They are not SI or cgs units, but they are accepted for use with the SI. -- QUDT
subclass of: Restriction
  some values from: Bar
subclass of: Restriction
  has value: 1e+04
subclass of: Restriction
  has value: 0e+00
qudtReference: http://qudt.org/vocab/unit/DeciBAR
ucumCode: dbar
unitSymbol: dbar
EMMO 967080e5 2f42 4eb2 a3a9 c58143e835f9: The bar is a non-SI unit of pressure, defined by the IUPAC as exactly equal to 100,000 Pa. It is about equal to the atmospheric pressure on Earth at sea level, and since 1982 the IUPAC has recommended that the standard for atmospheric pressure should be harmonized to 100,000 Pa = 1 bar ≈ 750.0616827 Torr. Units derived from the bar are the megabar (symbol: Mbar), kilobar (symbol: kbar), decibar (symbol: dbar), centibar (symbol: cbar), and millibar (symbol: mbar or mb). They are not SI or cgs units, but they are accepted for use with the SI. -- QUDT
wikipediaReference: http://en.wikipedia.org/wiki/Bar_(unit)

DeciBarPerYear
type: Class
comment: A rate of change of pressure expressed in decibars over a period of an average calendar year (365.25 days). -- QUDT
subclass of: Restriction
  has value: 3.1688e-04
subclass of: Restriction
  has value: 0e+00
alternative label: Decibars per year
qudtReference: http://qudt.org/vocab/unit/DeciBAR-PER-YR
ucumCode: dbar.a-1
unitSymbol: dbar/yr
EMMO 967080e5 2f42 4eb2 a3a9 c58143e835f9: A rate of change of pressure expressed in decibars over a period of an average calendar year (365.25 days). -- QUDT

DeciBel
type: Class
comment: A customary logarithmic measure most commonly used (in various ways) for measuring sound.Sound is measured on a logarithmic scale. Informally, if one sound is 1 bel (10 decibels) "louder" than another, this means the louder sound is 10 times louder than the fainter one. A difference of 20 decibels corresponds to an increase of 10 x 10 or 100 times in intensity. The beginning of the scale, 0 decibels, can be set in different ways, depending on exactly the aspect of sound being measured. For sound intensity (the power of the sound waves per unit of area) 0 decibel is equal to 1 picoWatts per Metre Squared. This corresponds approximately to the faintest sound that can be detected by a person who has good hearing. For sound pressure (the pressure exerted by the sound waves) 0 decibels equals 20 micropascals RMS, and for sound power 0 decibels sometimes equals 1 picoWatt. In all cases, one decibel equals ≈ 0.115129 neper. -- QUDT
subclass of: Restriction
  some values from: Bel
subclass of: Restriction
  has value: 1e-01
subclass of: Restriction
  has value: 0e+00
qudtReference: http://qudt.org/vocab/unit/DeciB
ucumCode: dB
unitSymbol: dB
EMMO 967080e5 2f42 4eb2 a3a9 c58143e835f9: A customary logarithmic measure most commonly used (in various ways) for measuring sound.Sound is measured on a logarithmic scale. Informally, if one sound is 1 bel (10 decibels) "louder" than another, this means the louder sound is 10 times louder than the fainter one. A difference of 20 decibels corresponds to an increase of 10 x 10 or 100 times in intensity. The beginning of the scale, 0 decibels, can be set in different ways, depending on exactly the aspect of sound being measured. For sound intensity (the power of the sound waves per unit of area) 0 decibel is equal to 1 picoWatts per Metre Squared. This corresponds approximately to the faintest sound that can be detected by a person who has good hearing. For sound pressure (the pressure exerted by the sound waves) 0 decibels equals 20 micropascals RMS, and for sound power 0 decibels sometimes equals 1 picoWatt. In all cases, one decibel equals ≈ 0.115129 neper. -- QUDT
wikipediaReference: http://en.wikipedia.org/wiki/Decibel

DeciBelCarrierUnit
type: Class
comment: "Decibel Carrier Unit" is a unit for 'Signal Detection Threshold' expressed as dBc. -- QUDT
alternative label: Decibel Carrier Unit
qudtReference: http://qudt.org/vocab/unit/DeciB_C
unitSymbol: dBc
EMMO 967080e5 2f42 4eb2 a3a9 c58143e835f9: "Decibel Carrier Unit" is a unit for 'Signal Detection Threshold' expressed as dBc. -- QUDT

DeciBelReferredTo1Mw
type: Class
comment: "Decibel Referred to 1mw" is a 'Dimensionless Ratio' expressed as dBm. -- QUDT
alternative label: Decibel Referred to 1mw
qudtReference: http://qudt.org/vocab/unit/DeciB_M
unitSymbol: dBmW
EMMO 967080e5 2f42 4eb2 a3a9 c58143e835f9: "Decibel Referred to 1mw" is a 'Dimensionless Ratio' expressed as dBm. -- QUDT

DeciCoulomb
type: Class
comment: A DeciCoulomb is 10⁻¹ C. -- QUDT
subclass of: Restriction
  has value: 0e+00
subclass of: Restriction
  some values from: Coulomb
subclass of: Restriction
  has value: 1e-01
qudtReference: http://qudt.org/vocab/unit/DeciC
ucumCode: dC
unitSymbol: dC
EMMO 967080e5 2f42 4eb2 a3a9 c58143e835f9: A DeciCoulomb is 10⁻¹ C. -- QUDT

DeciGram
type: Class
comment: 0.0001-fold of the SI base unit kilogram -- QUDT
subclass of: Restriction
  has value: 1e-04
subclass of: Restriction
  some values from: Gram
subclass of: Restriction
  has value: 0e+00
qudtReference: http://qudt.org/vocab/unit/DeciGM
ucumCode: dg
unitSymbol: dg
EMMO 967080e5 2f42 4eb2 a3a9 c58143e835f9: 0.0001-fold of the SI base unit kilogram -- QUDT

DeciLitre
type: Class
comment: 0.1-fold of the unit litre -- QUDT
subclass of: Restriction
  some values from: Litre
subclass of: Restriction
  has value: 1e-04
subclass of: Restriction
  has value: 0e+00
qudtReference: http://qudt.org/vocab/unit/DeciL
ucumCode: dL
unitSymbol: dL
EMMO 967080e5 2f42 4eb2 a3a9 c58143e835f9: 0.1-fold of the unit litre -- QUDT

DeciLitrePerGram
type: Class
comment: 0.1-fold of the unit of the volume litre divided by the 0.001-fold of the SI base unit kilogram -- QUDT
subclass of: Restriction
  has value: 1e-01
subclass of: Restriction
  has value: 0e+00
alternative label: Decilitre Per Gram
qudtReference: http://qudt.org/vocab/unit/DeciL-PER-GM
ucumCode: dL.g-1
ucumCode: dL/g
unitSymbol: dL/g
EMMO 967080e5 2f42 4eb2 a3a9 c58143e835f9: 0.1-fold of the unit of the volume litre divided by the 0.001-fold of the SI base unit kilogram -- QUDT

DeciMetre
type: Class
comment: A decimeter is a tenth of a meter. -- QUDT
subclass of: Restriction
  has value: 1e-01
subclass of: Restriction
  has value: 0e+00
subclass of: Restriction
  some values from: Metre
qudtReference: http://qudt.org/vocab/unit/DeciM
ucumCode: dm
unitSymbol: dm
EMMO 967080e5 2f42 4eb2 a3a9 c58143e835f9: A decimeter is a tenth of a meter. -- QUDT

DeciNewton
type: Class
subclass of: Restriction
  has value: 1e-01
subclass of: Restriction
  some values from: Newton
subclass of: Restriction
  has value: 0e+00
qudtReference: http://qudt.org/vocab/unit/DeciN
unitSymbol: dN

DeciNewtonMetre
type: Class
comment: 0.1-fold of the product of the derived SI unit joule and the SI base unit metre -- QUDT
subclass of: Restriction
  some values from: NewtonMetre
subclass of: Restriction
  has value: 1e-01
subclass of: Restriction
  has value: 0e+00
alternative label: Decinewton Metre
qudtReference: http://qudt.org/vocab/unit/DeciN-M
ucumCode: dN.m
unitSymbol: dN⋅m
EMMO 967080e5 2f42 4eb2 a3a9 c58143e835f9: 0.1-fold of the product of the derived SI unit joule and the SI base unit metre -- QUDT

DeciSiemens
type: Class
comment: A decisiemens is 0.1 S.
subclass of: Restriction
  some values from: Siemens
subclass of: Restriction
  has value: 1e-01
subclass of: Restriction
  has value: 0e+00
alternative label: decisiemens
qudtReference: http://qudt.org/vocab/unit/DeciS
unitSymbol: dS
EMMO 967080e5 2f42 4eb2 a3a9 c58143e835f9: A decisiemens is 0.1 S.

DeciSiemensPerMetre
type: Class
comment: Decisiemens per metre. -- QUDT
subclass of: Restriction
  some values from: SiemensPerMetre
subclass of: Restriction
  has value: 1e-01
subclass of: Restriction
  has value: 0e+00
alternative label: decisiemens per metre
qudtReference: http://qudt.org/vocab/unit/DeciS-PER-M
ucumCode: dS.m-1
ucumCode: dS/m
unitSymbol: dS/m
EMMO 967080e5 2f42 4eb2 a3a9 c58143e835f9: Decisiemens per metre. -- QUDT

DeciTonne
type: Class
subclass of: Restriction
  some values from: Tonne
subclass of: Restriction
  has value: 1e+02
subclass of: Restriction
  has value: 0e+00
qudtReference: http://qudt.org/vocab/unit/DeciTONNE
unitSymbol: dt

Deg_C_Growing_Cereal_Day
type: Class
comment: The sum of excess temperature over 5.5°C, where the temperature is the mean of the minimum and maximum atmospheric temperature in a day. This measure is appropriate for most cereal crops. -- QUDT
subclass of: Restriction
  has value: 8.64e+04
subclass of: Restriction
  has value: 0e+00
alternative label: Growing Degree Days (Cereals)
qudtReference: http://qudt.org/vocab/unit/DEG_C_GROWING_CEREAL-DAY
unitSymbol: GDD
EMMO 967080e5 2f42 4eb2 a3a9 c58143e835f9: The sum of excess temperature over 5.5°C, where the temperature is the mean of the minimum and maximum atmospheric temperature in a day. This measure is appropriate for most cereal crops. -- QUDT

Deg_F_Hr_Ft2_Per_Btu_It
type: Class
comment: unit of the thermal resistor according to the Imperial system of units -- QUDT
subclass of: Restriction
  has value: 1.89563e+00
subclass of: Restriction
  has value: 0e+00
alternative label: Degree Fahrenheit Hour Square Foot per British Thermal Unit (international Table)
qudtReference: http://qudt.org/vocab/unit/DEG_F-HR-FT2-PER-BTU_IT
ucumCode: [degF].h-1.[ft_i]-2.[Btu_IT]-1
ucumCode: [degF]/(h.[ft_i]2.[Btu_IT])
unitSymbol: °F⋅hr⋅ft²/Btu{IT}
EMMO 967080e5 2f42 4eb2 a3a9 c58143e835f9: unit of the thermal resistor according to the Imperial system of units -- QUDT

Deg_F_Hr_Ft2_Per_Btu_Th
type: Class
comment: unit of the thermal resistor according to the according to the Imperial system of units -- QUDT
subclass of: Restriction
  has value: 1.8969e+00
subclass of: Restriction
  has value: 0e+00
alternative label: Degree Fahrenheit Hour Square Foot per British Thermal Unit (thermochemical)
qudtReference: http://qudt.org/vocab/unit/DEG_F-HR-FT2-PER-BTU_TH
ucumCode: [degF].h-1.[ft_i]-2.[Btu_th]-1
ucumCode: [degF]/(h.[ft_i]2.[Btu_th])
unitSymbol: °F⋅hr⋅ft²/Btu{th}
EMMO 967080e5 2f42 4eb2 a3a9 c58143e835f9: unit of the thermal resistor according to the according to the Imperial system of units -- QUDT

Degree
type: Class
comment: A degree (in full, a degree of arc, arc degree, or arcdegree), usually denoted by ° (the degree symbol), is a measurement of plane angle, representing 1/360 of a full rotation; one degree is equivalent to 2π /360 rad, 0.017453 rad. It is not an SI unit, as the SI unit for angles is radian, but is an accepted SI unit. -- QUDT
comment: Degree is a measurement of plane angle, defined by representing a full rotation as 360 degrees.
subclass of: Restriction
  has value: 1.745329e-02
subclass of: Restriction
  has value: °
subclass of: Restriction
  has value: 0e+00
unit code: DD
qudtReference: http://qudt.org/vocab/unit/DEG
ucumCode: deg
dbpediaReference: http://dbpedia.org/page/Degree_(angle)
EMMO 70fe84ff 99b6 4206 a9fc 9a8931836d84: Degree is a measurement of plane angle, defined by representing a full rotation as 360 degrees.
EMMO 967080e5 2f42 4eb2 a3a9 c58143e835f9: A degree (in full, a degree of arc, arc degree, or arcdegree), usually denoted by ° (the degree symbol), is a measurement of plane angle, representing 1/360 of a full rotation; one degree is equivalent to 2π /360 rad, 0.017453 rad. It is not an SI unit, as the SI unit for angles is radian, but is an accepted SI unit. -- QUDT
iupacReference: https://doi.org/10.1351/goldbook.D01560

DegreeApi
type: Class
comment: unit for the determination of the density of petroleum at 60 degrees F (15.56 degrees C) -- QUDT
alternative label: Degree API
qudtReference: http://qudt.org/vocab/unit/DEGREE_API
unitSymbol: °API
EMMO 967080e5 2f42 4eb2 a3a9 c58143e835f9: unit for the determination of the density of petroleum at 60 degrees F (15.56 degrees C) -- QUDT

DegreeBalling
type: Class
comment: unit for the mixing ratio of a soluble dry substance in water at 17.5 degrees C similar to the percent designation for solutions, in which a solution of 1 g saccharose in 100 g saccharose/ water solution corresponds to 1 degree Balling and respectively a one percent solution -- QUDT
alternative label: Degree Balling
qudtReference: http://qudt.org/vocab/unit/DEGREE_BALLING
unitSymbol: °Balling
EMMO 967080e5 2f42 4eb2 a3a9 c58143e835f9: unit for the mixing ratio of a soluble dry substance in water at 17.5 degrees C similar to the percent designation for solutions, in which a solution of 1 g saccharose in 100 g saccharose/ water solution corresponds to 1 degree Balling and respectively a one percent solution -- QUDT

DegreeBrix
type: Class
comment: unit named according to Adolf Brix for the mixing ratio of a soluble dry substance in water with 15.5 °C similar to the percent designation for solutions, in which a solution of 1 g saccharose in 100 g saccharose/water solution corresponds to 1 °Brix and respectively an one percent solution -- QUDT
alternative label: Degree Brix
qudtReference: http://qudt.org/vocab/unit/DEGREE_BRIX
unitSymbol: °Bx
EMMO 967080e5 2f42 4eb2 a3a9 c58143e835f9: unit named according to Adolf Brix for the mixing ratio of a soluble dry substance in water with 15.5 °C similar to the percent designation for solutions, in which a solution of 1 g saccharose in 100 g saccharose/water solution corresponds to 1 °Brix and respectively an one percent solution -- QUDT

DegreeCelsiusCentiMetre
type: Class
comment: `Degree Celsius Centimeter` is a C.G.S System unit for 'Length Temperature' expressed as cm-degC. -- QUDT
alternative label: Degree Celsius Centimetre
qudtReference: http://qudt.org/vocab/unit/DEG_C-CentiM
ucumCode: Cel.cm
unitSymbol: °C⋅cm
EMMO 967080e5 2f42 4eb2 a3a9 c58143e835f9: `Degree Celsius Centimeter` is a C.G.S System unit for 'Length Temperature' expressed as cm-degC. -- QUDT

DegreeCelsiusKilogramPerSquareMetre
type: Class
comment: Derived unit for the product of the temperature in degrees Celsius and the mass density of a medium, integrated over vertical depth or height in metres. -- QUDT
alternative label: Degrees Celsius kilogram per square metre
qudtReference: http://qudt.org/vocab/unit/DEG_C-KiloGM-PER-M2
ucumCode: Cel.kg.m-2
unitSymbol: °C⋅kg/m²
EMMO 967080e5 2f42 4eb2 a3a9 c58143e835f9: Derived unit for the product of the temperature in degrees Celsius and the mass density of a medium, integrated over vertical depth or height in metres. -- QUDT

DegreeCelsiusPerHour
type: Class
comment: `Degree Celsius per Hour` is a unit for 'Temperature Per Time' expressed as degC / hr. -- QUDT
alternative label: Degree Celsius per Hour
qudtReference: http://qudt.org/vocab/unit/DEG_C-PER-HR
ucumCode: Cel.h-1
ucumCode: Cel/h
unitSymbol: °C/h
EMMO 967080e5 2f42 4eb2 a3a9 c58143e835f9: `Degree Celsius per Hour` is a unit for 'Temperature Per Time' expressed as degC / hr. -- QUDT

DegreeCelsiusPerKelvin
type: Class
comment: unit with the name Degree Celsius divided by the SI base unit kelvin -- QUDT
alternative label: Degree Celsius Per Kelvin
qudtReference: http://qudt.org/vocab/unit/DEG_C-PER-K
ucumCode: Cel.K-1
ucumCode: Cel/K
unitSymbol: °C/K
EMMO 967080e5 2f42 4eb2 a3a9 c58143e835f9: unit with the name Degree Celsius divided by the SI base unit kelvin -- QUDT

DegreeCelsiusPerMetre
type: Class
comment: Degree Celsius per metre unit.
qudtReference: http://qudt.org/vocab/unit/DEG_C-PER-M
ucumCode: Cel.m-1
unitSymbol: °C/m
EMMO 967080e5 2f42 4eb2 a3a9 c58143e835f9: Degree Celsius per metre unit.

DegreeCelsiusPerMinute
type: Class
comment: `Degree Celsius per Minute` is a unit for 'Temperature Per Time' expressed as degC / m. -- QUDT
alternative label: Degree Celsius per Minute
qudtReference: http://qudt.org/vocab/unit/DEG_C-PER-MIN
ucumCode: Cel.min-1
ucumCode: Cel/min
unitSymbol: °C/min
EMMO 967080e5 2f42 4eb2 a3a9 c58143e835f9: `Degree Celsius per Minute` is a unit for 'Temperature Per Time' expressed as degC / m. -- QUDT

DegreeCelsiusPerSecond
type: Class
comment: `Degree Celsius per Second` is a unit for 'Temperature Per Time' expressed as degC / s. -- QUDT
alternative label: Degree Celsius per Second
qudtReference: http://qudt.org/vocab/unit/DEG_C-PER-SEC
ucumCode: Cel.s-1
ucumCode: Cel/s
unitSymbol: °C/s
EMMO 967080e5 2f42 4eb2 a3a9 c58143e835f9: `Degree Celsius per Second` is a unit for 'Temperature Per Time' expressed as degC / s. -- QUDT

DegreeCelsiusPerYear
type: Class
comment: A rate of change of temperature expressed on the Celsius scale over a period of an average calendar year (365.25 days). -- QUDT
subclass of: Restriction
  has value: 3.168809e-08
subclass of: Restriction
  has value: 0e+00
alternative label: Degrees Celsius per year
qudtReference: http://qudt.org/vocab/unit/DEG_C-PER-YR
ucumCode: Cel.a-1
unitSymbol: °C/yr
EMMO 967080e5 2f42 4eb2 a3a9 c58143e835f9: A rate of change of temperature expressed on the Celsius scale over a period of an average calendar year (365.25 days). -- QUDT

DegreeCelsiusWeek
type: Class
comment: temperature multiplied by unit of time. -- QUDT
subclass of: Restriction
  has value: 6.048e+05
subclass of: Restriction
  has value: 0e+00
alternative label: Degree Celsius week
qudtReference: http://qudt.org/vocab/unit/DEG_C-WK
ucumCode: Cel.wk
unitSymbol: °C/wk
EMMO 967080e5 2f42 4eb2 a3a9 c58143e835f9: temperature multiplied by unit of time. -- QUDT

DegreeFahrenheit
type: Class
comment: `Degree Fahrenheit` is an Imperial unit for 'Thermodynamic Temperature' expressed as °F. -- QUDT
subclass of: Restriction
  has value: 5.555556e-01
subclass of: Restriction
  has value: 4.596696e+02
alternative label: Degree Fahrenheit
qudtReference: http://qudt.org/vocab/unit/DEG_F
ucumCode: [degF]
unitSymbol: °F
EMMO 967080e5 2f42 4eb2 a3a9 c58143e835f9: `Degree Fahrenheit` is an Imperial unit for 'Thermodynamic Temperature' expressed as °F. -- QUDT

DegreeFahrenheitHour
type: Class
alternative label: Degree Fahrenheit Hour
qudtReference: http://qudt.org/vocab/unit/DEG_F-HR
unitSymbol: °F⋅hr

DegreeFahrenheitHourPerBtu
type: Class
comment: `Degree Fahrenheit Hour per BTU` is an Imperial unit for 'Thermal Resistance' expressed as degF-hr/Btu. -- QUDT
alternative label: Degree Fahrenheit Hour per BTU
qudtReference: http://qudt.org/vocab/unit/DEG_F-HR-PER-BTU_IT
ucumCode: [degF].h.[Btu_IT]-1
ucumCode: [degF].h/[Btu_IT]
unitSymbol: °F⋅hr/Btu
EMMO 967080e5 2f42 4eb2 a3a9 c58143e835f9: `Degree Fahrenheit Hour per BTU` is an Imperial unit for 'Thermal Resistance' expressed as degF-hr/Btu. -- QUDT

DegreeFahrenheitPerHour
type: Class
comment: `Degree Fahrenheit per Hour` is a unit for 'Temperature Per Time' expressed as degF / h. -- QUDT
alternative label: Degree Fahrenheit per Hour
qudtReference: http://qudt.org/vocab/unit/DEG_F-PER-HR
ucumCode: [degF].h-1
ucumCode: [degF]/h
unitSymbol: °F/h
EMMO 967080e5 2f42 4eb2 a3a9 c58143e835f9: `Degree Fahrenheit per Hour` is a unit for 'Temperature Per Time' expressed as degF / h. -- QUDT

DegreeFahrenheitPerKelvin
type: Class
comment: traditional unit degree Fahrenheit for temperature according to the Anglo-American system of units divided by the SI base unit Kelvin -- QUDT
subclass of: Restriction
  has value: 5.555556e-01
subclass of: Restriction
  has value: 0e+00
alternative label: Degree Fahrenheit Per Kelvin
qudtReference: http://qudt.org/vocab/unit/DEG_F-PER-K
ucumCode: [degF].K-1
ucumCode: [degF]/K
unitSymbol: °F/K
EMMO 967080e5 2f42 4eb2 a3a9 c58143e835f9: traditional unit degree Fahrenheit for temperature according to the Anglo-American system of units divided by the SI base unit Kelvin -- QUDT

DegreeFahrenheitPerMinute
type: Class
comment: `Degree Fahrenheit per Minute` is a unit for 'Temperature Per Time' expressed as degF / m. -- QUDT
alternative label: Degree Fahrenheit per Minute
qudtReference: http://qudt.org/vocab/unit/DEG_F-PER-MIN
ucumCode: [degF].min-1
ucumCode: [degF]/min
unitSymbol: °F/m
EMMO 967080e5 2f42 4eb2 a3a9 c58143e835f9: `Degree Fahrenheit per Minute` is a unit for 'Temperature Per Time' expressed as degF / m. -- QUDT

DegreeFahrenheitPerSecond
type: Class
comment: `Degree Fahrenheit per Second` is a unit for 'Temperature Per Time' expressed as degF / s. -- QUDT
alternative label: Degree Fahrenheit per Second
qudtReference: http://qudt.org/vocab/unit/DEG_F-PER-SEC
ucumCode: [degF].s-1
ucumCode: [degF]/s
unitSymbol: °F/s
EMMO 967080e5 2f42 4eb2 a3a9 c58143e835f9: `Degree Fahrenheit per Second` is a unit for 'Temperature Per Time' expressed as degF / s. -- QUDT

DegreeFahrenheitPerSquareSecond
type: Class
comment: 'Degree Fahrenheit per Square Second' is a unit for expressing the acceleration of a temperature expressed as 'degF /s2'. -- QUDT
subclass of: Restriction
  has value: 5.555556e-01
subclass of: Restriction
  has value: 0e+00
alternative label: Degree Fahrenheit per Square Second
qudtReference: http://qudt.org/vocab/unit/DEG_F-PER-SEC2
ucumCode: [degF].s-2
ucumCode: [degF]/s2
unitSymbol: °F/s²
EMMO 967080e5 2f42 4eb2 a3a9 c58143e835f9: 'Degree Fahrenheit per Square Second' is a unit for expressing the acceleration of a temperature expressed as 'degF /s2'. -- QUDT

DegreeOechsle
type: Class
comment: unit of the density of the must, as measure for the proportion of the soluble material in the grape must -- QUDT
subclass of: Restriction
  has value: 1e+00
subclass of: Restriction
  has value: -9.982e+02
alternative label: Degree Oechsle
qudtReference: http://qudt.org/vocab/unit/DEGREE_OECHSLE
unitSymbol: °Oe
EMMO 967080e5 2f42 4eb2 a3a9 c58143e835f9: unit of the density of the must, as measure for the proportion of the soluble material in the grape must -- QUDT

DegreePerHour
type: Class
comment: "Degree per Hour" is an Imperial unit for 'Angular Velocity' expressed as deg/h. -- QUDT
subclass of: Restriction
  has value: 4.848137e-06
subclass of: Restriction
  has value: 0e+00
alternative label: Degree per Hour
qudtReference: http://qudt.org/vocab/unit/DEG-PER-HR
ucumCode: deg.h-1
ucumCode: deg/h
unitSymbol: °/h
EMMO 967080e5 2f42 4eb2 a3a9 c58143e835f9: "Degree per Hour" is an Imperial unit for 'Angular Velocity' expressed as deg/h. -- QUDT

DegreePerMetre
type: Class
comment: A change of angle in one SI unit of length. -- QUDT
subclass of: Restriction
  has value: 1.745329e-02
subclass of: Restriction
  has value: 0e+00
alternative label: Degrees per metre
qudtReference: http://qudt.org/vocab/unit/DEG-PER-M
ucumCode: deg.m-1
unitSymbol: °/m
EMMO 967080e5 2f42 4eb2 a3a9 c58143e835f9: A change of angle in one SI unit of length. -- QUDT

DegreePerMinute
type: Class
comment: A unit of measure for the rate of change of plane angle, dω / dt, in durations of one minute.The vector ω is directed along the axis of rotation in the direction for which the rotation is clockwise. -- QUDT
subclass of: Restriction
  has value: 0e+00
subclass of: Restriction
  has value: 2.908882e-04
alternative label: Degree per Minute
qudtReference: http://qudt.org/vocab/unit/DEG-PER-MIN
ucumCode: deg.min-1
ucumCode: deg/min
unitSymbol: °/min
EMMO 967080e5 2f42 4eb2 a3a9 c58143e835f9: A unit of measure for the rate of change of plane angle, dω / dt, in durations of one minute.The vector ω is directed along the axis of rotation in the direction for which the rotation is clockwise. -- QUDT

DegreePerSecond
type: Class
comment: "Degree per Second" is an Imperial unit for 'Angular Velocity' expressed as deg/s. -- QUDT
subclass of: Restriction
  has value: 0e+00
subclass of: Restriction
  has value: 1.745329e-02
alternative label: Degree per Second
qudtReference: http://qudt.org/vocab/unit/DEG-PER-SEC
ucumCode: deg.s-1
ucumCode: deg/s
unitSymbol: °/s
EMMO 967080e5 2f42 4eb2 a3a9 c58143e835f9: "Degree per Second" is an Imperial unit for 'Angular Velocity' expressed as deg/s. -- QUDT

DegreePerSquareSecond
type: Class
comment: `Degree per Square Second` is an Imperial unit for `Angular Acceleration` expressed as deg/s². -- QUDT
subclass of: Restriction
  has value: 1.745329e-02
subclass of: Restriction
  has value: 0e+00
alternative label: Degree per Square Second
qudtReference: http://qudt.org/vocab/unit/DEG-PER-SEC2
ucumCode: deg.s-2
ucumCode: deg/s2
unitSymbol: °/s²
EMMO 967080e5 2f42 4eb2 a3a9 c58143e835f9: `Degree per Square Second` is an Imperial unit for `Angular Acceleration` expressed as deg/s². -- QUDT

DegreePlato
type: Class
comment: unit for the mixing ratio of the original gravity in the beer brew at 17,5 °C before the fermentation -- QUDT
alternative label: Degree Plato
qudtReference: http://qudt.org/vocab/unit/DEGREE_PLATO
unitSymbol: °P
EMMO 967080e5 2f42 4eb2 a3a9 c58143e835f9: unit for the mixing ratio of the original gravity in the beer brew at 17,5 °C before the fermentation -- QUDT

DegreeRankine
type: Class
comment: Rankine is a thermodynamic (absolute) temperature scale. The symbol for degrees Rankine is °R or °Ra if necessary to distinguish it from the Rømer and Réaumur scales). Zero on both the Kelvin and Rankine scales is absolute zero, but the Rankine degree is defined as equal to one degree Fahrenheit, rather than the one degree Celsius used by the Kelvin scale. A temperature of -459.67 °F is exactly equal to 0 °R. -- QUDT
subclass of: Restriction
  has value: 5.555556e-01
subclass of: Restriction
  has value: 0e+00
alternative label: Degree Rankine
qudtReference: http://qudt.org/vocab/unit/DEG_R
ucumCode: [degR]
unitSymbol: °R
EMMO 967080e5 2f42 4eb2 a3a9 c58143e835f9: Rankine is a thermodynamic (absolute) temperature scale. The symbol for degrees Rankine is °R or °Ra if necessary to distinguish it from the Rømer and Réaumur scales). Zero on both the Kelvin and Rankine scales is absolute zero, but the Rankine degree is defined as equal to one degree Fahrenheit, rather than the one degree Celsius used by the Kelvin scale. A temperature of -459.67 °F is exactly equal to 0 °R. -- QUDT
wikipediaReference: http://en.wikipedia.org/wiki/Rankine_scale

DegreeRankinePerHour
type: Class
comment: A rate of change of temperature measured in degree Rankine in periods of one hour. -- QUDT
alternative label: Degree Rankine per Hour
qudtReference: http://qudt.org/vocab/unit/DEG_R-PER-HR
ucumCode: [degR].h-1
ucumCode: [degR]/h
unitSymbol: °R/h
EMMO 967080e5 2f42 4eb2 a3a9 c58143e835f9: A rate of change of temperature measured in degree Rankine in periods of one hour. -- QUDT

DegreeRankinePerMinute
type: Class
comment: A rate of change of temperature measured in degree Rankine in periods of one minute -- QUDT
alternative label: Degree Rankine per Minute
qudtReference: http://qudt.org/vocab/unit/DEG_R-PER-MIN
ucumCode: [degR].min-1
ucumCode: [degR]/min
unitSymbol: °R/m
EMMO 967080e5 2f42 4eb2 a3a9 c58143e835f9: A rate of change of temperature measured in degree Rankine in periods of one minute -- QUDT

DegreeRankinePerSecond
type: Class
comment: A rate of change of temperature measured in degree Rankine in periods of one second. -- QUDT
alternative label: Degree Rankine per Second
qudtReference: http://qudt.org/vocab/unit/DEG_R-PER-SEC
ucumCode: [degR].s-1
ucumCode: [degR]/s
unitSymbol: °R/s
EMMO 967080e5 2f42 4eb2 a3a9 c58143e835f9: A rate of change of temperature measured in degree Rankine in periods of one second. -- QUDT

DegreeTwaddell
type: Class
comment: unit of the density of fluids, which are heavier than water -- QUDT
alternative label: Degree Twaddell
qudtReference: http://qudt.org/vocab/unit/DEGREE_TWADDELL
unitSymbol: °Tw
EMMO 967080e5 2f42 4eb2 a3a9 c58143e835f9: unit of the density of fluids, which are heavier than water -- QUDT

Degree_Baume
type: Class
comment: graduation of the areometer scale for determination of densitiy of fluids. The Baumé scale is a pair of hydrometer scales developed by French pharmacist Antoine Baumé in 1768 to measure density of various liquids. The unit of the Baumé scale has been notated variously as degrees Baumé, B°, Bé° and simply Baumé (the accent is not always present). One scale measures the density of liquids heavier than water and the other, liquids lighter than water. The Baumé of distilled water is 0. The API gravity scale is based on errors in early implementations of the Baumé scale. -- QUDT
alternative label: Degree Baume (origin Scale)
qudtReference: http://qudt.org/vocab/unit/DEGREE_BAUME
unitSymbol: °Bé{origin}
EMMO 967080e5 2f42 4eb2 a3a9 c58143e835f9: graduation of the areometer scale for determination of densitiy of fluids. The Baumé scale is a pair of hydrometer scales developed by French pharmacist Antoine Baumé in 1768 to measure density of various liquids. The unit of the Baumé scale has been notated variously as degrees Baumé, B°, Bé° and simply Baumé (the accent is not always present). One scale measures the density of liquids heavier than water and the other, liquids lighter than water. The Baumé of distilled water is 0. The API gravity scale is based on errors in early implementations of the Baumé scale. -- QUDT

Degree_Baume_Us_Heavy
type: Class
comment: graduation of the areometer scale for determination of density of fluids according to the Anglo-American system of units, which are heavier than water -- QUDT
alternative label: Degree Baume (US Heavy)
qudtReference: http://qudt.org/vocab/unit/DEGREE_BAUME_US_HEAVY
unitSymbol: °Bé{US Heavy}
EMMO 967080e5 2f42 4eb2 a3a9 c58143e835f9: graduation of the areometer scale for determination of density of fluids according to the Anglo-American system of units, which are heavier than water -- QUDT

Degree_Baume_Us_Light
type: Class
comment: graduation of the areometer scale for determination of density of fluids according to the Anglo-American system of units, which are lighter than water -- QUDT
alternative label: Degree Baume (US Light)
qudtReference: http://qudt.org/vocab/unit/DEGREE_BAUME_US_LIGHT
unitSymbol: °Bé{US Light}
EMMO 967080e5 2f42 4eb2 a3a9 c58143e835f9: graduation of the areometer scale for determination of density of fluids according to the Anglo-American system of units, which are lighter than water -- QUDT

Denier
type: Class
comment: Denier or den is a unit of measure for the linear mass density of fibers. It is defined as the mass in grams per 9,000 meters. In the International System of Units the tex is used instead (see below). The denier is based on a natural standard: a single strand of silk is approximately one denier. A 9,000-meter strand of silk weighs about one gram. The term denier is from the French denier, a coin of small value (worth 1/12 of a sou). Applied to yarn, a denier was held to be equal in weight to 1/24 of an ounce. The term microdenier is used to describe filaments that weigh less than one gram per 9,000 meter length. -- QUDT
subclass of: Restriction
  has value: 1.1e-07
subclass of: Restriction
  has value: 0e+00
qudtReference: http://qudt.org/vocab/unit/Denier
ucumCode: [den]
unitSymbol: D
EMMO 967080e5 2f42 4eb2 a3a9 c58143e835f9: Denier or den is a unit of measure for the linear mass density of fibers. It is defined as the mass in grams per 9,000 meters. In the International System of Units the tex is used instead (see below). The denier is based on a natural standard: a single strand of silk is approximately one denier. A 9,000-meter strand of silk weighs about one gram. The term denier is from the French denier, a coin of small value (worth 1/12 of a sou). Applied to yarn, a denier was held to be equal in weight to 1/24 of an ounce. The term microdenier is used to describe filaments that weigh less than one gram per 9,000 meter length. -- QUDT
wikipediaReference: http://en.wikipedia.org/wiki/Units_of_textile_measurement#Denier

Diopter
type: Class
comment: A dioptre, or diopter, is a unit of measurement for the optical power of a lens or curved mirror, which is equal to the reciprocal of the focal length measured in metres (that is, 1/metre). For example, a 3 dioptre lens brings parallel rays of light to focus at 1/3 metre. The same unit is also sometimes used for other reciprocals of distance, particularly radii of curvature and the vergence of optical beams. Though the diopter is based on the SI-metric system it has not been included in the standard so that there is no international name or abbreviation for this unit of measurement within the international system of units this unit for optical power would need to be specified explicitly as the inverse metre. -- QUDT
subclass of: Restriction
  has value: 1e+00
subclass of: Restriction
  has value: 0e+00
qudtReference: http://qudt.org/vocab/unit/DIOPTER
ucumCode: [diop]
unitSymbol: D
EMMO 967080e5 2f42 4eb2 a3a9 c58143e835f9: A dioptre, or diopter, is a unit of measurement for the optical power of a lens or curved mirror, which is equal to the reciprocal of the focal length measured in metres (that is, 1/metre). For example, a 3 dioptre lens brings parallel rays of light to focus at 1/3 metre. The same unit is also sometimes used for other reciprocals of distance, particularly radii of curvature and the vergence of optical beams. Though the diopter is based on the SI-metric system it has not been included in the standard so that there is no international name or abbreviation for this unit of measurement within the international system of units this unit for optical power would need to be specified explicitly as the inverse metre. -- QUDT
wikipediaReference: http://en.wikipedia.org/wiki/Dioptre

DotsPerInch
type: Class
comment: point density as amount of the picture base element divided by the unit inch according to the Anglo-American and the Imperial system of units -- QUDT
subclass of: Restriction
  has value: 3.937008e+01
subclass of: Restriction
  has value: 0e+00
alternative label: Dots Per Inch
qudtReference: http://qudt.org/vocab/unit/DPI
ucumCode: {dot}/[in_i]
unitSymbol: DPI
EMMO 967080e5 2f42 4eb2 a3a9 c58143e835f9: point density as amount of the picture base element divided by the unit inch according to the Anglo-American and the Imperial system of units -- QUDT

Dram_Uk
type: Class
comment: non SI-conforming unit of mass comes from the Anglo-American Troy or Apothecaries' Weight System of units which is mainly used in England, in the Netherlands and in the USA as a commercial weight -- QUDT
subclass of: Restriction
  has value: 1.771845e-03
subclass of: Restriction
  has value: 0e+00
alternative label: Dram (UK)
qudtReference: http://qudt.org/vocab/unit/DRAM_UK
ucumCode: [dr_ap]
unitSymbol: dr{UK}
EMMO 967080e5 2f42 4eb2 a3a9 c58143e835f9: non SI-conforming unit of mass comes from the Anglo-American Troy or Apothecaries' Weight System of units which is mainly used in England, in the Netherlands and in the USA as a commercial weight -- QUDT

Dram_Us
type: Class
comment: non SI-conform unit of the mass according to the avoirdupois system of units: 1 dram (av. ) = 1/16 ounce (av. ) = 1/256 pound (av.) -- QUDT
subclass of: Restriction
  has value: 3.887935e-03
subclass of: Restriction
  has value: 0e+00
alternative label: Dram (US)
qudtReference: http://qudt.org/vocab/unit/DRAM_US
ucumCode: [dr_av]
unitSymbol: dr{US}
EMMO 967080e5 2f42 4eb2 a3a9 c58143e835f9: non SI-conform unit of the mass according to the avoirdupois system of units: 1 dram (av. ) = 1/16 ounce (av. ) = 1/256 pound (av.) -- QUDT

DryGallonUs
type: Class
comment: "Dry Gallon US" is a unit for 'Dry Volume' expressed as dry_gal. -- QUDT
subclass of: Restriction
  has value: 4.404884e-03
subclass of: Restriction
  has value: 0e+00
alternative label: Dry Gallon US
qudtReference: http://qudt.org/vocab/unit/GAL_US_DRY
ucumCode: [gal_wi]
unitSymbol: gal{US Dry}
EMMO 967080e5 2f42 4eb2 a3a9 c58143e835f9: "Dry Gallon US" is a unit for 'Dry Volume' expressed as dry_gal. -- QUDT

Dyne
type: Class
comment: In physics, the dyne is a unit of force specified in the centimetre-gram-second (CGS) system of units. One dyne is equal to In physics, the dyne is a unit of force specified in the centimetre-gram-second (CGS) system of units. One dyne is equal to 10 micronewton. Equivalently, the dyne is defined as 'the force required to accelerate a mass of one gram at a rate of one centimetre per square second'. The dyne per centimetre is the unit traditionally used to measure surface tension. -- QUDT
subclass of: Restriction
  has value: 1e-05
subclass of: Restriction
  has value: 0e+00
qudtReference: http://qudt.org/vocab/unit/DYN
ucumCode: dyn
unitSymbol: dyn
EMMO 967080e5 2f42 4eb2 a3a9 c58143e835f9: In physics, the dyne is a unit of force specified in the centimetre-gram-second (CGS) system of units. One dyne is equal to In physics, the dyne is a unit of force specified in the centimetre-gram-second (CGS) system of units. One dyne is equal to 10 micronewton. Equivalently, the dyne is defined as 'the force required to accelerate a mass of one gram at a rate of one centimetre per square second'. The dyne per centimetre is the unit traditionally used to measure surface tension. -- QUDT
wikipediaReference: http://en.wikipedia.org/wiki/Dyne

DyneCentiMetre
type: Class
comment: "Dyne Centimeter" is a C.G.S System unit for 'Torque' expressed as dyn-cm. -- QUDT
subclass of: Restriction
  has value: 0e+00
subclass of: Restriction
  has value: 1e-07
alternative label: Dyne Centimetre
qudtReference: http://qudt.org/vocab/unit/DYN-CentiM
ucumCode: dyn.cm
unitSymbol: dyn⋅cm
EMMO 967080e5 2f42 4eb2 a3a9 c58143e835f9: "Dyne Centimeter" is a C.G.S System unit for 'Torque' expressed as dyn-cm. -- QUDT

DynePerCentiMetre
type: Class
comment: CGS unit of the surface tension -- QUDT
subclass of: Restriction
  has value: 1e-03
subclass of: Restriction
  has value: 0e+00
alternative label: Dyne Per Centimetre
qudtReference: http://qudt.org/vocab/unit/DYN-PER-CentiM
ucumCode: dyn.cm-1
ucumCode: dyn/cm
unitSymbol: dyn/cm
EMMO 967080e5 2f42 4eb2 a3a9 c58143e835f9: CGS unit of the surface tension -- QUDT

DynePerSquareCentiMetre
type: Class
comment: "Dyne per Square Centimeter" is a C.G.S System unit for 'Force Per Area' expressed as dyn/cm². -- QUDT
subclass of: Restriction
  has value: 1e-01
subclass of: Restriction
  has value: 0e+00
alternative label: Dyne per Square Centimetre
qudtReference: http://qudt.org/vocab/unit/DYN-PER-CentiM2
ucumCode: dyn.cm-2
ucumCode: dyn/cm2
unitSymbol: dyn/cm²
EMMO 967080e5 2f42 4eb2 a3a9 c58143e835f9: "Dyne per Square Centimeter" is a C.G.S System unit for 'Force Per Area' expressed as dyn/cm². -- QUDT

DyneSecondPerCentiMetre
type: Class
comment: CGS unit of the mechanical impedance -- QUDT
subclass of: Restriction
  has value: 1e-03
subclass of: Restriction
  has value: 0e+00
alternative label: Dyne Second Per Centimetre
qudtReference: http://qudt.org/vocab/unit/DYN-SEC-PER-CentiM
ucumCode: dyn.s.cm-1
ucumCode: dyn.s/cm
unitSymbol: dyn⋅s/cm
EMMO 967080e5 2f42 4eb2 a3a9 c58143e835f9: CGS unit of the mechanical impedance -- QUDT

DyneSecondPerCubicCentiMetre
type: Class
comment: CGS unit of the acoustic image impedance of the medium -- QUDT
subclass of: Restriction
  has value: 1e+01
subclass of: Restriction
  has value: 0e+00
alternative label: Dyne Second Per Cubic Centimetre
qudtReference: http://qudt.org/vocab/unit/DYN-SEC-PER-CentiM3
ucumCode: dyn.s.cm-3
ucumCode: dyn.s/cm3
unitSymbol: dyn⋅s/cm³
EMMO 967080e5 2f42 4eb2 a3a9 c58143e835f9: CGS unit of the acoustic image impedance of the medium -- QUDT

isDeclaredBy
type: ObjectProperty

UraniumSymbol
type: Class
comment: The symbol that stands for the uranium atom.
subclass of: Restriction
subclass of: Restriction
  has value: U
EMMO 967080e5 2f42 4eb2 a3a9 c58143e835f9: The symbol that stands for the uranium atom.

CommercialProduct
type: Class
comment: An product that is ready for commercialisation.
alternative label: Product
EMMO 967080e5 2f42 4eb2 a3a9 c58143e835f9: An product that is ready for commercialisation.

PhotochemicalProcesses
type: Class

ConductanceForAlternatingCurrent
type: Class
comment: Real part of the admittance.
wikidataReference: https://www.wikidata.org/wiki/Q79464628
IEVReference: https://www.electropedia.org/iev/iev.nsf/display
ISO80000Reference: 6-52.2
EMMO 967080e5 2f42 4eb2 a3a9 c58143e835f9: Real part of the admittance.

DoseEquivalentRate
type: Class
comment: Time derivative of the dose equivalent.
wikidataReference: https://www.wikidata.org/wiki/Q99604810
IEVReference: https://www.electropedia.org/iev/iev.nsf/display
ISO80000Reference: 10-83.2
EMMO 967080e5 2f42 4eb2 a3a9 c58143e835f9: Time derivative of the dose equivalent.

hasStringValue
type: DatatypeProperty
type: FunctionalProperty
range: string
EMMO c7b62dd7 063a 4c2a 8504 42f7264ba83f: The owl:dataProperty that provides a serialisation of an EMMO string data entity.

MicrowaveSintering
type: Class

BraggAngle
type: Class
comment: Angle between the scattered ray and the lattice plane.
qudtReference: https://qudt.org/vocab/quantitykind/BraggAngle
wikidataReference: https://www.wikidata.org/wiki/Q105488118
ISO80000Reference: 12-4
EMMO 967080e5 2f42 4eb2 a3a9 c58143e835f9: Angle between the scattered ray and the lattice plane.

ResonanceEnergy
type: Class
comment: Resonance in a nuclear reaction, determined by the kinetic energy of an incident particle in the reference frame of the target particle.
qudtReference: https://qudt.org/vocab/quantitykind/ResonanceEnergy
wikidataReference: https://www.wikidata.org/wiki/Q98165187
ISO80000Reference: 10-37.2
EMMO 967080e5 2f42 4eb2 a3a9 c58143e835f9: Resonance in a nuclear reaction, determined by the kinetic energy of an incident particle in the reference frame of the target particle.

FundamentalLatticeVector
type: Class
comment: Fundamental translation vector for the crystal lattice.
subclass of: Restriction
qudtReference: https://qudt.org/vocab/quantitykind/FundamentalLatticeVector
wikidataReference: https://www.wikidata.org/wiki/Q105451063
ISO80000Reference: 12-1.2
EMMO 967080e5 2f42 4eb2 a3a9 c58143e835f9: Fundamental translation vector for the crystal lattice.

SimulationLanguage
type: Class
comment: A computer language used to describe simulations.
EMMO 967080e5 2f42 4eb2 a3a9 c58143e835f9: A computer language used to describe simulations.
wikipediaReference: https://en.wikipedia.org/wiki/Simulation_language

DecayConstant
type: Class
comment: Disintegrations per unit time dN/dt for an atomic nucleus divided by the number of nuclei N existing at the same time t.
subclass of: Restriction
alternative label: DisintegrationConstant
qudtReference: https://qudt.org/vocab/quantitykind/DecayConstant
wikidataReference: https://www.wikidata.org/wiki/Q11477200
IEVReference: https://www.electropedia.org/iev/iev.nsf/display
ISO80000Reference: 10-24
EMMO 967080e5 2f42 4eb2 a3a9 c58143e835f9: Disintegrations per unit time dN/dt for an atomic nucleus divided by the number of nuclei N existing at the same time t.
iupacReference: https://doi.org/10.1351/goldbook.D01538

Laplacian
type: Class
subclass of: Restriction
  has value: Δ

AmountFraction
type: Class
comment: The amount of a constituent divided by the total amount of all constituents in a mixture.
alternative label: MoleFraction
qudtReference: http://qudt.org/vocab/quantitykind/MoleFraction
EMMO 967080e5 2f42 4eb2 a3a9 c58143e835f9: The amount of a constituent divided by the total amount of all constituents in a mixture.
iupacReference: https://doi.org/10.1351/goldbook.A00296

Weight
type: Class
comment: Force of gravity acting on a body.
qudtReference: http://qudt.org/vocab/quantitykind/Weight
ISO80000Reference: 4-9.2
EMMO 967080e5 2f42 4eb2 a3a9 c58143e835f9: Force of gravity acting on a body.
iupacReference: https://doi.org/10.1351/goldbook.W06668

hasDeducer
type: ObjectProperty
comment: A semiotic relation connecting an index sign to the interpreter (deducer) in a deduction process.
EMMO 967080e5 2f42 4eb2 a3a9 c58143e835f9: A semiotic relation connecting an index sign to the interpreter (deducer) in a deduction process.

QualityFactor
type: Class
comment: Dimensionless quantity in electromagnetism.
qudtReference: https://qudt.org/vocab/quantitykind/QualityFactor
wikidataReference: https://www.wikidata.org/wiki/Q79467569
IEVReference: https://www.electropedia.org/iev/iev.nsf/display
ISO80000Reference: 6-53
EMMO 967080e5 2f42 4eb2 a3a9 c58143e835f9: Dimensionless quantity in electromagnetism.

DisplacementCurrentDensity
type: Class
comment: Vector quantity equal to the time derivative of the electric flux density.
qudtReference: https://qudt.org/vocab/quantitykind/DisplacementCurrentDensity
wikidataReference: https://www.wikidata.org/wiki/Q77614612
IEVReference: https://www.electropedia.org/iev/iev.nsf/display
ISO80000Reference: 6-18
EMMO 967080e5 2f42 4eb2 a3a9 c58143e835f9: Vector quantity equal to the time derivative of the electric flux density.

LithiumSymbol
type: Class
comment: The symbol that stands for the lithium atom.
subclass of: Restriction
  has value: Li
EMMO 967080e5 2f42 4eb2 a3a9 c58143e835f9: The symbol that stands for the lithium atom.

AtomicNumber
type: Class
comment: Number of protons in an atomic nucleus.
subclass of: Restriction
qudtReference: http://qudt.org/vocab/quantitykind/AtomicNumber
ISO80000Reference: 10-1.1
EMMO 967080e5 2f42 4eb2 a3a9 c58143e835f9: Number of protons in an atomic nucleus.
iupacReference: https://doi.org/10.1351/goldbook.A00499

BohriumSymbol
type: Class
comment: The symbol that stands for the bohrium atom.
subclass of: Restriction
subclass of: Restriction
  has value: Bh
EMMO 967080e5 2f42 4eb2 a3a9 c58143e835f9: The symbol that stands for the bohrium atom.

DragCoefficient
type: Class
comment: Dimensionless parameter to quantify fluid resistance.
alternative label: DragFactor
qudtReference: https://qudt.org/vocab/quantitykind/DragCoefficient
wikidataReference: https://www.wikidata.org/wiki/Q1778961
ISO80000Reference: 4-23.4
EMMO 967080e5 2f42 4eb2 a3a9 c58143e835f9: Dimensionless parameter to quantify fluid resistance.

MaterialRelationComputation
type: Class

MeanEnergyImparted
type: Class
comment: Expectation value of the energy imparted.
qudtReference: https://qudt.org/vocab/quantitykind/MeanEnergyImparted
wikidataReference: https://www.wikidata.org/wiki/Q99526969
IEVReference: https://www.electropedia.org/iev/iev.nsf/display
ISO80000Reference: 10-80.2
EMMO 967080e5 2f42 4eb2 a3a9 c58143e835f9: Expectation value of the energy imparted.

Height
type: Class
comment: Minimum length of a straight line segment between a point and a reference line or reference surface.
qudtReference: https://qudt.org/vocab/quantitykind/Height
wikidataReference: https://www.wikidata.org/wiki/Q208826
IEVReference: https://www.electropedia.org/iev/iev.nsf/display
dbpediaReference: https://dbpedia.org/page/Height
ISO80000Reference: 3-1.3
EMMO 967080e5 2f42 4eb2 a3a9 c58143e835f9: Minimum length of a straight line segment between a point and a reference line or reference surface.
wikipediaReference: https://en.wikipedia.org/wiki/Height

PlasticSintering
type: Class

Java
type: Class

Minimal
type: Class
comment: The superclass for all classes of entities that have no proper parts of the same type of the whole is proper part of an entity of that type.
EMMO 967080e5 2f42 4eb2 a3a9 c58143e835f9: The superclass for all classes of entities that have no proper parts of the same type of the whole is proper part of an entity of that type.
EMMO c7b62dd7 063a 4c2a 8504 42f7264ba83f: A minimal class M (subclass of Minimal) is defined by choosing a reference type φ so that M is subclass of φ, all parts of x are needed to keep φ(x) and x is proper part of a larger φ entity.

isMemberOf
type: ObjectProperty

Filling
type: Class

LengthPerAmountUnit
type: Class
comment: The class of units with dimensionality 'LengthPerAmount'.
subclass of: Restriction
  has value: T0 L+1 M0 I0 Θ0 N-1 J0
EMMO 967080e5 2f42 4eb2 a3a9 c58143e835f9: The class of units with dimensionality 'LengthPerAmount'.

TinSymbol
type: Class
comment: The symbol that stands for the tin atom.
subclass of: Restriction
  has value: Sn
EMMO 967080e5 2f42 4eb2 a3a9 c58143e835f9: The symbol that stands for the tin atom.

AtomicScatteringFactor
type: Class
comment: Quotient of radiation amplitude scattered by the atom and radiation amplitude scattered by a single electron.
qudtReference: https://qudt.org/vocab/quantitykind/AtomScatteringFactor
wikidataReference: https://www.wikidata.org/wiki/Q837866
ISO80000Reference: 12-5.3
EMMO 967080e5 2f42 4eb2 a3a9 c58143e835f9: Quotient of radiation amplitude scattered by the atom and radiation amplitude scattered by a single electron.
wikipediaReference: https://en.wikipedia.org/wiki/Atomic_form_factor

RollingResistance
type: Class
comment: Force resisting the motion when a body (such as a ball, tire, or wheel) rolls on a surface.
alternative label: RollingDrag
alternative label: RollingFrictionForce
wikidataReference: https://www.wikidata.org/wiki/Q914921
ISO80000Reference: 4-9.5
EMMO 967080e5 2f42 4eb2 a3a9 c58143e835f9: Force resisting the motion when a body (such as a ball, tire, or wheel) rolls on a surface.

AmorphousMaterial
type: Class
alternative label: NonCrystallineMaterial

ResonanceEscapeProbability
type: Class
comment: In an infinite medium, the probability that a neutron slowing down will traverse all or some specified portion of the range of resonance energies without being absorbed.
qudtReference: https://qudt.org/vocab/quantitykind/ResonanceEscapeProbability
wikidataReference: https://www.wikidata.org/wiki/Q4108072
ISO80000Reference: 10-68
EMMO 967080e5 2f42 4eb2 a3a9 c58143e835f9: In an infinite medium, the probability that a neutron slowing down will traverse all or some specified portion of the range of resonance energies without being absorbed.

Dispersion
type: Class
comment: A material in which distributed particles of one phase are dispersed in a different continuous phase.
EMMO 967080e5 2f42 4eb2 a3a9 c58143e835f9: A material in which distributed particles of one phase are dispersed in a different continuous phase.

uneceCommonCode
type: AnnotationProperty
comment: The unit of measurement given using the UN/CEFACT Common Code (3 characters) or a URL.
range: string
deprecated: true
version info: Replaced by schema:unitCode
EMMO 967080e5 2f42 4eb2 a3a9 c58143e835f9: The unit of measurement given using the UN/CEFACT Common Code (3 characters) or a URL.
EMMO c7b62dd7 063a 4c2a 8504 42f7264ba83f: The UN/CEFACT Recommendation 20 provides three character alphabetic and alphanumeric codes for representing units of measurement for length, area, volume/capacity, mass (weight), time, and other quantities used in international trade. The codes are intended for use in manual and/or automated systems for the exchange of information between participants in international trade.

SurfaceCoefficientOfHeatTransfer
type: Class
comment: Coefficient of heat transfer when heat exchange takes place between a body at thermodynamic temperature Ts and its surroundings that are at a reference temperature Tr.
qudtReference: https://qudt.org/vocab/quantitykind/SurfaceCoefficientOfHeatTransfer
wikidataReference: https://www.wikidata.org/wiki/Q74770365
IEVReference: https://www.electropedia.org/iev/iev.nsf/display
ISO80000Reference: 5-10.2
EMMO 967080e5 2f42 4eb2 a3a9 c58143e835f9: Coefficient of heat transfer when heat exchange takes place between a body at thermodynamic temperature Ts and its surroundings that are at a reference temperature Tr.

Inequality
type: Class
comment: A relation which makes a non-equal comparison between two numbers or other mathematical expressions.
example: f(x) > 0
EMMO 967080e5 2f42 4eb2 a3a9 c58143e835f9: A relation which makes a non-equal comparison between two numbers or other mathematical expressions.

ArsenicSymbol
type: Class
comment: The symbol that stands for the arsenic atom.
subclass of: Restriction
  has value: As
EMMO 967080e5 2f42 4eb2 a3a9 c58143e835f9: The symbol that stands for the arsenic atom.

ZincSymbol
type: Class
comment: The symbol that stands for the zinc atom.
subclass of: Restriction
  has value: Zn
EMMO 967080e5 2f42 4eb2 a3a9 c58143e835f9: The symbol that stands for the zinc atom.

hasObjectInput
type: AsymmetricProperty
type: IrreflexiveProperty
type: ObjectProperty
comment: The relation between a process P that proper overlaps an object O, where the non-overlapping part of O causes P.
EMMO 967080e5 2f42 4eb2 a3a9 c58143e835f9: The relation between a process P that proper overlaps an object O, where the non-overlapping part of O causes P.

MolarAttenuationCoefficient
type: Class
comment: Quotient of linear attenuation coefficient µ and the amount c of the medium.
subclass of: Restriction
wikidataReference: https://www.wikidata.org/wiki/Q98592828
ISO80000Reference: 10-51
EMMO 967080e5 2f42 4eb2 a3a9 c58143e835f9: Quotient of linear attenuation coefficient µ and the amount c of the medium.

AnalogData
type: Class
comment: Data that are decoded retaining its continuous variations characteristic.
example: A vynil contain continuous information about the recorded sound.
EMMO 967080e5 2f42 4eb2 a3a9 c58143e835f9: Data that are decoded retaining its continuous variations characteristic.
EMMO c7b62dd7 063a 4c2a 8504 42f7264ba83f: The fact that there may be a finite granularity in the variations of the material basis (e.g. the smallest peak in a vynil that can be recognized by the piezo-electric transducer) does not prevent a data to be analog. It means only that the focus on such data encoding is on a scale that makes such variations negligible, making them practically a continuum.

CurrentLinkage
type: Class
comment: For a closed path, scalar quantity equal to the electric current through any surface bounded by the path.
qudtReference: https://qudt.org/vocab/quantitykind/CurrentLinkage
wikidataReference: https://www.wikidata.org/wiki/Q77995703
IEVReference: https://www.electropedia.org/iev/iev.nsf/display
ISO80000Reference: 6-37.4
EMMO 967080e5 2f42 4eb2 a3a9 c58143e835f9: For a closed path, scalar quantity equal to the electric current through any surface bounded by the path.

DragForce
type: Class
comment: Retarding force on a body moving in a fluid.
wikidataReference: https://www.wikidata.org/wiki/Q206621
ISO80000Reference: 4-9.6
EMMO 967080e5 2f42 4eb2 a3a9 c58143e835f9: Retarding force on a body moving in a fluid.

DirectionAndEnergyDistributionOfCrossSection
type: Class
comment: Partial differential quotient of the cross section of a process with respect to the solid angle around a given direction and the energy of a particle scattered in that direction.
subclass of: Restriction
qudtReference: https://qudt.org/vocab/quantitykind/SpectralAngularCrossSection
wikidataReference: https://www.wikidata.org/wiki/Q98269571
ISO80000Reference: 10-41
EMMO 967080e5 2f42 4eb2 a3a9 c58143e835f9: Partial differential quotient of the cross section of a process with respect to the solid angle around a given direction and the energy of a particle scattered in that direction.

TemporalRole
type: Class
comment: An holistic temporal part of a whole.
alternative label: HolisticTemporalPart
EMMO 967080e5 2f42 4eb2 a3a9 c58143e835f9: An holistic temporal part of a whole.

Coercivity
type: Class
comment: Coercive field strength in a substance when either the magnetic flux density or the magnetic polarization and magnetization is brought from its value at magnetic saturation to zero by monotonic reduction of the applied magnetic field strength.
subclass of: Restriction
qudtReference: https://qudt.org/vocab/quantitykind/Coercivity
wikidataReference: https://www.wikidata.org/wiki/Q432635
IEVReference: https://www.electropedia.org/iev/iev.nsf/display
ISO80000Reference: 6-31
EMMO 967080e5 2f42 4eb2 a3a9 c58143e835f9: Coercive field strength in a substance when either the magnetic flux density or the magnetic polarization and magnetization is brought from its value at magnetic saturation to zero by monotonic reduction of the applied magnetic field strength.

hasManufacturedOutput
type: ObjectProperty

RutheniumSymbol
type: Class
comment: The symbol that stands for the ruthenium atom.
subclass of: Restriction
subclass of: Restriction
  has value: Ru
EMMO 967080e5 2f42 4eb2 a3a9 c58143e835f9: The symbol that stands for the ruthenium atom.

Curve
type: Class
comment: A one-manyfold with two unconnected end points.
EMMO 967080e5 2f42 4eb2 a3a9 c58143e835f9: A one-manyfold with two unconnected end points.

TotalMassStoppingPower
type: Class
comment: Quotient of the total linear stopping power S and the mass density ρ of the material.
subclass of: Restriction
alternative label: MassStoppingPower
qudtReference: https://qudt.org/vocab/quantitykind/TotalMassStoppingPower
wikidataReference: https://www.wikidata.org/wiki/Q98642795
IEVReference: https://www.electropedia.org/iev/iev.nsf/display
ISO80000Reference: 10-55
EMMO 967080e5 2f42 4eb2 a3a9 c58143e835f9: Quotient of the total linear stopping power S and the mass density ρ of the material.

IsentropicCompressibility
type: Class
comment: Quantity characterizing the relative variation of volume V with pressure p at constant entropy.
qudtReference: https://qudt.org/vocab/quantitykind/IsentropicCompressibility
wikidataReference: https://www.wikidata.org/wiki/Q2990695
IEVReference: https://www.electropedia.org/iev/iev.nsf/display
ISO80000Reference: 5-5.2
EMMO 967080e5 2f42 4eb2 a3a9 c58143e835f9: Quantity characterizing the relative variation of volume V with pressure p at constant entropy.
EMMO c7b62dd7 063a 4c2a 8504 42f7264ba83f: The coherent SI unit of isentropic compressibility is pascal to the power minus one, 1/Pa.

VanadiumSymbol
type: Class
comment: The symbol that stands for the vanadium atom.
subclass of: Restriction
subclass of: Restriction
  has value: V
EMMO 967080e5 2f42 4eb2 a3a9 c58143e835f9: The symbol that stands for the vanadium atom.

MercurySymbol
type: Class
comment: The symbol that stands for the mercury atom.
subclass of: Restriction
subclass of: Restriction
  has value: Hg
EMMO 967080e5 2f42 4eb2 a3a9 c58143e835f9: The symbol that stands for the mercury atom.

PaperManufacturing
type: Class

contact
type: AnnotationProperty
comment: A person or organisation acting as a contact point for enquiries about the ontology resource
sub property of: comment
EMMO 967080e5 2f42 4eb2 a3a9 c58143e835f9: A person or organisation acting as a contact point for enquiries about the ontology resource
EMMO c7b62dd7 063a 4c2a 8504 42f7264ba83f: The annotation should include an email address.

IntrinsicCarrierDensity
type: Class
comment: Square root of the product of electron and hole density in a semiconductor.
qudtReference: https://qudt.org/vocab/quantitykind/IntinsicCarrierDensity
wikidataReference: https://www.wikidata.org/wiki/Q1303188
ISO80000Reference: 12-29.3
EMMO 967080e5 2f42 4eb2 a3a9 c58143e835f9: Square root of the product of electron and hole density in a semiconductor.

GasMixture
type: Class
equivalent class: Class

PseudoscalarMeson
type: Class
comment: A meson with spin zero and odd parity.
EMMO 967080e5 2f42 4eb2 a3a9 c58143e835f9: A meson with spin zero and odd parity.
wikipediaReference: https://en.wikipedia.org/wiki/Pseudoscalar_meson

RelativePermittivity
type: Class
comment: Permittivity divided by electric constant.
qudtReference: https://qudt.org/vocab/unit/PERMITTIVITY_REL
wikidataReference: https://www.wikidata.org/wiki/Q4027242
IEVReference: https://www.electropedia.org/iev/iev.nsf/display
ISO80000Reference: 6-15
EMMO 967080e5 2f42 4eb2 a3a9 c58143e835f9: Permittivity divided by electric constant.

FundamentalReciprocalLatticeVector
type: Class
comment: Fundamental translation vectors for the reciprocal lattice.
subclass of: Restriction
qudtReference: https://qudt.org/vocab/quantitykind/FundamentalReciprocalLatticeVector
wikidataReference: https://www.wikidata.org/wiki/Q105475399
ISO80000Reference: 12-2.2
EMMO 967080e5 2f42 4eb2 a3a9 c58143e835f9: Fundamental translation vectors for the reciprocal lattice.

NaturalProcess
type: Class
comment: A process occurring by natural (non-intentional) laws.
alternative label: NonIntentionalProcess
EMMO 967080e5 2f42 4eb2 a3a9 c58143e835f9: A process occurring by natural (non-intentional) laws.

GFactorOfNucleusOrNuclearParticle
type: Class
comment: Quotient of the magnetic dipole moment of an atom, and the product of the nuclear spin quantum number and the nuclear magneton.
alternative label: NuclearGFactor
qudtReference: https://qudt.org/vocab/quantitykind/GFactorOfNucleus
wikidataReference: https://www.wikidata.org/wiki/Q97591250
ISO80000Reference: 10-14.2
EMMO 967080e5 2f42 4eb2 a3a9 c58143e835f9: Quotient of the magnetic dipole moment of an atom, and the product of the nuclear spin quantum number and the nuclear magneton.

DataExchangeLanguage
type: Class
comment: A computer language that is domain-independent and can be used for expressing data from any kind of discipline.
example: JSON, YAML, XML
EMMO 967080e5 2f42 4eb2 a3a9 c58143e835f9: A computer language that is domain-independent and can be used for expressing data from any kind of discipline.
wikipediaReference: https://en.wikipedia.org/wiki/Data_exchange#Data_exchange_languages

ParticleSourceDensity
type: Class
comment: Quotient of the mean rate of production of particles in a volume, and that volume.
subclass of: Restriction
qudtReference: https://qudt.org/vocab/quantitykind/ParticleSourceDensity
wikidataReference: https://www.wikidata.org/wiki/Q98915762
ISO80000Reference: 10-66
EMMO 967080e5 2f42 4eb2 a3a9 c58143e835f9: Quotient of the mean rate of production of particles in a volume, and that volume.

illustration
type: AnnotationProperty
comment: A link to a graphical representation aimed to facilitate understanding of the concept, or of an annotation.
range: anyURI
sub property of: seeAlso
EMMO 967080e5 2f42 4eb2 a3a9 c58143e835f9: A link to a graphical representation aimed to facilitate understanding of the concept, or of an annotation.

PlutoniumSymbol
type: Class
comment: The symbol that stands for the plutonium atom.
subclass of: Restriction
  has value: Pu
EMMO 967080e5 2f42 4eb2 a3a9 c58143e835f9: The symbol that stands for the plutonium atom.

JavaScript
type: Class

IUPACName
type: Class
comment: Name of a chemical according to the IUPAC standard.
EMMO 967080e5 2f42 4eb2 a3a9 c58143e835f9: Name of a chemical according to the IUPAC standard.

hasConventionalProperty
type: ObjectProperty
comment: An object can be represented by a quantity for the fact that it has been recognized to belong to a specific class. The quantity is selected without an observation aimed to measure its actual value, but by convention.
comment: Assigns a quantity to an object by convention.
example: An Hydrogen atom has the quantity atomic number Z = 1 as its conventional property.
EMMO 967080e5 2f42 4eb2 a3a9 c58143e835f9: Assigns a quantity to an object by convention.

ThermalSprayingForming
type: Class

Galvanizing
type: Class

AngularDisplacement
type: Class
comment: The angle through which a body rotates around an axis of rotation.
alternative label: Angular displacement may be signed, indicating the sense of rotation (e.g., clockwise); it may also be greater (in absolute value) than a full turn.
alternative label: Rotation
wikidataReference: https://www.wikidata.org/wiki/Q76435127
IEVReference: https://www.electropedia.org/iev/iev.nsf/display
ISO80000Reference: 3-14
EMMO 967080e5 2f42 4eb2 a3a9 c58143e835f9: The angle through which a body rotates around an axis of rotation.
EMMO c7b62dd7 063a 4c2a 8504 42f7264ba83f: Angular displacement may also be defined as number of turns (not necessarily an integer number).

EffectiveDiffusionCoefficient
type: Class
comment: Diffusion coefficient through the pore space of a porous media.
wikidataReference: https://www.wikidata.org/wiki/Q258852
EMMO 967080e5 2f42 4eb2 a3a9 c58143e835f9: Diffusion coefficient through the pore space of a porous media.

AvogadroConstant
type: Class
comment: The DBpedia definition (http://dbpedia.org/page/Avogadro_constant) is outdated as May 20, 2019. It is now an exact quantity.
comment: The number of constituent particles, usually atoms or molecules, that are contained in the amount of substance given by one mole. It defines the base unit mole in the SI system.
subclass of: Restriction
qudtReference: http://qudt.org/vocab/constant/AvogadroConstant
EMMO 967080e5 2f42 4eb2 a3a9 c58143e835f9: The number of constituent particles, usually atoms or molecules, that are contained in the amount of substance given by one mole. It defines the base unit mole in the SI system.
iupacReference: https://doi.org/10.1351/goldbook.A00543

ManganeseSymbol
type: Class
comment: The symbol that stands for the manganese atom.
subclass of: Restriction
  has value: Mn
EMMO 967080e5 2f42 4eb2 a3a9 c58143e835f9: The symbol that stands for the manganese atom.

SharedAgency
type: Class
comment: Shared agency occurs when two or more individuals do something together.
subclass of: Restriction
EMMO 967080e5 2f42 4eb2 a3a9 c58143e835f9: Shared agency occurs when two or more individuals do something together.

DysprosiumSymbol
type: Class
comment: The symbol that stands for the dysprosium atom.
subclass of: Restriction
  has value: Dy
EMMO 967080e5 2f42 4eb2 a3a9 c58143e835f9: The symbol that stands for the dysprosium atom.

HyperfineStructureQuantumNumber
type: Class
comment: Quantum number of an atom describing the inclination of the nuclear spin with respect to a quantization axis given by the magnetic field produced by the orbital electrons.
qudtReference: https://qudt.org/vocab/quantitykind/HyperfineStructureQuantumNumber
wikidataReference: https://www.wikidata.org/wiki/Q97577449
ISO80000Reference: 10-13.8
EMMO 967080e5 2f42 4eb2 a3a9 c58143e835f9: Quantum number of an atom describing the inclination of the nuclear spin with respect to a quantization axis given by the magnetic field produced by the orbital electrons.

OsmoticPressure
type: Class
comment: Measure of the tendency of a solution to take in pure solvent by osmosis.
qudtReference: https://qudt.org/vocab/quantitykind/OsmoticPressure
wikidataReference: https://www.wikidata.org/wiki/Q193135
ISO80000Reference: 9-28
EMMO 967080e5 2f42 4eb2 a3a9 c58143e835f9: Measure of the tendency of a solution to take in pure solvent by osmosis.
iupacReference: https://doi.org/10.1351/goldbook.O04344

ElectricDipoleMoment
type: Class
comment: An electric dipole, vector quantity of magnitude equal to the product of the positive charge and the distance between the charges and directed from the negative charge to the positive charge.
subclass of: Restriction
qudtReference: http://qudt.org/vocab/quantitykind/ElectricDipoleMoment
wikidataReference: https://www.wikidata.org/wiki/Q735135
IEVReference: https://www.electropedia.org/iev/iev.nsf/display
ISO80000Reference: 6-6
EMMO 967080e5 2f42 4eb2 a3a9 c58143e835f9: An electric dipole, vector quantity of magnitude equal to the product of the positive charge and the distance between the charges and directed from the negative charge to the positive charge.
iupacReference: https://doi.org/10.1351/goldbook.E01929

LatticePlaneSpacing
type: Class
comment: distance between successive lattice planes
qudtReference: https://qudt.org/vocab/quantitykind/LatticePlaneSpacing
wikidataReference: https://www.wikidata.org/wiki/Q105488046
ISO80000Reference: 12-3
EMMO 967080e5 2f42 4eb2 a3a9 c58143e835f9: distance between successive lattice planes

SpinQuantumNumber
type: Class
comment: Characteristic quantum number s of a particle, related to its spin.
qudtReference: https://qudt.org/vocab/quantitykind/SpinQuantumNumber
wikidataReference: https://www.wikidata.org/wiki/Q3879445
ISO80000Reference: 10-13.5
EMMO 967080e5 2f42 4eb2 a3a9 c58143e835f9: Characteristic quantum number s of a particle, related to its spin.

MetallicPowderSintering
type: Class

SlowingDownDensity
type: Class
comment: Number of slowed-down particles per time and volume.
subclass of: Restriction
qudtReference: https://qudt.org/vocab/quantitykind/Slowing-DownDensity
wikidataReference: https://www.wikidata.org/wiki/Q98915830
ISO80000Reference: 10-67
EMMO 967080e5 2f42 4eb2 a3a9 c58143e835f9: Number of slowed-down particles per time and volume.

PermanentLiquidPhaseSintering
type: Class

ElectroSinterForging
type: Class

VectorMeson
type: Class
comment: A meson with total spin 1 and odd parity.
EMMO 967080e5 2f42 4eb2 a3a9 c58143e835f9: A meson with total spin 1 and odd parity.
wikipediaReference: https://en.wikipedia.org/wiki/Vector_meson

Database
type: Class
comment: A structured collection of data held in a computer system that has a well-defined interface.
example: - A database covering nine million chemical compositions. - A thermodynamic database.
EMMO 967080e5 2f42 4eb2 a3a9 c58143e835f9: A structured collection of data held in a computer system that has a well-defined interface.

CubicExpansionCoefficient
type: Class
comment: Quantity characterizing the variation with thermodynamic temperature T of the volume V of a body, under given conditions.
comment: alpha_V = (1/V) * (dV/dT)
qudtReference: https://qudt.org/vocab/quantitykind/CubicExpansionCoefficient
wikidataReference: https://www.wikidata.org/wiki/Q74761076
IEVReference: https://www.electropedia.org/iev/iev.nsf/display
ISO80000Reference: 5-3.2
EMMO 967080e5 2f42 4eb2 a3a9 c58143e835f9: Quantity characterizing the variation with thermodynamic temperature T of the volume V of a body, under given conditions.

FleroviumSymbol
type: Class
comment: The symbol that stands for the flerovium atom.
subclass of: Restriction
subclass of: Restriction
  has value: Fl
EMMO 967080e5 2f42 4eb2 a3a9 c58143e835f9: The symbol that stands for the flerovium atom.

DataProcessing
type: Class
comment: A computation that provides a data output following the elaboration of some input data, using a data processing application.
subclass of: Restriction
EMMO 967080e5 2f42 4eb2 a3a9 c58143e835f9: A computation that provides a data output following the elaboration of some input data, using a data processing application.

TitaniumSymbol
type: Class
comment: The symbol that stands for the titanium atom.
subclass of: Restriction
  has value: Ti
EMMO 967080e5 2f42 4eb2 a3a9 c58143e835f9: The symbol that stands for the titanium atom.

Fork
type: Class
comment: A tessellation in which a tile has next two or more non spatially connected tiles.
EMMO 967080e5 2f42 4eb2 a3a9 c58143e835f9: A tessellation in which a tile has next two or more non spatially connected tiles.

MagneticVectorPotential
type: Class
comment: Vector potential of the magnetic flux density.
subclass of: Restriction
qudtReference: https://qudt.org/vocab/quantitykind/MagneticVectorPotential
wikidataReference: https://www.wikidata.org/wiki/Q2299100
IEVReference: https://www.electropedia.org/iev/iev.nsf/display
ISO80000Reference: 6-32
EMMO 967080e5 2f42 4eb2 a3a9 c58143e835f9: Vector potential of the magnetic flux density.

Pictorial
type: Class
comment: A 'Graphical' that stands for a real world object that shows a recognizable pictorial pattern without being necessarily associated to a symbolic language.
example: A drawing of a cat. A circle on a paper sheet. The Mona Lisa.
EMMO 967080e5 2f42 4eb2 a3a9 c58143e835f9: A 'Graphical' that stands for a real world object that shows a recognizable pictorial pattern without being necessarily associated to a symbolic language.

SpecificVolume
type: Class
comment: inverse of the mass density ρ, thus v = 1/ρ.
subclass of: Restriction
alternative label: MassicVolume
qudtReference: https://qudt.org/vocab/quantitykind/SpecificVolume
wikidataReference: https://www.wikidata.org/wiki/Q683556
IEVReference: https://www.electropedia.org/iev/iev.nsf/display
ISO80000Reference: 4-3
EMMO 967080e5 2f42 4eb2 a3a9 c58143e835f9: inverse of the mass density ρ, thus v = 1/ρ.
iupacReference: https://doi.org/10.1351/goldbook.S05807

Vergence
type: Class
comment: In geometrical optics, vergence describes the curvature of optical wavefronts.
subclass of: Restriction
qudtReference: http://qudt.org/vocab/quantitykind/Curvature
EMMO 967080e5 2f42 4eb2 a3a9 c58143e835f9: In geometrical optics, vergence describes the curvature of optical wavefronts.

SIMetricPrefixedUnit
type: Class
comment: A SI base unit or SI derived unit with a metric prefix.
EMMO 967080e5 2f42 4eb2 a3a9 c58143e835f9: A SI base unit or SI derived unit with a metric prefix.

ResidualResistivity
type: Class
comment: For metals, the resistivity extrapolated to zero thermodynamic temperature.
qudtReference: https://qudt.org/vocab/quantitykind/ResidualResistivity
wikidataReference: https://www.wikidata.org/wiki/Q25098876
IEVReference: https://www.electropedia.org/iev/iev.nsf/display
ISO80000Reference: 12-17
EMMO 967080e5 2f42 4eb2 a3a9 c58143e835f9: For metals, the resistivity extrapolated to zero thermodynamic temperature.

qudtReference
type: AnnotationProperty
comment: URL to corresponing entity in QUDT.
EMMO 967080e5 2f42 4eb2 a3a9 c58143e835f9: URL to corresponing entity in QUDT.

ParticleCurrentDensity
type: Class
comment: Number of particles per time and area crossing a surface.
subclass of: Restriction
qudtReference: https://qudt.org/vocab/quantitykind/ParticleCurrent
wikidataReference: https://www.wikidata.org/wiki/Q2400689
ISO80000Reference: 10-48
EMMO 967080e5 2f42 4eb2 a3a9 c58143e835f9: Number of particles per time and area crossing a surface.

NickelSymbol
type: Class
comment: The symbol that stands for the nickel atom.
subclass of: Restriction
  has value: Ni
EMMO 967080e5 2f42 4eb2 a3a9 c58143e835f9: The symbol that stands for the nickel atom.

ElectricChargePerTemperatureUnit
type: Class
comment: The class of units with dimensionality 'ElectricChargePerTemperature'.
subclass of: Restriction
  has value: T+1 L0 M0 I+1 Θ-1 N0 J0
EMMO 967080e5 2f42 4eb2 a3a9 c58143e835f9: The class of units with dimensionality 'ElectricChargePerTemperature'.

ProtactiniumSymbol
type: Class
comment: The symbol that stands for the protactinium atom.
subclass of: Restriction
  has value: Pa
EMMO 967080e5 2f42 4eb2 a3a9 c58143e835f9: The symbol that stands for the protactinium atom.

omReference
type: AnnotationProperty
comment: IRI to corresponding concept in the Ontology of units of Measure.
EMMO 967080e5 2f42 4eb2 a3a9 c58143e835f9: IRI to corresponding concept in the Ontology of units of Measure.

MendeleviumSymbol
type: Class
comment: The symbol that stands for the mendelevium atom.
subclass of: Restriction
  has value: Md
EMMO 967080e5 2f42 4eb2 a3a9 c58143e835f9: The symbol that stands for the mendelevium atom.

Array3D
type: Class
comment: 3-dimensional array who's spatial direct parts are matrices.
subclass of: Restriction
alternative label: 3DArray
EMMO 967080e5 2f42 4eb2 a3a9 c58143e835f9: 3-dimensional array who's spatial direct parts are matrices.

Understanding
type: Class
comment: A semiosis where the interpreter perceives a sign, that generates the interpretant as interpreter's internal representation, leading to potential interpretations.
EMMO 967080e5 2f42 4eb2 a3a9 c58143e835f9: A semiosis where the interpreter perceives a sign, that generates the interpretant as interpreter's internal representation, leading to potential interpretations.

AtomicAttenuationCoefficient
type: Class
comment: Quotient of the linear attenuation coefficient µ and the number density, n, of atoms in the substance.
subclass of: Restriction
wikidataReference: https://www.wikidata.org/wiki/Q98592911
ISO80000Reference: 10-52
EMMO 967080e5 2f42 4eb2 a3a9 c58143e835f9: Quotient of the linear attenuation coefficient µ and the number density, n, of atoms in the substance.

Exponent
type: Class

Experiment
type: Class
comment: An experiment is a process that is intended to replicate a physical phenomenon in a controlled environment.
EMMO 967080e5 2f42 4eb2 a3a9 c58143e835f9: An experiment is a process that is intended to replicate a physical phenomenon in a controlled environment.

ParticleFluence
type: Class
comment: Differential quotient of N with respect to a, where N is the number of particles incident on a sphere of cross-sectional area a.
subclass of: Restriction
qudtReference: https://qudt.org/vocab/quantitykind/ParticleFluence
wikidataReference: https://www.wikidata.org/wiki/Q82965908
IEVReference: https://www.electropedia.org/iev/iev.nsf/display
ISO80000Reference: 10-43
EMMO 967080e5 2f42 4eb2 a3a9 c58143e835f9: Differential quotient of N with respect to a, where N is the number of particles incident on a sphere of cross-sectional area a.

Shape4x3Matrix
type: Class
comment: A real matrix with shape 4x3.
EMMO 967080e5 2f42 4eb2 a3a9 c58143e835f9: A real matrix with shape 4x3.

MolarInternalEnergy
type: Class
comment: Internal energy per amount of substance.
wikidataReference: https://www.wikidata.org/wiki/Q88523106
ISO80000Reference: 9-6.1
EMMO 967080e5 2f42 4eb2 a3a9 c58143e835f9: Internal energy per amount of substance.

hasModel
type: ObjectProperty

ActivityFactor
type: Class
comment: For substance X in a liquid or a solid mixture; quotient of absolute activity of substance X and the product of absolute activity of the pure substance X at the same temperature and pressure and amount-of-substance fraction of substance X.
wikidataReference: https://www.wikidata.org/wiki/Q89335167
ISO80000Reference: 9-22
EMMO 967080e5 2f42 4eb2 a3a9 c58143e835f9: For substance X in a liquid or a solid mixture; quotient of absolute activity of substance X and the product of absolute activity of the pure substance X at the same temperature and pressure and amount-of-substance fraction of substance X.
EMMO c7b62dd7 063a 4c2a 8504 42f7264ba83f: Activity factors can also be obtained applying Raoult's law or Henry's law.

TotalLinearStoppingPower
type: Class
comment: For charged particles of a given type and energy E0 the differential quotient of E with respect to x, where E is the mean energy lost by the charged particles in traversing a distance x in the given material.
subclass of: Restriction
alternative label: LinearStoppingPower
qudtReference: https://qudt.org/vocab/quantitykind/TotalLinearStoppingPower
wikidataReference: https://www.wikidata.org/wiki/Q908474
IEVReference: https://www.electropedia.org/iev/iev.nsf/display
ISO80000Reference: 10-54
EMMO 967080e5 2f42 4eb2 a3a9 c58143e835f9: For charged particles of a given type and energy E0 the differential quotient of E with respect to x, where E is the mean energy lost by the charged particles in traversing a distance x in the given material.
iupacReference: https://doi.org/10.1351/goldbook.S06035

GadoliniumSymbol
type: Class
comment: The symbol that stands for the gadolinium atom.
subclass of: Restriction
  has value: Gd
EMMO 967080e5 2f42 4eb2 a3a9 c58143e835f9: The symbol that stands for the gadolinium atom.

HandlingDevice
type: Class

ProductionSystem
type: Class
comment: A network of objects that implements a production process through a series of interconnected elements.
EMMO 967080e5 2f42 4eb2 a3a9 c58143e835f9: A network of objects that implements a production process through a series of interconnected elements.

Lethargy
type: Class
comment: Natural logarithm of the quotient of a reference energy and the kinetic energy of a neutron.
qudtReference: https://qudt.org/vocab/quantitykind/Lethargy
wikidataReference: https://www.wikidata.org/wiki/Q25508781
IEVReference: https://www.electropedia.org/iev/iev.nsf/display
ISO80000Reference: 10-69
EMMO 967080e5 2f42 4eb2 a3a9 c58143e835f9: Natural logarithm of the quotient of a reference energy and the kinetic energy of a neutron.

Plane
type: Class
comment: A 2-manifold with two unconnected boundaries.
EMMO 967080e5 2f42 4eb2 a3a9 c58143e835f9: A 2-manifold with two unconnected boundaries.

AlphaDisintegrationEnergy
type: Class
comment: Sum of the kinetic energy of the α-particle produced in the disintegration process and the recoil energy of the product atom in a reference frame in which the emitting nucleus is at rest before its disintegration.
qudtReference: http://qudt.org/vocab/quantitykind/AlphaDisintegrationEnergy
wikidataReference: https://www.wikidata.org/wiki/Q98146025
ISO80000Reference: 10-32
EMMO 967080e5 2f42 4eb2 a3a9 c58143e835f9: Sum of the kinetic energy of the α-particle produced in the disintegration process and the recoil energy of the product atom in a reference frame in which the emitting nucleus is at rest before its disintegration.

HelmholtzEnergy
type: Class
comment: Internal energy minus the product of thermodynamic temperature and entropy.
alternative label: HelmholtzFreeEnergy
wikidataReference: https://www.wikidata.org/wiki/Q865821
IEVReference: https://www.electropedia.org/iev/iev.nsf/display
ISO80000Reference: 5-20.4
EMMO 967080e5 2f42 4eb2 a3a9 c58143e835f9: Internal energy minus the product of thermodynamic temperature and entropy.
iupacReference: https://doi.org/10.1351/goldbook.H02772

ThermochemicalTreatment
type: Class

CSharp
type: Class
alternative label: C#

OxidationNumber
type: Class
comment: Charge number that an atom within a molecule would have if all the ligands were removed along with the electron pairs that were shared.
alternative label: OxidationState
wikidataReference: https://www.wikidata.org/wiki/Q484152
IEVReference: https://www.electropedia.org/iev/iev.nsf/display
dbpediaReference: https://dbpedia.org/page/Oxidation_state
EMMO 967080e5 2f42 4eb2 a3a9 c58143e835f9: Charge number that an atom within a molecule would have if all the ligands were removed along with the electron pairs that were shared.
wikipediaReference: https://en.wikipedia.org/wiki/Oxidation_state
iupacReference: https://doi.org/10.1351/goldbook.O04363

SectionModulus
type: Class
comment: Geometrical characteristic of a shape of a body.
subclass of: Restriction
qudtReference: https://qudt.org/vocab/quantitykind/SectionModulus
wikidataReference: https://www.wikidata.org/wiki/Q1930808
IEVReference: https://www.electropedia.org/iev/iev.nsf/display
ISO80000Reference: 4-22
EMMO 967080e5 2f42 4eb2 a3a9 c58143e835f9: Geometrical characteristic of a shape of a body.

NitrogenSymbol
type: Class
comment: The symbol that stands for the nitrogen atom.
subclass of: Restriction
  has value: N
EMMO 967080e5 2f42 4eb2 a3a9 c58143e835f9: The symbol that stands for the nitrogen atom.

wikidataReference
type: AnnotationProperty
comment: URL corresponding to entry in Wikidata.
sub property of: seeAlso
EMMO 967080e5 2f42 4eb2 a3a9 c58143e835f9: URL corresponding to entry in Wikidata.

RelaxationTime
type: Class
comment: time constant for scattering, trapping or annihilation of charge carriers, phonons or other quasiparticles
wikidataReference: https://www.wikidata.org/wiki/Q106041085
ISO80000Reference: 12-32.1
EMMO 967080e5 2f42 4eb2 a3a9 c58143e835f9: time constant for scattering, trapping or annihilation of charge carriers, phonons or other quasiparticles

InterferenceFitting
type: Class

AtomicMass
type: Class
comment: Since the nucleus account for nearly all of the total mass of atoms (with the electrons and nuclear binding energy making minor contributions), the atomic mass measured in Da has nearly the same value as the mass number.
comment: The atomic mass is often expressed as an average of the commonly found isotopes.
comment: The mass of an atom in the ground state.
subclass of: Restriction
EMMO 70fe84ff 99b6 4206 a9fc 9a8931836d84: The mass of an atom in the ground state.
ISO80000Reference: 10-4.1
wikipediaReference: https://en.wikipedia.org/wiki/Atomic_mass
iupacReference: https://doi.org/10.1351/goldbook.A00496

ThermalDiffusivity
type: Class
comment: Quotient of thermal conductivity and the product of mass density and specific heat capacity.
subclass of: Restriction
alternative label: ThermalDiffusionCoefficient
qudtReference: https://qudt.org/vocab/quantitykind/ThermalDiffusivity
wikidataReference: https://www.wikidata.org/wiki/Q3381809
IEVReference: https://www.electropedia.org/iev/iev.nsf/display
ISO80000Reference: 5-14
EMMO 967080e5 2f42 4eb2 a3a9 c58143e835f9: Quotient of thermal conductivity and the product of mass density and specific heat capacity.

inchiKey
type: AnnotationProperty
comment: A hash of the full International Chemical Identifier (InChi) for a chemical substance.
sub property of: seeAlso
EMMO 967080e5 2f42 4eb2 a3a9 c58143e835f9: A hash of the full International Chemical Identifier (InChi) for a chemical substance.
EMMO c7b62dd7 063a 4c2a 8504 42f7264ba83f: The InChiKey is a hash of the full InChi identifier using the SHA-256 algorithm, designed to allow for easy web searches of chemical compounds.

QueryLanguage
type: Class
comment: A construction language used to make queries in databases and information systems.
example: SQL, SPARQL
EMMO 967080e5 2f42 4eb2 a3a9 c58143e835f9: A construction language used to make queries in databases and information systems.
wikipediaReference: https://en.wikipedia.org/wiki/Query_language

hasIndex
type: ObjectProperty
comment: A semiotic relation that connects a deduced semiotic object to an index in a deduction process.
EMMO 967080e5 2f42 4eb2 a3a9 c58143e835f9: A semiotic relation that connects a deduced semiotic object to an index in a deduction process.

Powder
type: Class
comment: A powder is a granular material composed of many very fine dry solid particles that may flow freely when shaken or tilted.
is defined by: Duran, J., Reisinger A., Sands, Powders, and Grains: An Introduction to the Physics of Granular Materials. November 1999, Springer-Verlag New York, Inc., New York, ISBN 0-387-98656-1.
EMMO 967080e5 2f42 4eb2 a3a9 c58143e835f9: A powder is a granular material composed of many very fine dry solid particles that may flow freely when shaken or tilted.

BindingFraction
type: Class
comment: The ratio of the binding energy of a nucleus to the atomic mass number.
qudtReference: https://qudt.org/vocab/quantitykind/BindingFraction
wikidataReference: https://www.wikidata.org/wiki/Q98058362
ISO80000Reference: 10-23.2
EMMO 967080e5 2f42 4eb2 a3a9 c58143e835f9: The ratio of the binding energy of a nucleus to the atomic mass number.

PhaseAngle
type: Class
comment: Angular measure between the positive real axis and the radius of the polar representation of the complex number in the complex plane.
wikidataReference: https://www.wikidata.org/wiki/Q415829
IEVReference: https://www.electropedia.org/iev/iev.nsf/display
ISO80000Reference: 3-7
EMMO 967080e5 2f42 4eb2 a3a9 c58143e835f9: Angular measure between the positive real axis and the radius of the polar representation of the complex number in the complex plane.

SurfaceDensityOfElectricCharge
type: Class
comment: The derivative of the electric charge of a system with respect to the area.
alternative label: AreicElectricCharge
alternative label: SurfaceChargeDensity
wikidataReference: https://www.wikidata.org/wiki/Q12799324
IEVReference: https://www.electropedia.org/iev/iev.nsf/display
ISO80000Reference: 6-4
EMMO 967080e5 2f42 4eb2 a3a9 c58143e835f9: The derivative of the electric charge of a system with respect to the area.
iupacReference: https://doi.org/10.1351/goldbook.S06159

MolecularPartitionFunction
type: Class
comment: Partition function of a molecule.
wikidataReference: https://www.wikidata.org/wiki/Q96192064
ISO80000Reference: 9-35.4
EMMO 967080e5 2f42 4eb2 a3a9 c58143e835f9: Partition function of a molecule.

MobilityRatio
type: Class
comment: Quotient of electron and hole mobility.
qudtReference: https://qudt.org/vocab/quantitykind/MobilityRatio
wikidataReference: https://www.wikidata.org/wiki/Q106010255
ISO80000Reference: 12-31
EMMO 967080e5 2f42 4eb2 a3a9 c58143e835f9: Quotient of electron and hole mobility.

Multiplication
type: Class
subclass of: Restriction
  has value: *

Verifying
type: Class
comment: A semiosis where an interpretant, already present in the internal representational space of the interpreter, is resolved by the interpreter by identifying the referent, i.e. the entity for which the sign stands for according to the interpreter understanding.
EMMO 967080e5 2f42 4eb2 a3a9 c58143e835f9: A semiosis where an interpretant, already present in the internal representational space of the interpreter, is resolved by the interpreter by identifying the referent, i.e. the entity for which the sign stands for according to the interpreter understanding.

PhaseVelocity
type: Class
comment: For a sinusoidal wave at a given point, velocity in the direction of propagation of the wavefront corresponding to a specified phase.
alternative label: PhaseSpeed
wikidataReference: https://www.wikidata.org/wiki/Q13824
IEVReference: https://www.electropedia.org/iev/iev.nsf/display
dbpediaReference: https://dbpedia.org/page/Phase_velocity
ISO80000Reference: 3-23.1
EMMO 967080e5 2f42 4eb2 a3a9 c58143e835f9: For a sinusoidal wave at a given point, velocity in the direction of propagation of the wavefront corresponding to a specified phase.
wikipediaReference: https://en.wikipedia.org/wiki/Phase_velocity

SandMolds
type: Class

LandeFactor
type: Class
comment: Quotient of the magnetic dipole moment of an atom, and the product of the total angular momentum quantum number and the Bohr magneton.
alternative label: GFactorOfAtom
qudtReference: https://qudt.org/vocab/quantitykind/LandeGFactor
wikidataReference: https://www.wikidata.org/wiki/Q1191684
ISO80000Reference: 10-14.1
EMMO 967080e5 2f42 4eb2 a3a9 c58143e835f9: Quotient of the magnetic dipole moment of an atom, and the product of the total angular momentum quantum number and the Bohr magneton.

ActivePower
type: Class
comment: Average power over a period.
qudtReference: https://qudt.org/vocab/quantitykind/ActivePower
wikidataReference: https://www.wikidata.org/wiki/Q20820042
IEVReference: https://www.electropedia.org/iev/iev.nsf/display
ISO80000Reference: 6-56
EMMO 967080e5 2f42 4eb2 a3a9 c58143e835f9: Average power over a period.

isInfluencedBy
type: AsymmetricProperty
type: IrreflexiveProperty
type: ObjectProperty
comment: The relation between an object O that proper overlaps a process P, where the non-overlapping part of P causes O.
EMMO 967080e5 2f42 4eb2 a3a9 c58143e835f9: The relation between an object O that proper overlaps a process P, where the non-overlapping part of P causes O.

ChlorineSymbol
type: Class
comment: The symbol that stands for the chlorine atom.
subclass of: Restriction
subclass of: Restriction
  has value: Cl
EMMO 967080e5 2f42 4eb2 a3a9 c58143e835f9: The symbol that stands for the chlorine atom.

Heap
type: Class
comment: The superclass for all classes of entities that have at least two non overlapping proper parts of the same type of the whole.
EMMO 967080e5 2f42 4eb2 a3a9 c58143e835f9: The superclass for all classes of entities that have at least two non overlapping proper parts of the same type of the whole.
EMMO c7b62dd7 063a 4c2a 8504 42f7264ba83f: A heap class H (subclass of Heap) is defined by choosing a reference type φ, with H subclass of φ, so that each H entity has non overlapping φ parts.

SMILESReference
type: AnnotationProperty
comment: OpenSMILES representation of a molecular structure.
sub property of: seeAlso
EMMO 967080e5 2f42 4eb2 a3a9 c58143e835f9: OpenSMILES representation of a molecular structure.
EMMO c7b62dd7 063a 4c2a 8504 42f7264ba83f: OpenSMILES is an open specification of the SMILE language for specifying molecular structures, which has become a defacto standard for exchange of molecular structures.
wikipediaReference: Simplified molecular-input line-entry system

DissociationConstant
type: Class
comment: Ratio of the number of dissociated molecules of a specified type to the total number of dissolved molecules of this type.
subclass of: Restriction
wikidataReference: https://www.wikidata.org/wiki/Q898254
IEVReference: https://www.electropedia.org/iev/iev.nsf/display
EMMO 967080e5 2f42 4eb2 a3a9 c58143e835f9: Ratio of the number of dissociated molecules of a specified type to the total number of dissolved molecules of this type.

NeutronNumber
type: Class
comment: Number of neutrons in an atomic nucleus.
wikidataReference: https://www.wikidata.org/wiki/Q970319
IEVReference: https://www.electropedia.org/iev/iev.nsf/display
ISO80000Reference: 10-1.2
EMMO 967080e5 2f42 4eb2 a3a9 c58143e835f9: Number of neutrons in an atomic nucleus.
EMMO c7b62dd7 063a 4c2a 8504 42f7264ba83f: Atomic number (proton number) plus neutron number equals mass number.
wikipediaReference: https://en.wikipedia.org/wiki/Neutron_number
iupacReference: https://doi.org/10.1351/goldbook.N04119

NeonSymbol
type: Class
comment: The symbol that stands for the neon atom.
subclass of: Restriction
subclass of: Restriction
  has value: Ne
EMMO 967080e5 2f42 4eb2 a3a9 c58143e835f9: The symbol that stands for the neon atom.

hasInterval
type: ObjectProperty
comment: The relation between a process whole and a temporal part of the same type.
EMMO 967080e5 2f42 4eb2 a3a9 c58143e835f9: The relation between a process whole and a temporal part of the same type.

ActivityOfSolvent
type: Class
comment: For a solvent in a solution, quotient of the absolute activity and that of the pure substance at the same temperature and pressure.
wikidataReference: https://www.wikidata.org/wiki/Q89486193
ISO80000Reference: 9-27.1
EMMO 967080e5 2f42 4eb2 a3a9 c58143e835f9: For a solvent in a solution, quotient of the absolute activity and that of the pure substance at the same temperature and pressure.

LongRangeOrderParameter
type: Class
comment: Fraction of atoms in an Ising ferromagnet having magnetic moments in one direction, minus the fraction having magnetic moments in the opposite direction.
qudtReference: https://qudt.org/vocab/quantitykind/Long-RangeOrderParameter
wikidataReference: https://www.wikidata.org/wiki/Q105496124
ISO80000Reference: 12-5.2
EMMO 967080e5 2f42 4eb2 a3a9 c58143e835f9: Fraction of atoms in an Ising ferromagnet having magnetic moments in one direction, minus the fraction having magnetic moments in the opposite direction.

isRemovedFrom
type: AsymmetricProperty
type: IrreflexiveProperty
type: ObjectProperty
comment: The relation between an object O1 and a object O2 that proper overlap, where the non overapping part of O2 is caused by O1.
EMMO 967080e5 2f42 4eb2 a3a9 c58143e835f9: The relation between an object O1 and a object O2 that proper overlap, where the non overapping part of O2 is caused by O1.

Shape3Vector
type: Class
comment: A real vector with 3 elements.
example: The quantity value of physical quantities if real space is a Shape3Vector.
EMMO 967080e5 2f42 4eb2 a3a9 c58143e835f9: A real vector with 3 elements.

MatrixData
type: Class
comment: The datatype for bidimensional arrays.
EMMO 8a137e9f 579c 4e28 baca e8980eb0c3db: SubClassOf: hasSpatialTile some VectorData
EMMO 967080e5 2f42 4eb2 a3a9 c58143e835f9: The datatype for bidimensional arrays.

Flanging
type: Class

Electroplating
type: Class

gets
type: AsymmetricProperty
type: IrreflexiveProperty
type: ObjectProperty
comment: The relation between an object O1 that proper overlaps an object O2, where the non-overlapping part of O2 causes O1.
EMMO 967080e5 2f42 4eb2 a3a9 c58143e835f9: The relation between an object O1 that proper overlaps an object O2, where the non-overlapping part of O2 causes O1.

IonNumberDensity
type: Class
comment: Number of ions per volume.
subclass of: Restriction
alternative label: IonDensity
wikidataReference: https://www.wikidata.org/wiki/Q98831218
ISO80000Reference: 10-62.2
EMMO 967080e5 2f42 4eb2 a3a9 c58143e835f9: Number of ions per volume.

LivermoriumSymbol
type: Class
comment: The symbol that stands for the livermorium atom.
subclass of: Restriction
subclass of: Restriction
  has value: Lv
EMMO 967080e5 2f42 4eb2 a3a9 c58143e835f9: The symbol that stands for the livermorium atom.

InternalTask
type: Class
comment: A generic task in a workflow, that is not the begin or the end.
EMMO 967080e5 2f42 4eb2 a3a9 c58143e835f9: A generic task in a workflow, that is not the begin or the end.

ScalarMeson
type: Class
comment: A meson with spin zero and even parity.
EMMO 967080e5 2f42 4eb2 a3a9 c58143e835f9: A meson with spin zero and even parity.
wikipediaReference: https://en.wikipedia.org/wiki/Scalar_meson

ucumCode
type: AnnotationProperty
comment: Unified Code for Units of Measure (UCUM).
range: string
EMMO 967080e5 2f42 4eb2 a3a9 c58143e835f9: Unified Code for Units of Measure (UCUM).
EMMO c7b62dd7 063a 4c2a 8504 42f7264ba83f: The Unified Code for Units of Measure (UCUM) is a code system intended to include all units of measures being contemporarily used in international science, engineering, and business. The purpose is to facilitate unambiguous electronic communication of quantities together with their units.

StandardAbsoluteActivityOfMixture
type: Class
comment: For a substance in a mixture, the absolute activity of the pure substance at the same temperature but at standard pressure.
alternative label: StandardAbsoluteActivity
qudtReference: https://qudt.org/vocab/quantitykind/StandardAbsoluteActivity
wikidataReference: https://www.wikidata.org/wiki/Q89406159
ISO80000Reference: 9-23
EMMO 967080e5 2f42 4eb2 a3a9 c58143e835f9: For a substance in a mixture, the absolute activity of the pure substance at the same temperature but at standard pressure.

BetaDisintegrationEnergy
type: Class
comment: Sum of the maximum beta-particle kinetic energy and the recoil energy of the atom produced in a reference frame in which the emitting nucleus is at rest before its disintegration.
wikidataReference: https://www.wikidata.org/wiki/Q98148340
ISO80000Reference: 10-34
EMMO 967080e5 2f42 4eb2 a3a9 c58143e835f9: Sum of the maximum beta-particle kinetic energy and the recoil energy of the atom produced in a reference frame in which the emitting nucleus is at rest before its disintegration.

ThermomechanicalTreatment
type: Class

PraseodymiumSymbol
type: Class
comment: The symbol that stands for the praseodymium atom.
subclass of: Restriction
  has value: Pr
EMMO 967080e5 2f42 4eb2 a3a9 c58143e835f9: The symbol that stands for the praseodymium atom.

ErbiumSymbol
type: Class
comment: The symbol that stands for the erbium atom.
subclass of: Restriction
subclass of: Restriction
  has value: Er
EMMO 967080e5 2f42 4eb2 a3a9 c58143e835f9: The symbol that stands for the erbium atom.

SolidAngularMeasure
type: Class
comment: Measure of a conical geometric figure, called solid angle, formed by all rays, originating from a common point, called the vertex of the solid angle, and passing through the points of a closed, non-self-intersecting curve in space considered as the border of a surface.
alternative label: SolidAngle
qudtReference: https://qudt.org/vocab/quantitykind/SolidAngle
wikidataReference: https://www.wikidata.org/wiki/Q208476
IEVReference: https://www.electropedia.org/iev/iev.nsf/display
dbpediaReference: https://dbpedia.org/page/Solid_angle
ISO80000Reference: 3-8
EMMO 967080e5 2f42 4eb2 a3a9 c58143e835f9: Measure of a conical geometric figure, called solid angle, formed by all rays, originating from a common point, called the vertex of the solid angle, and passing through the points of a closed, non-self-intersecting curve in space considered as the border of a surface.
wikipediaReference: https://en.wikipedia.org/wiki/Solid_angle

ThermalUtilizationFactor
type: Class
comment: In an infinite medium, the quotient of the number of thermal neutrons absorbed in a fissionable nuclide or in a nuclear fuel, as specified, and the total number of thermal neutrons absorbed.
qudtReference: https://qudt.org/vocab/quantitykind/ThermalUtilizationFactor
wikidataReference: https://www.wikidata.org/wiki/Q99197650
ISO80000Reference: 10-76
EMMO 967080e5 2f42 4eb2 a3a9 c58143e835f9: In an infinite medium, the quotient of the number of thermal neutrons absorbed in a fissionable nuclide or in a nuclear fuel, as specified, and the total number of thermal neutrons absorbed.

FluorineSymbol
type: Class
comment: The symbol that stands for the fluorine atom.
subclass of: Restriction
subclass of: Restriction
  has value: F
EMMO 967080e5 2f42 4eb2 a3a9 c58143e835f9: The symbol that stands for the fluorine atom.

C
type: Class

ChipboardManufacturing
type: Class

MeanMassRange
type: Class
comment: Product of the mean linear range R and the mass density ρ of the material.
subclass of: Restriction
qudtReference: https://qudt.org/vocab/quantitykind/MeanMassRange
wikidataReference: https://www.wikidata.org/wiki/Q98681670
ISO80000Reference: 10-57
EMMO 967080e5 2f42 4eb2 a3a9 c58143e835f9: Product of the mean linear range R and the mass density ρ of the material.
iupacReference: https://doi.org/10.1351/goldbook.M03783

RotationalFrequency
type: Class
comment: Magnitude of the angular velocity ω divided by the angle 2π, thus n = |ω|/2π.
IEVReference: https://www.electropedia.org/iev/iev.nsf/display
ISO80000Reference: 3-17.2
EMMO 967080e5 2f42 4eb2 a3a9 c58143e835f9: Magnitude of the angular velocity ω divided by the angle 2π, thus n = |ω|/2π.

OrbitalAngularMomentumQuantumNumber
type: Class
comment: Atomic quantum number related to the orbital angular momentum l of a one-electron state.
qudtReference: https://qudt.org/vocab/quantitykind/OrbitalAngularMomentumQuantumNumber
wikidataReference: https://www.wikidata.org/wiki/Q1916324
ISO80000Reference: 10-13.3
EMMO 967080e5 2f42 4eb2 a3a9 c58143e835f9: Atomic quantum number related to the orbital angular momentum l of a one-electron state.

BlowMolding
type: Class

PrincipalQuantumNumber
type: Class
comment: Atomic quantum number related to the number n−1 of radial nodes of one-electron wave functions.
qudtReference: https://qudt.org/vocab/quantitykind/PrincipalQuantumNumber
wikidataReference: https://www.wikidata.org/wiki/Q867448
ISO80000Reference: 10-13.2
EMMO 967080e5 2f42 4eb2 a3a9 c58143e835f9: Atomic quantum number related to the number n−1 of radial nodes of one-electron wave functions.

CalciumSymbol
type: Class
comment: The symbol that stands for the calcium atom.
subclass of: Restriction
  has value: Ca
EMMO 967080e5 2f42 4eb2 a3a9 c58143e835f9: The symbol that stands for the calcium atom.

SecondPolarMomentOfArea
type: Class
comment: A geometrical property of an area which reflects how its points are distributed with regard to an arbitrary axis.
subclass of: Restriction
qudtReference: https://qudt.org/vocab/quantitykind/SecondPolarMomentOfArea
wikidataReference: https://www.wikidata.org/wiki/Q1049636
IEVReference: https://www.electropedia.org/iev/iev.nsf/display
ISO80000Reference: 4-21.2
EMMO 967080e5 2f42 4eb2 a3a9 c58143e835f9: A geometrical property of an area which reflects how its points are distributed with regard to an arbitrary axis.

PseudovectorMeson
type: Class
comment: A meson with total spin 1 and even parity.
EMMO 967080e5 2f42 4eb2 a3a9 c58143e835f9: A meson with total spin 1 and even parity.
wikipediaReference: https://en.wikipedia.org/wiki/Pseudovector_meson

Solubility
type: Class
comment: The analytical composition of a saturated solution, expressed in terms of the proportion of a designated solute in a designated solvent, is the solubility of that solute.
comment: The solubility may be expressed as a concentration, molality, mole fraction, mole ratio, etc.
wikidataReference: https://www.wikidata.org/wiki/Q170731
IEVReference: https://www.electropedia.org/iev/iev.nsf/display
EMMO 967080e5 2f42 4eb2 a3a9 c58143e835f9: The analytical composition of a saturated solution, expressed in terms of the proportion of a designated solute in a designated solvent, is the solubility of that solute.
iupacReference: https://doi.org/10.1351/goldbook.S05740

Point
type: Class
comment: A zero-manifold of only one point.
EMMO 967080e5 2f42 4eb2 a3a9 c58143e835f9: A zero-manifold of only one point.

LorenzCoefficient
type: Class
comment: Quotient of thermal conductivity, and the product of electric conductivity and thermodynamic temperature.
subclass of: Restriction
alternative label: LorenzNumber
qudtReference: https://qudt.org/vocab/quantitykind/LorenzCoefficient
wikidataReference: https://www.wikidata.org/wiki/Q105728754
ISO80000Reference: 12-18
EMMO 967080e5 2f42 4eb2 a3a9 c58143e835f9: Quotient of thermal conductivity, and the product of electric conductivity and thermodynamic temperature.

InspectionDevice
type: Class

Gel
type: Class
comment: A soft, solid or solid-like colloid consisting of two or more components, one of which is a liquid, present in substantial quantity.
EMMO 967080e5 2f42 4eb2 a3a9 c58143e835f9: A soft, solid or solid-like colloid consisting of two or more components, one of which is a liquid, present in substantial quantity.

ConfigurationLanguage
type: Class
comment: A construction language used to write configuration files.
example: .ini files
example: Files in the standard .config directory on Unix systems.
EMMO 967080e5 2f42 4eb2 a3a9 c58143e835f9: A construction language used to write configuration files.
wikipediaReference: https://en.wikipedia.org/wiki/Configuration_file#Configuration_languages

AffinityOfAChemicalReaction
type: Class
comment: Describes elements' or compounds' readiness to form bonds.
subclass of: Restriction
alternative label: ChemicalAffinity
qudtReference: https://qudt.org/vocab/quantitykind/ChemicalAffinity
wikidataReference: https://www.wikidata.org/wiki/Q382783
ISO80000Reference: 9-30
EMMO 967080e5 2f42 4eb2 a3a9 c58143e835f9: Describes elements' or compounds' readiness to form bonds.
iupacReference: https://doi.org/10.1351/goldbook.A00178

Porosity
type: Class
comment: Ratio of void volume and total volume of a porous material.
wikidataReference: https://www.wikidata.org/wiki/Q622669
IEVReference: https://www.electropedia.org/iev/iev.nsf/display
EMMO 967080e5 2f42 4eb2 a3a9 c58143e835f9: Ratio of void volume and total volume of a porous material.
iupacReference: https://doi.org/10.1351/goldbook.P04762

ThermodynamicCriticalMagneticFluxDensity
type: Class
comment: The magnetic flux density for disappearance of superconductivity in a type I superconductor.
qudtReference: https://qudt.org/vocab/quantitykind/ThermodynamicCriticalMagneticFluxDensity
wikidataReference: https://www.wikidata.org/wiki/Q106103200
ISO80000Reference: 12-36.1
EMMO 967080e5 2f42 4eb2 a3a9 c58143e835f9: The magnetic flux density for disappearance of superconductivity in a type I superconductor.

RelativeMassExcess
type: Class
comment: Quotient of mass excess and the unified atomic mass constant.
qudtReference: https://qudt.org/vocab/quantitykind/RelativeMassExcess
wikidataReference: https://www.wikidata.org/wiki/Q98038610
ISO80000Reference: 10-22.1
EMMO 967080e5 2f42 4eb2 a3a9 c58143e835f9: Quotient of mass excess and the unified atomic mass constant.

POH
type: Class
comment: Written as pOH
comment: number quantifying the acidic or the alkaline character of a solution, equal to the negative of the decimal logarithm of ion activity aOH- of the hydroxide anion OH- pH = −10 log(a_OH-)
EMMO 967080e5 2f42 4eb2 a3a9 c58143e835f9: number quantifying the acidic or the alkaline character of a solution, equal to the negative of the decimal logarithm of ion activity aOH- of the hydroxide anion OH- pH = −10 log(a_OH-)

ActiniumSymbol
type: Class
comment: The symbol that stands for the actinium atom.
subclass of: Restriction
subclass of: Restriction
  has value: Ac
EMMO 967080e5 2f42 4eb2 a3a9 c58143e835f9: The symbol that stands for the actinium atom.

PerQuarticLengthUnit
type: Class
comment: The class of units with physical dimensionality per length to the power of four.
subclass of: Restriction
  has value: T0 L-4 M0 I0 Θ0 N0 J0
EMMO 967080e5 2f42 4eb2 a3a9 c58143e835f9: The class of units with physical dimensionality per length to the power of four.

ApplicationSpecificScript
type: Class
comment: A scripting language developed specifically for an application, so that it's usage and interpretation is limited in this context.
example: Scripting file for the execution of modelling software such as LAMMPS, OpenFOAM, or for general purpose platforms such as MATLAB or Mathematica.
EMMO 967080e5 2f42 4eb2 a3a9 c58143e835f9: A scripting language developed specifically for an application, so that it's usage and interpretation is limited in this context.

ElectronAffinity
type: Class
comment: energy difference between an electron at rest at infinity and an electron at the lowest level of the conduction band in an insulator or semiconductor
qudtReference: https://qudt.org/vocab/quantitykind/ElectronAffinity
wikidataReference: https://www.wikidata.org/wiki/Q105846486
IEVReference: https://www.electropedia.org/iev/iev.nsf/display
ISO80000Reference: 12-25
EMMO 967080e5 2f42 4eb2 a3a9 c58143e835f9: energy difference between an electron at rest at infinity and an electron at the lowest level of the conduction band in an insulator or semiconductor

RelativeMassDensity
type: Class
comment: Mass density ρ of a substance divided by the mass density ρ0 of a reference substance, under conditions that should be specified for both substances.
alternative label: RelativeDensity
wikidataReference: https://www.wikidata.org/wiki/Q11027905
IEVReference: https://www.electropedia.org/iev/iev.nsf/display
ISO80000Reference: 4-4
EMMO 967080e5 2f42 4eb2 a3a9 c58143e835f9: Mass density ρ of a substance divided by the mass density ρ0 of a reference substance, under conditions that should be specified for both substances.
iupacReference: https://doi.org/10.1351/goldbook.R05262

DoseEquivalent
type: Class
comment: A dose quantity used in the International Commission on Radiological Protection (ICRP) system of radiological protection.
subclass of: Restriction
qudtReference: http://qudt.org/vocab/quantitykind/DoseEquivalent
ISO80000Reference: 10-83.1
EMMO 967080e5 2f42 4eb2 a3a9 c58143e835f9: A dose quantity used in the International Commission on Radiological Protection (ICRP) system of radiological protection.
iupacReference: https://doi.org/10.1351/goldbook.E02101

UnifiedAtomicMassConstant
type: Class
comment: 1/12 of the mass of an atom of the nuclide 12C in the ground state at rest.
subclass of: Restriction
wikidataReference: https://www.wikidata.org/wiki/Q4817337
IEVReference: https://www.electropedia.org/iev/iev.nsf/display
ISO80000Reference: 10-4.3
EMMO 967080e5 2f42 4eb2 a3a9 c58143e835f9: 1/12 of the mass of an atom of the nuclide 12C in the ground state at rest.
iupacReference: https://doi.org/10.1351/goldbook.A00497

MagneticMoment
type: Class
comment: A vector quantity equal to the product of the current, the loop area, and the unit vector normal to the loop plane, the direction of which corresponds to the loop orientation
subclass of: Restriction
alternative label: MagneticAreaMoment
qudtReference: https://qudt.org/vocab/quantitykind/MagneticMoment
wikidataReference: https://www.wikidata.org/wiki/Q242657
IEVReference: https://www.electropedia.org/iev/iev.nsf/display
ISO80000Reference: 6-23
EMMO 967080e5 2f42 4eb2 a3a9 c58143e835f9: A vector quantity equal to the product of the current, the loop area, and the unit vector normal to the loop plane, the direction of which corresponds to the loop orientation
iupacReference: https://doi.org/10.1351/goldbook.M03688

BohrRadius
type: Class
comment: Radius of the electron orbital in the hydrogen atom in its ground state in the Bohr model of the atom.
qudtReference: https://qudt.org/vocab/constant/BohrRadius
wikidataReference: https://www.wikidata.org/wiki/Q652571
ISO80000Reference: 10-6
EMMO 967080e5 2f42 4eb2 a3a9 c58143e835f9: Radius of the electron orbital in the hydrogen atom in its ground state in the Bohr model of the atom.
iupacReference: https://doi.org/10.1351/goldbook.B00693

EffectiveMass
type: Class
comment: The mass that it seems to have when responding to forces, or the mass that it seems to have when interacting with other identical particles in a thermal distribution.
qudtReference: https://qudt.org/vocab/quantitykind/EffectiveMass
wikidataReference: https://www.wikidata.org/wiki/Q1064434
ISO80000Reference: 12-30
EMMO 967080e5 2f42 4eb2 a3a9 c58143e835f9: The mass that it seems to have when responding to forces, or the mass that it seems to have when interacting with other identical particles in a thermal distribution.

ParticleConcentration
type: Class
comment: Number of particles of a given species per volume.
subclass of: Restriction
wikidataReference: https://www.wikidata.org/wiki/Q39078574
ISO80000Reference: 9-9.1
EMMO 967080e5 2f42 4eb2 a3a9 c58143e835f9: Number of particles of a given species per volume.

ScandiumSymbol
type: Class
comment: The symbol that stands for the scandium atom.
subclass of: Restriction
subclass of: Restriction
  has value: Sc
EMMO 967080e5 2f42 4eb2 a3a9 c58143e835f9: The symbol that stands for the scandium atom.

SeaborgiumSymbol
type: Class
comment: The symbol that stands for the seaborgium atom.
subclass of: Restriction
  has value: Sg
EMMO 967080e5 2f42 4eb2 a3a9 c58143e835f9: The symbol that stands for the seaborgium atom.

hasJunctionPart
type: ObjectProperty
comment: The part is connected with the rest item or members with both hasNext (or its inverse) and hasContact relations.
alternative label: hasSpatioTemporalPart
EMMO 967080e5 2f42 4eb2 a3a9 c58143e835f9: The part is connected with the rest item or members with both hasNext (or its inverse) and hasContact relations.

Enthalpy
type: Class
comment: Measurement of energy in a thermodynamic system.
qudtReference: http://qudt.org/vocab/quantitykind/Enthalpy
ISO80000Reference: 5.20-3
EMMO 967080e5 2f42 4eb2 a3a9 c58143e835f9: Measurement of energy in a thermodynamic system.
iupacReference: https://doi.org/10.1351/goldbook.E02141

LarmonFrequency
type: Class
comment: Quotient of Larmor angular frequency and 2π.
ISO80000Reference: 10-15.2
EMMO 967080e5 2f42 4eb2 a3a9 c58143e835f9: Quotient of Larmor angular frequency and 2π.

SolubilityProduct
type: Class
comment: For the dissociation of a salt AmBn → mA + nB, the solubility product is KSP = am(A) ⋅ an(B), where a is ionic activity and m and n are the stoichiometric numbers.
comment: Product of the ion activities of the ions resulting from the dissociation of a solute in a saturated solution, raised to powers equal to their stoichiometric numbers.
subclass of: Restriction
alternative label: SolubilityProductConstant
wikidataReference: https://www.wikidata.org/wiki/Q11229788
IEVReference: https://www.electropedia.org/iev/iev.nsf/display
EMMO 967080e5 2f42 4eb2 a3a9 c58143e835f9: Product of the ion activities of the ions resulting from the dissociation of a solute in a saturated solution, raised to powers equal to their stoichiometric numbers.
iupacReference: https://doi.org/10.1351/goldbook.S05742

ElectronDensity
type: Class
comment: Number of electrons in conduction band per volume.
subclass of: Restriction
qudtReference: https://qudt.org/vocab/quantitykind/ElectronDensity
IEVReference: https://www.electropedia.org/iev/iev.nsf/display
ISO80000Reference: 12-29.1
EMMO 967080e5 2f42 4eb2 a3a9 c58143e835f9: Number of electrons in conduction band per volume.

chemicalSymbolValue
type: DatatypeProperty

Emulsion
type: Class
comment: An emulsion is a mixture of two or more liquids that are normally immiscible (a liquid-liquid heterogeneous mixture).
example: Mayonnaise, milk.
EMMO 967080e5 2f42 4eb2 a3a9 c58143e835f9: An emulsion is a mixture of two or more liquids that are normally immiscible (a liquid-liquid heterogeneous mixture).

NonNuclear
type: Class
comment: The superclass for all classes of entities that have a proper parts of the same type φ of the whole, but have no φ proper part that is part of other φ proper parts.
EMMO 967080e5 2f42 4eb2 a3a9 c58143e835f9: The superclass for all classes of entities that have a proper parts of the same type φ of the whole, but have no φ proper part that is part of other φ proper parts.

BromineSymbol
type: Class
comment: The symbol that stands for the bromine atom.
subclass of: Restriction
subclass of: Restriction
  has value: Br
EMMO 967080e5 2f42 4eb2 a3a9 c58143e835f9: The symbol that stands for the bromine atom.

NumberOfEntities
type: Class
comment: Discrete quantity; number of entities of a given kind in a system.
wikidataReference: https://www.wikidata.org/wiki/Q614112
IEVReference: https://www.electropedia.org/iev/iev.nsf/display
ISO80000Reference: 9-1
EMMO 967080e5 2f42 4eb2 a3a9 c58143e835f9: Discrete quantity; number of entities of a given kind in a system.
iupacReference: https://doi.org/10.1351/goldbook.N04266

MolecularFormula
type: Class
comment: An expression that provides information about the element types that constiture a molecule or a molecular substance and their number.
subclass of: Restriction
example: Hydrogen peroxide is H2O2
EMMO 967080e5 2f42 4eb2 a3a9 c58143e835f9: An expression that provides information about the element types that constiture a molecule or a molecular substance and their number.

hasSIQuantityValue
type: DatatypeProperty
comment: Relates a physical quantity to its value specified as a string consisting of a numerical, a separator and a unit.
sub property of: topDataProperty
example: Example showing how to specify the value of a physical quantity in turtle using hasSIQuantityValue: height1 a emmo:Height ; hasSIQuantityValue "3 cm"^^emmo:SIQuantityDatatype .
EMMO 967080e5 2f42 4eb2 a3a9 c58143e835f9: Relates a physical quantity to its value specified as a string consisting of a numerical, a separator and a unit.
EMMO c7b62dd7 063a 4c2a 8504 42f7264ba83f: Using hasSIQuantityValue is a convenient, but less semantic, alternative to specify value and unit of a physical quantity compared to using the 'hasNumericalPart' and 'hasReferencePart'/'hasMetrologicalReference' relations. The unit should be a valid, possible prefixed, derived SI unit.

LiquidSol
type: Class
comment: A type of sol in the form of one solid dispersed in liquid.
EMMO 967080e5 2f42 4eb2 a3a9 c58143e835f9: A type of sol in the form of one solid dispersed in liquid.

ElementalSubstance
type: Class
comment: A chemical substance composed of atoms with the same number of protons in the atomic nucleus.
alternative label: PureSubstance
EMMO 967080e5 2f42 4eb2 a3a9 c58143e835f9: A chemical substance composed of atoms with the same number of protons in the atomic nucleus.
iupacReference: https://doi.org/10.1351/goldbook.C01022

Momentum
type: Class
comment: Product of mass and velocity.
subclass of: Restriction
qudtReference: http://qudt.org/vocab/quantitykind/Momentum
ISO80000Reference: 4-8
EMMO 967080e5 2f42 4eb2 a3a9 c58143e835f9: Product of mass and velocity.
iupacReference: https://doi.org/10.1351/goldbook.M04007

DubniumSymbol
type: Class
comment: The symbol that stands for the dubnium atom.
subclass of: Restriction
  has value: Db
EMMO 967080e5 2f42 4eb2 a3a9 c58143e835f9: The symbol that stands for the dubnium atom.

ParticleEmissionRate
type: Class
comment: Differential quotient of N with respect to time, where N is the number of particles being emitted from an infinitesimally small volume element in the time interval of duration dt, and dt.
wikidataReference: https://www.wikidata.org/wiki/Q98153151
ISO80000Reference: 10-36
EMMO 967080e5 2f42 4eb2 a3a9 c58143e835f9: Differential quotient of N with respect to time, where N is the number of particles being emitted from an infinitesimally small volume element in the time interval of duration dt, and dt.

StaticFrictionForce
type: Class
comment: Fhe force of friction on an object that is not moving.
alternative label: StaticFriction
qudtReference: https://qudt.org/vocab/quantitykind/StaticFriction
wikidataReference: https://www.wikidata.org/wiki/Q90862568
ISO80000Reference: 4-9.3
EMMO 967080e5 2f42 4eb2 a3a9 c58143e835f9: Fhe force of friction on an object that is not moving.

affects
type: AsymmetricProperty
type: IrreflexiveProperty
type: ObjectProperty
comment: The relation between a process P that through overlaps an object O.
EMMO 967080e5 2f42 4eb2 a3a9 c58143e835f9: The relation between a process P that through overlaps an object O.

AverageLogarithmicEnergyDecrement
type: Class
comment: Average value of the increment of the lethargy per collision.
qudtReference: https://qudt.org/vocab/quantitykind/AverageLogarithmicEnergyDecrement.html
wikidataReference: https://www.wikidata.org/wiki/Q1940739
IEVReference: https://www.electropedia.org/iev/iev.nsf/display
ISO80000Reference: 10-70
EMMO 967080e5 2f42 4eb2 a3a9 c58143e835f9: Average value of the increment of the lethargy per collision.

hasServiceOutput
type: ObjectProperty

CeriumSymbol
type: Class
comment: The symbol that stands for the cerium atom.
subclass of: Restriction
subclass of: Restriction
  has value: Ce
EMMO 967080e5 2f42 4eb2 a3a9 c58143e835f9: The symbol that stands for the cerium atom.

ElectronMass
type: Class
comment: The rest mass of an electron.
qudtReference: http://qudt.org/vocab/constant/ElectronMass
EMMO 967080e5 2f42 4eb2 a3a9 c58143e835f9: The rest mass of an electron.
iupacReference: https://doi.org/10.1351/goldbook.E02008

isProcessOutputOf
type: AsymmetricProperty
type: IrreflexiveProperty
type: ObjectProperty
comment: The relation between a process P1 that proper overlaps a process P2, where the non overlapping part of P1 is caused by P2.
EMMO 967080e5 2f42 4eb2 a3a9 c58143e835f9: The relation between a process P1 that proper overlaps a process P2, where the non overlapping part of P1 is caused by P2.

NeutralAtom
type: Class
comment: A standalone atom that has no net charge.
EMMO 967080e5 2f42 4eb2 a3a9 c58143e835f9: A standalone atom that has no net charge.

hasTemporalBegin
type: ObjectProperty

StandardAmountConcentration
type: Class
comment: Chosen value of amount concentration, usually equal to 1 mol dm−3.
alternative label: StandardConcentration
alternative label: StandardMolarConcentration
wikidataReference: https://www.wikidata.org/wiki/Q88871689
ISO80000Reference: 9-12.2
EMMO 967080e5 2f42 4eb2 a3a9 c58143e835f9: Chosen value of amount concentration, usually equal to 1 mol dm−3.
iupacReference: https://doi.org/10.1351/goldbook.S05909

Minus
type: Class
subclass of: Restriction
  has value: -

ChemicalEntity
type: Class
comment: A chemical entity comprises the two different ways to represents matter: as single recognizable particle entity (molecular entity) and as a composition of particle entities (substance). This distinction is not well assessed in actual chemical nomenclature, in which an element name refers to both the pure elemental substance or the atom. In the EMMO we force the adoption of a more strict categorization based on mereotopology. The class Material hosts the subclasses for which a substance can be identified without necessarily considering its nature of molecule/atom or substance (e.g. hydrocarbon is the class of both hydrocarbon molecules or gases).

MaximumEfficiency
type: Class
comment: Efficiency of an ideal heat engine operating according to the Carnot process.
alternative label: CarnotEfficiency
wikidataReference: https://www.wikidata.org/wiki/Q93949862
ISO80000Reference: 5-25.2
EMMO 967080e5 2f42 4eb2 a3a9 c58143e835f9: Efficiency of an ideal heat engine operating according to the Carnot process.

CoherenceLength
type: Class
comment: Distance in a superconductor over which the effect of a perturbation is appreciable at zero thermodynamic temperature
wikidataReference: https://www.wikidata.org/wiki/Q1778793
ISO80000Reference: 12-38.2
EMMO 967080e5 2f42 4eb2 a3a9 c58143e835f9: Distance in a superconductor over which the effect of a perturbation is appreciable at zero thermodynamic temperature

HotDipGalvanizing
type: Class
alternative label: Hot-dipGalvanizing

PlanckFunction
type: Class
comment: Ngative quotient of Gibbs energy and temperature.
subclass of: Restriction
qudtReference: https://qudt.org/vocab/quantitykind/PlanckFunction
wikidataReference: https://www.wikidata.org/wiki/Q76364998
IEVReference: https://www.electropedia.org/iev/iev.nsf/display
ISO80000Reference: 5-23
EMMO 967080e5 2f42 4eb2 a3a9 c58143e835f9: Ngative quotient of Gibbs energy and temperature.

ElectromagneticEnergyDensity
type: Class
comment: Arithmetic average of (electric field strength multiplied by electric flux density) and (magnetic field strength multiplied by magnetic flux density).
subclass of: Restriction
alternative label: VolumicElectromagneticEnergy
qudtReference: https://qudt.org/vocab/quantitykind/ElectromagneticEnergyDensity
wikidataReference: https://www.wikidata.org/wiki/Q77989624
IEVReference: https://www.electropedia.org/iev/iev.nsf/display
ISO80000Reference: 6-33
EMMO 967080e5 2f42 4eb2 a3a9 c58143e835f9: Arithmetic average of (electric field strength multiplied by electric flux density) and (magnetic field strength multiplied by magnetic flux density).

DebyeWallerFactor
type: Class
comment: Factor by which the intensity of a diffraction line is reduced because of the lattice vibrations.
qudtReference: https://qudt.org/vocab/quantitykind/Debye-WallerFactor
wikidataReference: https://www.wikidata.org/wiki/Q902587
ISO80000Reference: 12-8
EMMO 967080e5 2f42 4eb2 a3a9 c58143e835f9: Factor by which the intensity of a diffraction line is reduced because of the lattice vibrations.

EuropiumSymbol
type: Class
comment: The symbol that stands for the europium atom.
subclass of: Restriction
subclass of: Restriction
  has value: Eu
EMMO 967080e5 2f42 4eb2 a3a9 c58143e835f9: The symbol that stands for the europium atom.

Resolving
type: Class
comment: A semiosis where the interpreter perceives a sign, that generates the interpretant as interpreter's internal representation. Than the interpretant is resolved by the interpreter by identifying the referent, i.e. the entity for which the sign stands for according to the interpreter understanding.
example: Someone says: "Ketchup." (sign). I (interpreter) hear that, elaborate internally the perception by creating an internal representation (interpretant), and then reach for the ketchup bottle (referent).
EMMO 967080e5 2f42 4eb2 a3a9 c58143e835f9: A semiosis where the interpreter perceives a sign, that generates the interpretant as interpreter's internal representation. Than the interpretant is resolved by the interpreter by identifying the referent, i.e. the entity for which the sign stands for according to the interpreter understanding.

TennessineSymbol
type: Class
comment: The symbol that stands for the tennessine atom.
subclass of: Restriction
  has value: Ts
EMMO 967080e5 2f42 4eb2 a3a9 c58143e835f9: The symbol that stands for the tennessine atom.

Spray
type: Class
comment: A suspension of liquid droplets dispersed in a gas through an atomization process.
EMMO 967080e5 2f42 4eb2 a3a9 c58143e835f9: A suspension of liquid droplets dispersed in a gas through an atomization process.

CobaltSymbol
type: Class
comment: The symbol that stands for the cobalt atom.
subclass of: Restriction
subclass of: Restriction
  has value: Co
EMMO 967080e5 2f42 4eb2 a3a9 c58143e835f9: The symbol that stands for the cobalt atom.

hasBeginTask
type: ObjectProperty
comment: The relation identifying the tasks of a workflow that are not causally temporally dependent by other parts of the workflow.
EMMO 967080e5 2f42 4eb2 a3a9 c58143e835f9: The relation identifying the tasks of a workflow that are not causally temporally dependent by other parts of the workflow.

ContinuousCasting
type: Class

MathematicalFunction
type: Class
comment: A function defined using functional notation.
comment: A mathematical relation that relates each element in the domain (X) to exactly one element in the range (Y).
alternative label: FunctionDefinition
example: y = f(x)
EMMO 967080e5 2f42 4eb2 a3a9 c58143e835f9: A function defined using functional notation.

PotentialEnergy
type: Class
comment: The energy possessed by a body by virtue of its position or orientation in a potential field.
qudtReference: http://qudt.org/vocab/quantitykind/PotentialEnergy
ISO80000Reference: 4-28.1
EMMO 967080e5 2f42 4eb2 a3a9 c58143e835f9: The energy possessed by a body by virtue of its position or orientation in a potential field.
iupacReference: https://doi.org/10.1351/goldbook.P04778

MetallicMaterial
type: Class
comment: Inorganic substance, consisting of one or more metallic elements.
EMMO 967080e5 2f42 4eb2 a3a9 c58143e835f9: Inorganic substance, consisting of one or more metallic elements.
EMMO c7b62dd7 063a 4c2a 8504 42f7264ba83f: Metallic materials are known for their shiny luster, excellent electrical/thermal conductivity, malleability (shapable by hammering), and ductility (can be drawn into wires), due to metallic bonding (shared electrons); they often form alloys (like steel from iron/carbon) to enhance these properties for diverse applications.

ThermalDiffusionFactor
type: Class
comment: Quotient of the thermal diffusion ratio and the product of the local amount-of-substance fractions.
qudtReference: https://qudt.org/vocab/quantitykind/ThermalDiffusionFactor
wikidataReference: https://www.wikidata.org/wiki/Q96249629
ISO80000Reference: 9-40.2
EMMO 967080e5 2f42 4eb2 a3a9 c58143e835f9: Quotient of the thermal diffusion ratio and the product of the local amount-of-substance fractions.

MassDefect
type: Class
comment: Sum of the product of the proton number and the hydrogen atomic mass, and the neutron rest mass, minus the rest mass of the atom.
qudtReference: https://qudt.org/vocab/quantitykind/MassDefect
wikidataReference: https://www.wikidata.org/wiki/Q26897126
ISO80000Reference: 10-21.2
EMMO 967080e5 2f42 4eb2 a3a9 c58143e835f9: Sum of the product of the proton number and the hydrogen atomic mass, and the neutron rest mass, minus the rest mass of the atom.

MachineCell
type: Class
comment: A group of machineries used to process a group of similar parts.
comment: Is not simply a collection of machineries, since the connection between them is due to the parallel flow of processed parts that comes from a unique source and ends into a common repository.
EMMO 967080e5 2f42 4eb2 a3a9 c58143e835f9: A group of machineries used to process a group of similar parts.

InjectionMolding
type: Class

MigrationArea
type: Class
comment: Sum of the slowing-down area from fission energy to thermal energy and the diffusion area for thermal neutrons.
qudtReference: https://qudt.org/vocab/quantitykind/MigrationArea
wikidataReference: https://www.wikidata.org/wiki/Q98966325
ISO80000Reference: 10-72.3
EMMO 967080e5 2f42 4eb2 a3a9 c58143e835f9: Sum of the slowing-down area from fission energy to thermal energy and the diffusion area for thermal neutrons.

Vapor
type: Class
comment: A liquid aerosol composed of water droplets in air or another gas.
EMMO 967080e5 2f42 4eb2 a3a9 c58143e835f9: A liquid aerosol composed of water droplets in air or another gas.

DropForging
type: Class

InorganicCompound
type: Class
comment: A chemical compound that is not organic.
EMMO 967080e5 2f42 4eb2 a3a9 c58143e835f9: A chemical compound that is not organic.

isSignFor
type: ObjectProperty

AntimonySymbol
type: Class
comment: The symbol that stands for the antimony atom.
subclass of: Restriction
  has value: Sb
EMMO 967080e5 2f42 4eb2 a3a9 c58143e835f9: The symbol that stands for the antimony atom.

LeakageFactor
type: Class
comment: One minus the square of the coupling factor
wikidataReference: https://www.wikidata.org/wiki/Q78102042
IEVReference: https://www.electropedia.org/iev/iev.nsf/display
ISO80000Reference: 6-42.2
EMMO 967080e5 2f42 4eb2 a3a9 c58143e835f9: One minus the square of the coupling factor

SiliconSymbol
type: Class
comment: The symbol that stands for the silicon atom.
subclass of: Restriction
subclass of: Restriction
  has value: Si
EMMO 967080e5 2f42 4eb2 a3a9 c58143e835f9: The symbol that stands for the silicon atom.

Admittance
type: Class
comment: Inverse of the impendance.
alternative label: ComplexAdmittance
qudtReference: https://qudt.org/vocab/quantitykind/Admittance
wikidataReference: https://www.wikidata.org/wiki/Q214518
IEVReference: https://www.electropedia.org/iev/iev.nsf/display
dbpediaReference: https://dbpedia.org/page/Admittance
ISO80000Reference: 6-52.1
EMMO 967080e5 2f42 4eb2 a3a9 c58143e835f9: Inverse of the impendance.

LuminousEfficacyOf540THzRadiation
type: Class
comment: Defines the Candela base unit in the SI system.
comment: The luminous efficacy of monochromatic radiation of frequency 540 × 10 12 Hz, K cd , is a technical constant that gives an exact numerical relationship between the purely physical characteristics of the radiant power stimulating the human eye (W) and its photobiological response defined by the luminous flux due to the spectral responsivity of a standard observer (lm) at a frequency of 540 × 10 12 hertz.
subclass of: Restriction
EMMO 967080e5 2f42 4eb2 a3a9 c58143e835f9: The luminous efficacy of monochromatic radiation of frequency 540 × 10 12 Hz, K cd , is a technical constant that gives an exact numerical relationship between the purely physical characteristics of the radiant power stimulating the human eye (W) and its photobiological response defined by the luminous flux due to the spectral responsivity of a standard observer (lm) at a frequency of 540 × 10 12 hertz.

Heteronuclear
type: Class
comment: A molecule composed of more than one element type.
example: Nitric oxide (NO) or carbon dioxide (CO₂).
EMMO 967080e5 2f42 4eb2 a3a9 c58143e835f9: A molecule composed of more than one element type.

MetrologicalSymbol
type: Class
comment: A symbol that stands for a concept in the language of the meterological domain of ISO 80000.
subclass of: Restriction
  all values from: Class
equivalent class: Class
EMMO 967080e5 2f42 4eb2 a3a9 c58143e835f9: A symbol that stands for a concept in the language of the meterological domain of ISO 80000.

AcousticQuantity
type: Class
comment: Quantities categorised according to ISO 80000-8.
EMMO 967080e5 2f42 4eb2 a3a9 c58143e835f9: Quantities categorised according to ISO 80000-8.

IEVReference
type: AnnotationProperty
comment: URL for the entry in the International Electrotechnical Vocabulary (IEV).
sub property of: seeAlso
EMMO 967080e5 2f42 4eb2 a3a9 c58143e835f9: URL for the entry in the International Electrotechnical Vocabulary (IEV).

ModulusOfCompression
type: Class
comment: Measure of how resistant to compressibility a substance is.
subclass of: Restriction
alternative label: BulkModulus
qudtReference: https://qudt.org/vocab/quantitykind/BulkModulus
wikidataReference: https://www.wikidata.org/wiki/Q900371
IEVReference: https://www.electropedia.org/iev/iev.nsf/display
ISO80000Reference: 4-19.3
EMMO 967080e5 2f42 4eb2 a3a9 c58143e835f9: Measure of how resistant to compressibility a substance is.

RestEnergy
type: Class
comment: Product of the rest mass and the square of the speed of light in vacuum.
wikidataReference: https://www.wikidata.org/wiki/Q11663629
IEVReference: https://www.electropedia.org/iev/iev.nsf/display
ISO80000Reference: 10-3
EMMO 967080e5 2f42 4eb2 a3a9 c58143e835f9: Product of the rest mass and the square of the speed of light in vacuum.
EMMO c7b62dd7 063a 4c2a 8504 42f7264ba83f: E_0 = m_0 * c_0^2 where m_0 is the rest mass of that particle and c_0 is the speed of light in a vacuum.
wikipediaReference: https://en.wikipedia.org/wiki/Invariant_mass#Rest_energy

Command
type: Class
comment: An instruction to a computer system to perform a given task.
example: From a bash shell would e.g. `ls` be a command. Another example of a shell command would be `/path/to/executable arg1 arg2`.
EMMO c7b62dd7 063a 4c2a 8504 42f7264ba83f: A command must be interpretable by the computer system.
EMMO c7b62dd7 063a 4c2a 8504 42f7264ba83f: Commands are typically performed from a shell or a shell script, but not limited to them.

ChromiumSymbol
type: Class
comment: The symbol that stands for the chromium atom.
subclass of: Restriction
  has value: Cr
EMMO 967080e5 2f42 4eb2 a3a9 c58143e835f9: The symbol that stands for the chromium atom.

ParticlePositionVector
type: Class
comment: Position vector of a particle.
qudtReference: https://qudt.org/vocab/quantitykind/ParticlePositionVector
wikidataReference: https://www.wikidata.org/wiki/Q105533324
ISO80000Reference: 12-7.1
EMMO 967080e5 2f42 4eb2 a3a9 c58143e835f9: Position vector of a particle.

PowerFactor
type: Class
comment: Under periodic conditions, ratio of the absolute value of the active power P to the apparent power S.
qudtReference: https://qudt.org/vocab/quantitykind/PowerFactor
wikidataReference: https://www.wikidata.org/wiki/Q750454
IEVReference: https://www.electropedia.org/iev/iev.nsf/display
ISO80000Reference: 6-58
EMMO 967080e5 2f42 4eb2 a3a9 c58143e835f9: Under periodic conditions, ratio of the absolute value of the active power P to the apparent power S.

DiffusionCoefficientForFluenceRate
type: Class
comment: Proportionality constant between the particle current density J and the gradient of the particle fluence rate.
qudtReference: https://qudt.org/vocab/quantitykind/DiffusionCoefficientForFluenceRate
wikidataReference: https://www.wikidata.org/wiki/Q98876254
ISO80000Reference: 10-65
EMMO 967080e5 2f42 4eb2 a3a9 c58143e835f9: Proportionality constant between the particle current density J and the gradient of the particle fluence rate.

SpecificHelmholtzEnergy
type: Class
comment: Helmholtz energy per unit mass.
qudtReference: https://qudt.org/vocab/quantitykind/SpecificHelmholtzEnergy
wikidataReference: https://www.wikidata.org/wiki/Q76359554
ISO80000Reference: 5-21.4
EMMO 967080e5 2f42 4eb2 a3a9 c58143e835f9: Helmholtz energy per unit mass.

hasCognised
type: ObjectProperty
comment: A semiotic relation connecting a recogniting interpreter to the "cognised" semiotic object in a cognition process.
EMMO 967080e5 2f42 4eb2 a3a9 c58143e835f9: A semiotic relation connecting a recogniting interpreter to the "cognised" semiotic object in a cognition process.

hasChemicalComposition
type: ObjectProperty
comment: Relates a substance to chemical composition.
example: This relation can be used to relate a material to a chemical composition quantity of one of its chemical species. For example, the amount of aluminium in substance subst:alloy1 can be expressed as: ```turtle subst:alloy1 a emmo:Substance ; emmo:hasChemicalComposition [ a emmo:SingleComponentComposition ; emmo:hasSpeciesPart [ a emmo:AluminiumSymbol ] ; emmo:hasQuantityPart [ a emmo:MassFraction ; hasSIQuantityValue "98.1 wt%"^^emmo:SIQuantityDatatype ] ] . ```
EMMO 967080e5 2f42 4eb2 a3a9 c58143e835f9: Relates a substance to chemical composition.
EMMO c7b62dd7 063a 4c2a 8504 42f7264ba83f: This property is often used to relate a substance directly to SingleComponentComposition indifiduals for each of its components.

HalfValueThickness
type: Class
comment: Thickness of the attenuating layer that reduces the quantity of interest of a unidirectional beam of infinitesimal width to half of its initial value.
qudtReference: https://qudt.org/vocab/quantitykind/Half-ValueThickness
wikidataReference: https://www.wikidata.org/wiki/Q127526
IEVReference: https://www.electropedia.org/iev/iev.nsf/display
ISO80000Reference: 10-53
EMMO 967080e5 2f42 4eb2 a3a9 c58143e835f9: Thickness of the attenuating layer that reduces the quantity of interest of a unidirectional beam of infinitesimal width to half of its initial value.

Assembled
type: Class
comment: A system of independent elements that are assembled together to perform a function.
EMMO 967080e5 2f42 4eb2 a3a9 c58143e835f9: A system of independent elements that are assembled together to perform a function.

CGSUnit
type: Class
comment: CGS is a variant of the metric system.
comment: The centimetre–gram–second (CGS) system of units.
EMMO 967080e5 2f42 4eb2 a3a9 c58143e835f9: The centimetre–gram–second (CGS) system of units.
wikipediaReference: https://en.wikipedia.org/wiki/Centimetre%E2%80%93gram%E2%80%93second_system_of_units

MeanDurationOfLife
type: Class
comment: Reciprocal of the decay constant λ.
alternative label: MeanLifeTime
qudtReference: https://qudt.org/vocab/quantitykind/MeanLifetime
qudtReference: https://www.wikidata.org/wiki/Q1758559
IEVReference: https://www.electropedia.org/iev/iev.nsf/display
ISO80000Reference: 10-25
EMMO 967080e5 2f42 4eb2 a3a9 c58143e835f9: Reciprocal of the decay constant λ.

PartialPressure
type: Class
comment: Hypothetical pressure of gas if it alone occupied the volume of the mixture at the same temperature.
qudtReference: https://qudt.org/vocab/quantitykind/PartialPressure
wikidataReference: https://www.wikidata.org/wiki/Q27165
ISO80000Reference: 9-19
EMMO 967080e5 2f42 4eb2 a3a9 c58143e835f9: Hypothetical pressure of gas if it alone occupied the volume of the mixture at the same temperature.
iupacReference: https://doi.org/10.1351/goldbook.P04420

Equals
type: Class
comment: The equals symbol.
subclass of: Restriction
  has value: =
EMMO 967080e5 2f42 4eb2 a3a9 c58143e835f9: The equals symbol.

hasCogniser
type: ObjectProperty
comment: A semiotic relation connecting an icon to a interpreter (cogniser) in a cognition process.
EMMO 967080e5 2f42 4eb2 a3a9 c58143e835f9: A semiotic relation connecting an icon to a interpreter (cogniser) in a cognition process.

Ruby
type: Class

RelativeLinearStrain
type: Class
comment: Relative change of length with respect the original length.
qudtReference: https://qudt.org/vocab/quantitykind/LinearStrain
wikidataReference: https://www.wikidata.org/wiki/Q1990546
IEVReference: https://www.electropedia.org/iev/iev.nsf/display
ISO80000Reference: 4-17.2
EMMO 967080e5 2f42 4eb2 a3a9 c58143e835f9: Relative change of length with respect the original length.
iupacReference: https://doi.org/10.1351/goldbook.L03560

SuperconductorEnergyGap
type: Class
comment: Width of the forbidden energy band in a superconductor.
qudtReference: https://qudt.org/vocab/quantitykind/SuperconductorEnergyGap
wikidataReference: https://www.wikidata.org/wiki/Q106127898
IEVReference: https://www.electropedia.org/iev/iev.nsf/display
ISO80000Reference: 12-37
EMMO 967080e5 2f42 4eb2 a3a9 c58143e835f9: Width of the forbidden energy band in a superconductor.

PoyntingVector
type: Class
comment: Electric field strength multiplied by magnetic field strength.
subclass of: Restriction
qudtReference: https://qudt.org/vocab/quantitykind/PoyntingVector
wikidataReference: https://www.wikidata.org/wiki/Q504186
IEVReference: https://www.electropedia.org/iev/iev.nsf/display
ISO80000Reference: 6-34
EMMO 967080e5 2f42 4eb2 a3a9 c58143e835f9: Electric field strength multiplied by magnetic field strength.

DiffusionCoefficientForParticleNumberDensity
type: Class
comment: Proportionality constant between the particle current density J and the gradient of the particle number density n.
wikidataReference: https://www.wikidata.org/wiki/Q98875545
ISO80000Reference: 10-64
EMMO 967080e5 2f42 4eb2 a3a9 c58143e835f9: Proportionality constant between the particle current density J and the gradient of the particle number density n.

Guess
type: Class
comment: A guess is a theory, estimated and subjective, since its premises are subjective.
EMMO 967080e5 2f42 4eb2 a3a9 c58143e835f9: A guess is a theory, estimated and subjective, since its premises are subjective.

ElectricFlux
type: Class
comment: Scalar quantity equal to the flux of the electric flux density D through a given directed surface S.
subclass of: Restriction
qudtReference: https://qudt.org/vocab/quantitykind/ElectricFlux
wikidataReference: https://www.wikidata.org/wiki/Q501267
IEVReference: https://www.electropedia.org/iev/iev.nsf/display
ISO80000Reference: 6-17
EMMO 967080e5 2f42 4eb2 a3a9 c58143e835f9: Scalar quantity equal to the flux of the electric flux density D through a given directed surface S.

ThalliumSymbol
type: Class
comment: The symbol that stands for the thallium atom.
subclass of: Restriction
  has value: Tl
EMMO 967080e5 2f42 4eb2 a3a9 c58143e835f9: The symbol that stands for the thallium atom.

ElementaryCharge
type: Class
comment: The DBpedia definition (http://dbpedia.org/page/Elementary_charge) is outdated as May 20, 2019. It is now an exact quantity.
comment: The magnitude of the electric charge carried by a single electron. It defines the base unit Ampere in the SI system.
qudtReference: http://qudt.org/vocab/quantitykind/ElementaryCharge
ISO80000Reference: 10-5.1
EMMO 967080e5 2f42 4eb2 a3a9 c58143e835f9: The magnitude of the electric charge carried by a single electron. It defines the base unit Ampere in the SI system.
iupacReference: https://doi.org/10.1351/goldbook.E02032

MomentOfIntertia
type: Class
comment: Scalar measure of the rotational inertia with respect to a fixed axis of rotation.
subclass of: Restriction
qudtReference: https://qudt.org/vocab/quantitykind/MomentOfInertia
wikidataReference: https://www.wikidata.org/wiki/Q165618
IEVReference: https://www.electropedia.org/iev/iev.nsf/display
ISO80000Reference: 4-7
EMMO 967080e5 2f42 4eb2 a3a9 c58143e835f9: Scalar measure of the rotational inertia with respect to a fixed axis of rotation.
iupacReference: https://doi.org/10.1351/goldbook.M04006

NuclidicMass
type: Class
comment: Rest mass of a nuclide X in the ground state.
wikidataReference: https://www.wikidata.org/wiki/Q97010809
ISO80000Reference: 10-4.2
EMMO 967080e5 2f42 4eb2 a3a9 c58143e835f9: Rest mass of a nuclide X in the ground state.
iupacReference: https://doi.org/10.1351/goldbook.N04258

RelativePermeability
type: Class
comment: Scalar quantity or tensor quantity equal to the absolute permeability divided by the magnetic constant.
qudtReference: https://qudt.org/vocab/quantitykind/ElectromagneticPermeabilityRatio
wikidataReference: https://www.wikidata.org/wiki/Q77785645
IEVReference: https://www.electropedia.org/iev/iev.nsf/display
ISO80000Reference: 6-27
EMMO 967080e5 2f42 4eb2 a3a9 c58143e835f9: Scalar quantity or tensor quantity equal to the absolute permeability divided by the magnetic constant.
iupacReference: https://doi.org/10.1351/goldbook.R05272

LogarithmicDecrement
type: Class
comment: Product of damping coefficient and period duration.
wikidataReference: https://www.wikidata.org/wiki/Q1399446
IEVReference: https://www.electropedia.org/iev/iev.nsf/display
ISO80000Reference: 3-25
EMMO 967080e5 2f42 4eb2 a3a9 c58143e835f9: Product of damping coefficient and period duration.

InfiniteMultiplicationFactor
type: Class
comment: In nuclear physics, the multiplication factor for an infinite medium.
qudtReference: https://qudt.org/vocab/quantitykind/InfiniteMultiplicationFactor
wikidataReference: https://www.wikidata.org/wiki/Q99440487
ISO80000Reference: 10-78.2
EMMO 967080e5 2f42 4eb2 a3a9 c58143e835f9: In nuclear physics, the multiplication factor for an infinite medium.

Smoke
type: Class
comment: Smoke is a solid aerosol made of particles emitted when a material undergoes combustion or pyrolysis.
EMMO 967080e5 2f42 4eb2 a3a9 c58143e835f9: Smoke is a solid aerosol made of particles emitted when a material undergoes combustion or pyrolysis.

ElectricCurrentAssistedSintering
type: Class

SpecificActivity
type: Class
comment: Quotient of the activity A of a sample and the mass m of that sample.
subclass of: Restriction
alternative label: MassicActivity
qudtReference: https://qudt.org/vocab/quantitykind/SpecificActivity
wikidataReference: https://www.wikidata.org/wiki/Q2823748
IEVReference: https://www.electropedia.org/iev/iev.nsf/display
ISO80000Reference: 10-28
EMMO 967080e5 2f42 4eb2 a3a9 c58143e835f9: Quotient of the activity A of a sample and the mass m of that sample.
iupacReference: https://doi.org/10.1351/goldbook.S05790

SolidSol
type: Class
comment: A type of sol in the form of one solid dispersed in another continuous solid.
EMMO 967080e5 2f42 4eb2 a3a9 c58143e835f9: A type of sol in the form of one solid dispersed in another continuous solid.

LinearDensityOfElectricCharge
type: Class
comment: The derivative of the electric charge of a system with respect to the length.
subclass of: Restriction
wikidataReference: https://www.wikidata.org/wiki/Q77267838
IEVReference: https://www.electropedia.org/iev/iev.nsf/display
ISO80000Reference: 6-5
EMMO 967080e5 2f42 4eb2 a3a9 c58143e835f9: The derivative of the electric charge of a system with respect to the length.

GasSolution
type: Class
comment: A gaseous solution made of more than one component type.
equivalent class: Class
alternative label: GasMixture
EMMO 967080e5 2f42 4eb2 a3a9 c58143e835f9: A gaseous solution made of more than one component type.

BerkeliumSymbol
type: Class
comment: The symbol that stands for the berkelium atom.
subclass of: Restriction
  has value: Bk
EMMO 967080e5 2f42 4eb2 a3a9 c58143e835f9: The symbol that stands for the berkelium atom.

SourceVoltage
type: Class
comment: Voltage between the two terminals of a voltage source when there is no electric current through the source.
alternative label: SourceTension
qudtReference: https://qudt.org/vocab/quantitykind/SourceVoltage
wikidataReference: https://www.wikidata.org/wiki/Q185329
ISO80000Reference: 6-36
EMMO 967080e5 2f42 4eb2 a3a9 c58143e835f9: Voltage between the two terminals of a voltage source when there is no electric current through the source.

AqueousSolution
type: Class
comment: A liquid solution in which the solvent is water.
EMMO 967080e5 2f42 4eb2 a3a9 c58143e835f9: A liquid solution in which the solvent is water.

ElectricChargeDensity
type: Class
comment: Electric charge per volume.
subclass of: Restriction
alternative label: VolumeElectricCharge
qudtReference: https://qudt.org/vocab/quantitykind/ElectricChargeDensity
wikidataReference: https://www.wikidata.org/wiki/Q69425629
IEVReference: https://www.electropedia.org/iev/iev.nsf/display
ISO80000Reference: 6-3
EMMO 967080e5 2f42 4eb2 a3a9 c58143e835f9: Electric charge per volume.
iupacReference: https://doi.org/10.1351/goldbook.C00988

isProcessInputOf
type: AsymmetricProperty
type: IrreflexiveProperty
type: ObjectProperty

NeutronYieldPerFission
type: Class
comment: Average number of fission neutrons, both prompt and delayed, emitted per fission event.
qudtReference: https://qudt.org/vocab/quantitykind/NeutronYieldPerFission
wikidataReference: https://www.wikidata.org/wiki/Q99157909
ISO80000Reference: 10-74.1
EMMO 967080e5 2f42 4eb2 a3a9 c58143e835f9: Average number of fission neutrons, both prompt and delayed, emitted per fission event.

EnergyDistributionOfCrossSection
type: Class
comment: Differential quotient of the cross section for a process and the energy of the scattered particle.
subclass of: Restriction
qudtReference: https://qudt.org/vocab/quantitykind/SpectralCrossSection
wikidataReference: https://www.wikidata.org/wiki/Q98267245
ISO80000Reference: 10-40
EMMO 967080e5 2f42 4eb2 a3a9 c58143e835f9: Differential quotient of the cross section for a process and the energy of the scattered particle.

NanoMaterial
type: Class
comment: Nanomaterials are Materials possessing, at minimum, one external dimension measuring 1-100nm
EMMO 967080e5 2f42 4eb2 a3a9 c58143e835f9: Nanomaterials are Materials possessing, at minimum, one external dimension measuring 1-100nm

EnergyImparted
type: Class
comment: Sum of energies deposited by ionizing radiation in a given volume.
qudtReference: https://qudt.org/vocab/quantitykind/EnergyImparted
wikidataReference: https://www.wikidata.org/wiki/Q99526944
IEVReference: https://www.electropedia.org/iev/iev.nsf/display
ISO80000Reference: 10-80.1
EMMO 967080e5 2f42 4eb2 a3a9 c58143e835f9: Sum of energies deposited by ionizing radiation in a given volume.

MultiParticlePath
type: Class
comment: A chausal path whose quantum parts belongs to at least two different standard model fundamental types.
comment: An multi-particle path is a causal path of quantum entities of different type, following the causal connection between an initial quantum up to the final one, regardless on the fact that causality is passing through elementary particles of different types. For example, a path starting from an elementary photon, then through the electron with which it scatter, and then trough a positron with which the electron collides.
EMMO 31252f35 c767 4b97 a877 1235076c3e13: An multi-particle path is a causal path of quantum entities of different type, following the causal connection between an initial quantum up to the final one, regardless on the fact that causality is passing through elementary particles of different types. For example, a path starting from an elementary photon, then through the electron with which it scatter, and then trough a positron with which the electron collides.
EMMO 967080e5 2f42 4eb2 a3a9 c58143e835f9: A chausal path whose quantum parts belongs to at least two different standard model fundamental types.

ModulusOfAdmittance
type: Class
comment: quotient of the rms value of the electric current in a two-terminal element or a two-terminal circuit by the rms value of the voltage between its terminals.
qudtReference: https://qudt.org/vocab/quantitykind/ModulusOfAdmittance
wikidataReference: https://www.wikidata.org/wiki/Q79466359
IEVReference: https://www.electropedia.org/iev/iev.nsf/display
ISO80000Reference: 6-52.4
EMMO 967080e5 2f42 4eb2 a3a9 c58143e835f9: quotient of the rms value of the electric current in a two-terminal element or a two-terminal circuit by the rms value of the voltage between its terminals.
EMMO c7b62dd7 063a 4c2a 8504 42f7264ba83f: Apparent admittance is often denoted by Y .

SolidSolution
type: Class
comment: A solid solution made of two or more component substances.
EMMO 967080e5 2f42 4eb2 a3a9 c58143e835f9: A solid solution made of two or more component substances.

UnitOne
type: Class
comment: "The unit one is the neutral element of any system of units – necessary and present automatically." -- SI Brochure
comment: Represents the number 1, used as an explicit unit to say something has no units.
alternative label: Unitless
example: Refractive index or volume fraction.
example: Typically used for ratios of two units whos dimensions cancels out.
qudtReference: http://qudt.org/vocab/unit/UNITLESS
EMMO 70fe84ff 99b6 4206 a9fc 9a8931836d84: Represents the number 1, used as an explicit unit to say something has no units.
EMMO 967080e5 2f42 4eb2 a3a9 c58143e835f9: "The unit one is the neutral element of any system of units – necessary and present automatically." -- SI Brochure

RefractiveIndex
type: Class
comment: Factor by which the phase velocity of light is reduced in a medium.
qudtReference: http://qudt.org/vocab/quantitykind/RefractiveIndex
EMMO 967080e5 2f42 4eb2 a3a9 c58143e835f9: Factor by which the phase velocity of light is reduced in a medium.
iupacReference: https://doi.org/10.1351/goldbook.R05240

EuclideanSpace
type: Class
comment: A three-manifold with Euclidean metric.
EMMO 967080e5 2f42 4eb2 a3a9 c58143e835f9: A three-manifold with Euclidean metric.

NucleonNumber
type: Class
comment: number of nucleons in an atomic nucleus
alternative label: MassNumber
qudtReference: https://qudt.org/vocab/quantitykind/NucleonNumber
wikidataReference: https://www.wikidata.org/wiki/Q101395
IEVReference: https://www.electropedia.org/iev/iev.nsf/display
dbpediaReference: https://dbpedia.org/page/Mass_number
ISO80000Reference: 10-1.3
EMMO 967080e5 2f42 4eb2 a3a9 c58143e835f9: number of nucleons in an atomic nucleus
wikipediaReference: https://en.wikipedia.org/wiki/Mass_number
iupacReference: https://doi.org/10.1351/goldbook.M03726

RatioOfSpecificHeatCapacities
type: Class
comment: Ratio of specific heat capacity at constant pressure cp to specific heat capacity at constant volume cV, thus γ = cp/cV.
qudtReference: https://qudt.org/vocab/quantitykind/HeatCapacityRatio
wikidataReference: https://www.wikidata.org/wiki/Q503869
IEVReference: https://www.electropedia.org/iev/iev.nsf/display
ISO80000Reference: 5-17.1
EMMO 967080e5 2f42 4eb2 a3a9 c58143e835f9: Ratio of specific heat capacity at constant pressure cp to specific heat capacity at constant volume cV, thus γ = cp/cV.

WaveVector
type: Class
comment: Vector k in the expression ω t−k⋅r+ϑ0 of the phase of a sinusoidal wave.
wikidataReference: https://www.wikidata.org/wiki/Q657009
IEVReference: https://www.electropedia.org/iev/iev.nsf/display
ISO80000Reference: 3-21
EMMO 967080e5 2f42 4eb2 a3a9 c58143e835f9: Vector k in the expression ω t−k⋅r+ϑ0 of the phase of a sinusoidal wave.
wikipediaReference: https://en.wikipedia.org/wiki/Wave_vector

EquilibriumPositionVector
type: Class
comment: In condensed matter physics, position vector of an atom or ion in equilibrium.
subclass of: Restriction
qudtReference: https://qudt.org/vocab/quantitykind/EquilibriumPositionVectorOfIon
wikidataReference: https://www.wikidata.org/wiki/Q105533477
ISO80000Reference: 12-7.2
EMMO 967080e5 2f42 4eb2 a3a9 c58143e835f9: In condensed matter physics, position vector of an atom or ion in equilibrium.

TotalCurrent
type: Class
comment: Sum of electric current and displacement current
qudtReference: https://qudt.org/vocab/quantitykind/TotalCurrent
wikidataReference: https://www.wikidata.org/wiki/Q77679732
IEVReference: https://www.electropedia.org/iev/iev.nsf/display
ISO80000Reference: 6-19.2
EMMO 967080e5 2f42 4eb2 a3a9 c58143e835f9: Sum of electric current and displacement current

VacuumElectricPermittivity
type: Class
comment: The DBpedia definition (http://dbpedia.org/page/Vacuum_permittivity) is outdated since May 20, 2019. It is now a measured constant.
comment: The value of the absolute dielectric permittivity of classical vacuum.
alternative label: PermittivityOfVacuum
qudtReference: http://qudt.org/vocab/constant/PermittivityOfVacuum
ISO80000Reference: 6-14.1
EMMO 967080e5 2f42 4eb2 a3a9 c58143e835f9: The value of the absolute dielectric permittivity of classical vacuum.
iupacReference: https://doi.org/10.1351/goldbook.P04508

ActiveEnergy
type: Class
comment: The integral over a time interval of the instantaneous power.
qudtReference: https://qudt.org/vocab/quantitykind/ActiveEnergy
wikidataReference: https://www.wikidata.org/wiki/Q79813678
IEVReference: https://www.electropedia.org/iev/iev.nsf/display
ISO80000Reference: 6-62
EMMO 967080e5 2f42 4eb2 a3a9 c58143e835f9: The integral over a time interval of the instantaneous power.

RelativeHumidity
type: Class
comment: Ratio of the partial pressure p of water vapour in moist air to its partial pressure psat at saturation, at the same temperature φ = p/psat.
comment: The relative humidity is often expressed in per cent.
qudtReference: https://qudt.org/vocab/quantitykind/RelativeHumidity
wikidataReference: https://www.wikidata.org/wiki/Q2499617
IEVReference: https://www.electropedia.org/iev/iev.nsf/display
ISO80000Reference: 5-33
EMMO 967080e5 2f42 4eb2 a3a9 c58143e835f9: Ratio of the partial pressure p of water vapour in moist air to its partial pressure psat at saturation, at the same temperature φ = p/psat.
wikipediaReference: https://en.wikipedia.org/wiki/Humidity#Relative_humidity

Work
type: Class
comment: Product of force and displacement.
qudtReference: http://qudt.org/vocab/quantitykind/Work
ISO80000Reference: 4-28.4
EMMO 967080e5 2f42 4eb2 a3a9 c58143e835f9: Product of force and displacement.
iupacReference: https://doi.org/10.1351/goldbook.W06684

ModulusOfElasticity
type: Class
comment: Mechanical property of linear elastic solid materials.
subclass of: Restriction
alternative label: YoungsModulus
wikidataReference: https://www.wikidata.org/wiki/Q2091584
IEVReference: https://www.electropedia.org/iev/iev.nsf/display
ISO80000Reference: 4-19.1
EMMO 967080e5 2f42 4eb2 a3a9 c58143e835f9: Mechanical property of linear elastic solid materials.
iupacReference: https://doi.org/10.1351/goldbook.M03966

hasIterativeTask
type: ObjectProperty

hasSerialTask
type: ObjectProperty

TantalumSymbol
type: Class
comment: The symbol that stands for the tantalum atom.
subclass of: Restriction
  has value: Ta
EMMO 967080e5 2f42 4eb2 a3a9 c58143e835f9: The symbol that stands for the tantalum atom.

ElectricPolarization
type: Class
comment: At a given point within a domain of quasi-infinitesimal volume V, vector quantity equal to the electric dipole moment p of the substance contained within the domain divided by the volume V.
qudtReference: https://qudt.org/vocab/quantitykind/ElectricPolarization
wikidataReference: https://www.wikidata.org/wiki/Q1050425
IEVReference: https://www.electropedia.org/iev/iev.nsf/display
ISO80000Reference: 6-7
EMMO 967080e5 2f42 4eb2 a3a9 c58143e835f9: At a given point within a domain of quasi-infinitesimal volume V, vector quantity equal to the electric dipole moment p of the substance contained within the domain divided by the volume V.

StrontiumSymbol
type: Class
comment: The symbol that stands for the strontium atom.
subclass of: Restriction
subclass of: Restriction
  has value: Sr
EMMO 967080e5 2f42 4eb2 a3a9 c58143e835f9: The symbol that stands for the strontium atom.

CPlusPlus
type: Class
comment: A language object respecting the syntactic rules of C++.
alternative label: C++
EMMO 967080e5 2f42 4eb2 a3a9 c58143e835f9: A language object respecting the syntactic rules of C++.

PowderCoating
type: Class

TerbiumSymbol
type: Class
comment: The symbol that stands for the terbium atom.
subclass of: Restriction
  has value: Tb
EMMO 967080e5 2f42 4eb2 a3a9 c58143e835f9: The symbol that stands for the terbium atom.

RecombinationCoefficient
type: Class
comment: Coefficient in the law of recombination,
subclass of: Restriction
qudtReference: https://qudt.org/vocab/quantitykind/RecombinationCoefficient
wikidataReference: https://www.wikidata.org/wiki/Q98842099
IEVReference: https://www.electropedia.org/iev/iev.nsf/display
ISO80000Reference: 10-63
EMMO 967080e5 2f42 4eb2 a3a9 c58143e835f9: Coefficient in the law of recombination,

DebyeAngularFrequency
type: Class
comment: Cut-off angular frequency in the Debye model of the vibrational spectrum of a solid.
qudtReference: https://qudt.org/vocab/quantitykind/DebyeAngularFrequency
wikidataReference: https://www.wikidata.org/wiki/Q105580986
ISO80000Reference: 12-10
EMMO 967080e5 2f42 4eb2 a3a9 c58143e835f9: Cut-off angular frequency in the Debye model of the vibrational spectrum of a solid.

MassChangeRate
type: Class
comment: Mass increment per time.
subclass of: Restriction
wikidataReference: https://www.wikidata.org/wiki/Q92020547
ISO80000Reference: 4-30.3
EMMO 967080e5 2f42 4eb2 a3a9 c58143e835f9: Mass increment per time.

MesoscopicSubstance
type: Class
comment: A matter that is not a particulate matter and that does not fullfill the criteria of being a continuum substance.
example: nanoparticle, quantum dot, carbon nanotupe
EMMO 967080e5 2f42 4eb2 a3a9 c58143e835f9: A matter that is not a particulate matter and that does not fullfill the criteria of being a continuum substance.
EMMO c7b62dd7 063a 4c2a 8504 42f7264ba83f: Mesoscopic substances typically exist on a length scale between atoms and molecules and macroscopic (bulk) substances. They are typically in the range of some nanometers to about a micrometer and often exhibit unique physical properties due to their size and shape.

GrowingCrystal
type: Class

CelsiusTemperature
type: Class
comment: An objective comparative measure of hot or cold. Temperature is a relative quantity that can be used to express temperature differences. Unlike ThermodynamicTemperature, it cannot express absolute temperatures.
subclass of: Restriction
qudtReference: http://qudt.org/vocab/quantitykind/CelciusTemperature
ISO80000Reference: 5-2
EMMO 967080e5 2f42 4eb2 a3a9 c58143e835f9: An objective comparative measure of hot or cold. Temperature is a relative quantity that can be used to express temperature differences. Unlike ThermodynamicTemperature, it cannot express absolute temperatures.
iupacReference: https://doi.org/10.1351/goldbook.T06261

LutetiumSymbol
type: Class
comment: The symbol that stands for the lutetium atom.
subclass of: Restriction
subclass of: Restriction
  has value: Lu
EMMO 967080e5 2f42 4eb2 a3a9 c58143e835f9: The symbol that stands for the lutetium atom.

SulfurSymbol
type: Class
comment: The symbol that stands for the sulfur atom.
subclass of: Restriction
subclass of: Restriction
  has value: S
EMMO 967080e5 2f42 4eb2 a3a9 c58143e835f9: The symbol that stands for the sulfur atom.

StandardEquilibriumConstant
type: Class
comment: Constant of a chemical reaction. It is the value of its reaction quotient at chemical equilibrium, a state approached by a dynamic chemical system after sufficient time has elapsed at which its composition has no measurable tendency towards further change.
alternative label: ThermodynamicEquilibriumConstant
wikidataReference: https://www.wikidata.org/wiki/Q95993378
ISO80000Reference: 9-32
EMMO 967080e5 2f42 4eb2 a3a9 c58143e835f9: Constant of a chemical reaction. It is the value of its reaction quotient at chemical equilibrium, a state approached by a dynamic chemical system after sufficient time has elapsed at which its composition has no measurable tendency towards further change.
iupacReference: https://doi.org/10.1351/goldbook.S05915

MagneticReluctance
type: Class
comment: Magnetic tension divided by magnetic flux.
subclass of: Restriction
alternative label: Reluctance
qudtReference: https://qudt.org/vocab/quantitykind/Reluctance
wikidataReference: https://www.wikidata.org/wiki/Q863390
IEVReference: https://www.electropedia.org/iev/iev.nsf/display
ISO80000Reference: 6-39
EMMO 967080e5 2f42 4eb2 a3a9 c58143e835f9: Magnetic tension divided by magnetic flux.

IndiumSymbol
type: Class
comment: The symbol that stands for the indium atom.
subclass of: Restriction
subclass of: Restriction
  has value: In
EMMO 967080e5 2f42 4eb2 a3a9 c58143e835f9: The symbol that stands for the indium atom.

EmpiricalSimulationSoftware
type: Class
comment: A computational application that uses an empiric equation to predict the behaviour of a system without relying on the knowledge of the actual physical phenomena occurring in the object.
EMMO 967080e5 2f42 4eb2 a3a9 c58143e835f9: A computational application that uses an empiric equation to predict the behaviour of a system without relying on the knowledge of the actual physical phenomena occurring in the object.

BohrMagneton
type: Class
comment: Magnitude of the magnetic moment of an electron in a state with orbital angular momentum quantum number l=1 due to its orbital motion.
subclass of: Restriction
wikidataReference: https://www.wikidata.org/wiki/Q737120
ISO80000Reference: 10-9.2
EMMO 967080e5 2f42 4eb2 a3a9 c58143e835f9: Magnitude of the magnetic moment of an electron in a state with orbital angular momentum quantum number l=1 due to its orbital motion.

TungstenSymbol
type: Class
comment: The symbol that stands for the tungsten atom.
subclass of: Restriction
  has value: W
EMMO 967080e5 2f42 4eb2 a3a9 c58143e835f9: The symbol that stands for the tungsten atom.

VaporDeposition
type: Class

ArgonSymbol
type: Class
comment: The symbol that stands for the argon atom.
subclass of: Restriction
  has value: Ar
EMMO 967080e5 2f42 4eb2 a3a9 c58143e835f9: The symbol that stands for the argon atom.

FermiAnglularWavenumber
type: Class
comment: Angular wavenumber of electrons in states on the Fermi sphere.
alternative label: FermiAnglularRepetency
hidden label: FermiAnglularWaveNumber
qudtReference: https://qudt.org/vocab/quantitykind/FermiAngularWavenumber
wikidataReference: https://www.wikidata.org/wiki/Q105554303
ISO80000Reference: 12-9.2
EMMO 967080e5 2f42 4eb2 a3a9 c58143e835f9: Angular wavenumber of electrons in states on the Fermi sphere.

EmpiricalFormula
type: Class
comment: An expression that provide information about the element type of a compound and their relative ratio.
example: Hydrogen peroxide is HO
EMMO 967080e5 2f42 4eb2 a3a9 c58143e835f9: An expression that provide information about the element type of a compound and their relative ratio.

EinsteiniumSymbol
type: Class
comment: The symbol that stands for the einsteinium atom.
subclass of: Restriction
subclass of: Restriction
  has value: Es
EMMO 967080e5 2f42 4eb2 a3a9 c58143e835f9: The symbol that stands for the einsteinium atom.

CurieTemperature
type: Class
comment: Critical thermodynamic temperature of a ferromagnet.
qudtReference: https://qudt.org/vocab/quantitykind/CurieTemperature
wikidataReference: https://www.wikidata.org/wiki/Q191073
IEVReference: https://www.electropedia.org/iev/iev.nsf/display
ISO80000Reference: 12-35.1
EMMO 967080e5 2f42 4eb2 a3a9 c58143e835f9: Critical thermodynamic temperature of a ferromagnet.

GermaniumSymbol
type: Class
comment: The symbol that stands for the germanium atom.
subclass of: Restriction
  has value: Ge
EMMO 967080e5 2f42 4eb2 a3a9 c58143e835f9: The symbol that stands for the germanium atom.

JosephsonConstantUnit
type: Class
comment: The class of units with dimensionality 'JosephsonConstant'.
subclass of: Restriction
  has value: T+4 L-2 M-1 I+1 Θ0 N0 J0
EMMO 967080e5 2f42 4eb2 a3a9 c58143e835f9: The class of units with dimensionality 'JosephsonConstant'.

LatentHeatOfPhaseTransition
type: Class
comment: Energy to be added to or removed from a system under constant temperature and pressure to undergo a complete phase transition.
wikidataReference: https://www.wikidata.org/wiki/Q106553458
ISO80000Reference: 9-16
EMMO 967080e5 2f42 4eb2 a3a9 c58143e835f9: Energy to be added to or removed from a system under constant temperature and pressure to undergo a complete phase transition.

PhosphorusSymbol
type: Class
comment: The symbol that stands for the phosphorus atom.
subclass of: Restriction
subclass of: Restriction
  has value: P
EMMO 967080e5 2f42 4eb2 a3a9 c58143e835f9: The symbol that stands for the phosphorus atom.

IsothermalConversion
type: Class

Theorisation
type: Class
comment: The 'semiosis' process of interpreting a 'physical' and provide a complec sign, 'theory' that stands for it and explain it to another interpreter.
subclass of: Restriction
alternative label: Theorization
EMMO 967080e5 2f42 4eb2 a3a9 c58143e835f9: The 'semiosis' process of interpreting a 'physical' and provide a complec sign, 'theory' that stands for it and explain it to another interpreter.

DonorDensity
type: Class
comment: Number of donor levels per volume.
qudtReference: https://qudt.org/vocab/quantitykind/DonorDensity
wikidataReference: https://www.wikidata.org/wiki/Q105979886
ISO80000Reference: 12-29.4
EMMO 967080e5 2f42 4eb2 a3a9 c58143e835f9: Number of donor levels per volume.

MassFlow
type: Class
comment: At a point in a fluid, the product of mass density and velocity.
subclass of: Restriction
wikidataReference: https://www.wikidata.org/wiki/Q3265048
ISO80000Reference: 4-30.1
EMMO 967080e5 2f42 4eb2 a3a9 c58143e835f9: At a point in a fluid, the product of mass density and velocity.

SlowingDownArea
type: Class
comment: In an infinite homogenous medium, one-sixth of the mean square of the distance between the neutron source and the point where a neutron reaches a given energy.
qudtReference: https://qudt.org/vocab/quantitykind/Slowing-DownArea
wikidataReference: https://www.wikidata.org/wiki/Q98950918
ISO80000Reference: 10-72.1
EMMO 967080e5 2f42 4eb2 a3a9 c58143e835f9: In an infinite homogenous medium, one-sixth of the mean square of the distance between the neutron source and the point where a neutron reaches a given energy.

dbpediaReference
type: AnnotationProperty
comment: URL to corresponding dpbedia entry.
range: anyURI
sub property of: seeAlso
EMMO 967080e5 2f42 4eb2 a3a9 c58143e835f9: URL to corresponding dpbedia entry.

ParticleFluenceRate
type: Class
comment: Differential quotient of fluence Φ with respect to time.
subclass of: Restriction
qudtReference: https://qudt.org/vocab/quantitykind/ParticleFluenceRate
wikidataReference: https://www.wikidata.org/wiki/Q98497410
IEVReference: https://www.electropedia.org/iev/iev.nsf/display
ISO80000Reference: 10-44
EMMO 967080e5 2f42 4eb2 a3a9 c58143e835f9: Differential quotient of fluence Φ with respect to time.

hasSpatialSection
type: ObjectProperty
comment: A proper part of the whole that is not Spatial or Temporal.
alternative label: hasSpatialPartialPart
EMMO 967080e5 2f42 4eb2 a3a9 c58143e835f9: A proper part of the whole that is not Spatial or Temporal.
EMMO c7b62dd7 063a 4c2a 8504 42f7264ba83f: This relation identifies parts of a 4D object that do not fully cover the lifetime extent of the whole (spatial) nor the full spatial extent (temporal).
EMMO c7b62dd7 063a 4c2a 8504 42f7264ba83f: This relation is a filler, to categorise the parts of an entity that are not covered by the other parthood relations. A proper part is then the disjoint union of: spatial part, temporal part and spatio temporal part relations.

PhysicsEquationSolution
type: Class
comment: A function solution of a physics equation that provides a methods for the prediction of some quantitiative properties of an object.
comment: This must be a mathematical function v(t), x(t). A dataset as solution is a conventional sign.
example: A parabolic function is a prediction of the trajectory of a falling object in a gravitational field. While it has predictive capabilities it lacks of an analogical character, since it does not show the law behind that trajectory.
EMMO 967080e5 2f42 4eb2 a3a9 c58143e835f9: A function solution of a physics equation that provides a methods for the prediction of some quantitiative properties of an object.

MagneticQuantumNumber
type: Class
comment: Atomic quantum number related to the z component lz, jz or sz, of the orbital, total, or spin angular momentum.
qudtReference: https://qudt.org/vocab/quantitykind/MagneticQuantumNumber
wikidataReference: https://www.wikidata.org/wiki/Q2009727
ISO80000Reference: 10-13.4
EMMO 967080e5 2f42 4eb2 a3a9 c58143e835f9: Atomic quantum number related to the z component lz, jz or sz, of the orbital, total, or spin angular momentum.

Uncoded
type: Class
comment: A conventional that provides no possibility to infer the characteristics of the object to which it refers.
subclass of: Restriction
example: A random generated id for a product.
EMMO 967080e5 2f42 4eb2 a3a9 c58143e835f9: A conventional that provides no possibility to infer the characteristics of the object to which it refers.

RichardsonConstant
type: Class
comment: Parameter in the expression for the thermionic emission current density J for a metal in terms of the thermodynamic temperature T and work function.
subclass of: Restriction
qudtReference: https://qudt.org/vocab/quantitykind/RichardsonConstant
wikidataReference: https://www.wikidata.org/wiki/Q105883079
IEVReference: https://www.electropedia.org/iev/iev.nsf/display
ISO80000Reference: 12-26
EMMO 967080e5 2f42 4eb2 a3a9 c58143e835f9: Parameter in the expression for the thermionic emission current density J for a metal in terms of the thermodynamic temperature T and work function.

QuantumData
type: Class
comment: Data that are expressed through quantum mechanical principles, and that can have several values ​​/ be in several states in the same place at the same time (quantum superposition), each of them with a certain probability.
EMMO 967080e5 2f42 4eb2 a3a9 c58143e835f9: Data that are expressed through quantum mechanical principles, and that can have several values ​​/ be in several states in the same place at the same time (quantum superposition), each of them with a certain probability.

hasJSONValue
type: DatatypeProperty
comment: The owl:dataProperty that provides a serialisation of an EMMO JSON data entity.
range: JSON
EMMO 967080e5 2f42 4eb2 a3a9 c58143e835f9: The owl:dataProperty that provides a serialisation of an EMMO JSON data entity.

LeadSymbol
type: Class
comment: The symbol that stands for the lead atom.
subclass of: Restriction
  has value: Pb
EMMO 967080e5 2f42 4eb2 a3a9 c58143e835f9: The symbol that stands for the lead atom.

EnergyDensityOfStates
type: Class
comment: Quantity in condensed matter physics.
subclass of: Restriction
qudtReference: https://qudt.org/vocab/quantitykind/EnergyDensityOfStates
wikidataReference: https://www.wikidata.org/wiki/Q105687031
ISO80000Reference: 12-16
EMMO 967080e5 2f42 4eb2 a3a9 c58143e835f9: Quantity in condensed matter physics.

IronSymbol
type: Class
comment: The symbol that stands for the iron atom.
subclass of: Restriction
  has value: Fe
EMMO 967080e5 2f42 4eb2 a3a9 c58143e835f9: The symbol that stands for the iron atom.

DarmastadtiumSymbol
type: Class
comment: The symbol that stands for the darmastadtium atom.
subclass of: Restriction
  has value: Ds
EMMO 967080e5 2f42 4eb2 a3a9 c58143e835f9: The symbol that stands for the darmastadtium atom.

SurfaceActivityDensity
type: Class
comment: Quotient of the activity A of a sample and the total area S of the surface of that sample.
subclass of: Restriction
qudtReference: https://qudt.org/vocab/quantitykind/SurfaceActivityDensity
wikidataReference: https://www.wikidata.org/wiki/Q98103005
IEVReference: https://www.electropedia.org/iev/iev.nsf/display
ISO80000Reference: 10-30
EMMO 967080e5 2f42 4eb2 a3a9 c58143e835f9: Quotient of the activity A of a sample and the total area S of the surface of that sample.

DiffusivityUnit
type: Class
comment: The class of units with dimensionality 'Diffusivity'.
subclass of: Restriction
  has value: T-1 L+2 M0 I0 Θ0 N-1 J0
EMMO 967080e5 2f42 4eb2 a3a9 c58143e835f9: The class of units with dimensionality 'Diffusivity'.

LinkedFlux
type: Class
comment: Magnetic flux the integration area of which is such that magnetic field lines cross it in the same orientation more than once.
qudtReference: https://qudt.org/vocab/quantitykind/MagneticFlux
wikidataReference: https://www.wikidata.org/wiki/Q4374882
IEVReference: https://www.electropedia.org/iev/iev.nsf/display
ISO80000Reference: 6-22.2
EMMO 967080e5 2f42 4eb2 a3a9 c58143e835f9: Magnetic flux the integration area of which is such that magnetic field lines cross it in the same orientation more than once.

IonicStrength
type: Class
comment: Charge number is a quantity of dimension one defined in ChargeNumber.
comment: For all types of ions in a solution, half the sum of the products of their molality b_i and the square of their charge number z_i.
subclass of: Restriction
qudtReference: https://qudt.org/vocab/quantitykind/IonicStrength
wikidataReference: https://www.wikidata.org/wiki/Q898396
IEVReference: https://www.electropedia.org/iev/iev.nsf/display
ISO80000Reference: 9-42
EMMO 967080e5 2f42 4eb2 a3a9 c58143e835f9: For all types of ions in a solution, half the sum of the products of their molality b_i and the square of their charge number z_i.
iupacReference: https://doi.org/10.1351/goldbook.I03180

AngularReciprocalLatticeVector
type: Class
comment: Vector whose scalar products with all fundamental lattice vectors are integral multiples of 2pi.
qudtReference: https://qudt.org/vocab/quantitykind/AngularReciprocalLatticeVector
wikidataReference: https://www.wikidata.org/wiki/Q105475278
ISO80000Reference: 12-2.1
EMMO 967080e5 2f42 4eb2 a3a9 c58143e835f9: Vector whose scalar products with all fundamental lattice vectors are integral multiples of 2pi.

DirectionDistributionOfCrossSection
type: Class
comment: Differential quotient of the cross section for scattering a particle in a given direction and the solid angle around that direction.
subclass of: Restriction
qudtReference: https://qudt.org/vocab/quantitykind/AngularCrossSection
wikidataReference: https://www.wikidata.org/wiki/Q98266630
ISO80000Reference: 10-39
EMMO 967080e5 2f42 4eb2 a3a9 c58143e835f9: Differential quotient of the cross section for scattering a particle in a given direction and the solid angle around that direction.

MagneticPolarisation
type: Class
comment: Vector quantity equal to the product of the magnetization M and the magnetic constant μ0.
qudtReference: https://qudt.org/vocab/quantitykind/MagneticPolarization
wikidataReference: https://www.wikidata.org/wiki/Q856711
IEVReference: https://www.electropedia.org/iev/iev.nsf/display
ISO80000Reference: 6-29
EMMO 967080e5 2f42 4eb2 a3a9 c58143e835f9: Vector quantity equal to the product of the magnetization M and the magnetic constant μ0.

DebyeTemperature
type: Class
comment: The temperature at which the highest-frequency mode (and hence all modes) are excited.
qudtReference: https://qudt.org/vocab/quantitykind/DebyeTemperature
wikidataReference: https://www.wikidata.org/wiki/Q3517821
ISO80000Reference: 12-11
EMMO 967080e5 2f42 4eb2 a3a9 c58143e835f9: The temperature at which the highest-frequency mode (and hence all modes) are excited.

YttriumSymbol
type: Class
comment: The symbol that stands for the yttrium atom.
subclass of: Restriction
subclass of: Restriction
  has value: Y
EMMO 967080e5 2f42 4eb2 a3a9 c58143e835f9: The symbol that stands for the yttrium atom.

Cylinder
type: Class
comment: A 2-manifold with one unconnected boundary and two "faces".
EMMO 967080e5 2f42 4eb2 a3a9 c58143e835f9: A 2-manifold with one unconnected boundary and two "faces".

MetrologicalConstruct
type: Class
comment: A symbolic construct used within the discipline of metrology.
equivalent class: Class
EMMO 967080e5 2f42 4eb2 a3a9 c58143e835f9: A symbolic construct used within the discipline of metrology.

RapidPrototyping
type: Class
comment: Application of additive manufacturing intended for reducing the time needed for producing prototypes.
EMMO 967080e5 2f42 4eb2 a3a9 c58143e835f9: Application of additive manufacturing intended for reducing the time needed for producing prototypes.

NaturalMaterial
type: Class
comment: A Material occurring in nature, without the need of human intervention.
EMMO 967080e5 2f42 4eb2 a3a9 c58143e835f9: A Material occurring in nature, without the need of human intervention.

DebyeAngularWavenumber
type: Class
comment: Cut-off angular wavenumber in the Debye model of the vibrational spectrum of a solid.
alternative label: DebyeAngluarRepetency
hidden label: DebyeAngularWaveNumber
qudtReference: https://qudt.org/vocab/quantitykind/DebyeAngularWavenumber
wikidataReference: https://www.wikidata.org/wiki/Q105554370
ISO80000Reference: 12-9.3
EMMO 967080e5 2f42 4eb2 a3a9 c58143e835f9: Cut-off angular wavenumber in the Debye model of the vibrational spectrum of a solid.

PlanckConstant
type: Class
comment: The quantum of action. It defines the kg base unit in the SI system.
qudtReference: http://qudt.org/vocab/constant/PlanckConstant
EMMO 967080e5 2f42 4eb2 a3a9 c58143e835f9: The quantum of action. It defines the kg base unit in the SI system.
iupacReference: https://doi.org/10.1351/goldbook.P04685

AngularAcceleration
type: Class
comment: Vector quantity giving the rate of change of angular velocity.
subclass of: Restriction
qudtReference: https://qudt.org/vocab/quantitykind/AngularAcceleration
IEVReference: https://www.electropedia.org/iev/iev.nsf/display
dbpediaReference: https://dbpedia.org/page/Angular_acceleration
ISO80000Reference: 3-13
EMMO 967080e5 2f42 4eb2 a3a9 c58143e835f9: Vector quantity giving the rate of change of angular velocity.
wikipediaReference: https://en.wikipedia.org/wiki/Angular_acceleration

SolidMixture
type: Class
equivalent class: Class

TransferMolding
type: Class

ElectricImpedance
type: Class
comment: Measure of the opposition that a circuit presents to a current when a voltage is applied.
alternative label: Impedance
qudtReference: http://qudt.org/vocab/quantitykind/Impedance
wikidataReference: https://www.wikidata.org/wiki/Q179043
IEVReference: https://www.electropedia.org/iev/iev.nsf/display
ISO80000Reference: 6-51.1
EMMO 967080e5 2f42 4eb2 a3a9 c58143e835f9: Measure of the opposition that a circuit presents to a current when a voltage is applied.
wikipediaReference: https://en.wikipedia.org/wiki/Electrical_impedance

Broadcast
type: Class
comment: A mixed tiling in which a tile has next spatially connected tiles.
EMMO 967080e5 2f42 4eb2 a3a9 c58143e835f9: A mixed tiling in which a tile has next spatially connected tiles.

isInterpreterFor
type: ObjectProperty

ZirconiumSymbol
type: Class
comment: The symbol that stands for the zirconium atom.
subclass of: Restriction
  has value: Zr
EMMO 967080e5 2f42 4eb2 a3a9 c58143e835f9: The symbol that stands for the zirconium atom.

hasChemicalSpecies
type: ObjectProperty
comment: Relates a substance to one of its chemical species.
EMMO 967080e5 2f42 4eb2 a3a9 c58143e835f9: Relates a substance to one of its chemical species.

ApparentPower
type: Class
comment: RMS value voltage multiplied by rms value of electric current.
qudtReference: https://qudt.org/vocab/quantitykind/ApparentPower
wikidataReference: https://www.wikidata.org/wiki/Q1930258
IEVReference: https://www.electropedia.org/iev/iev.nsf/display
ISO80000Reference: 6-57
EMMO 967080e5 2f42 4eb2 a3a9 c58143e835f9: RMS value voltage multiplied by rms value of electric current.

SpontaneousProcess
type: Class
comment: A process that has no identifiable agent driving its occurence.
alternative label: NaturalProcess
EMMO 967080e5 2f42 4eb2 a3a9 c58143e835f9: A process that has no identifiable agent driving its occurence.

KryptonSymbol
type: Class
comment: The symbol that stands for the krypton atom.
subclass of: Restriction
subclass of: Restriction
  has value: Kr
EMMO 967080e5 2f42 4eb2 a3a9 c58143e835f9: The symbol that stands for the krypton atom.

MassExcess
type: Class
comment: Difference between the mass of an atom, and the product of its mass number and the unified mass constant.
subclass of: Restriction
qudtReference: https://qudt.org/vocab/quantitykind/MassExcess
wikidataReference: https://www.wikidata.org/wiki/Q1571163
ISO80000Reference: 10-21.1
EMMO 967080e5 2f42 4eb2 a3a9 c58143e835f9: Difference between the mass of an atom, and the product of its mass number and the unified mass constant.
iupacReference: https://doi.org/10.1351/goldbook.M03719

LinearElectricCurrentDensity
type: Class
comment: Surface density of electric charge multiplied by velocity
subclass of: Restriction
qudtReference: https://qudt.org/vocab/quantitykind/LinearElectricCurrentDensity
wikidataReference: https://www.wikidata.org/wiki/Q2356741
IEVReference: https://www.electropedia.org/iev/iev.nsf/display
ISO80000Reference: 6-9
EMMO 967080e5 2f42 4eb2 a3a9 c58143e835f9: Surface density of electric charge multiplied by velocity

MentalAgency
type: Class
comment: An intentional agency caused by the agent’s mental states and events.
subclass of: Restriction
EMMO 967080e5 2f42 4eb2 a3a9 c58143e835f9: An intentional agency caused by the agent’s mental states and events.
EMMO c7b62dd7 063a 4c2a 8504 42f7264ba83f: Mental states are strictly connected to the definition of mind, which is traditionally connected to high cognitive skills, such as the one provided by human beings brains.

unitSymbol
type: AnnotationProperty
comment: The standard symbol for a unit.
range: string
sub property of: comment
EMMO 967080e5 2f42 4eb2 a3a9 c58143e835f9: The standard symbol for a unit.
EMMO c7b62dd7 063a 4c2a 8504 42f7264ba83f: A unit symbol may be a symbolic construct (e.g. km) or a symbol (e.g. m).

PhaseDifference
type: Class
comment: Under sinusoidal conditions, phase difference between the voltage applied to a linear two-terminal element or two-terminal circuit and the electric current in the element or circuit.
alternative label: DisplacementAngle
wikidataReference: https://www.wikidata.org/wiki/Q97222919
IEVReference: https://www.electropedia.org/iev/iev.nsf/display
ISO80000Reference: 6-48
EMMO 967080e5 2f42 4eb2 a3a9 c58143e835f9: Under sinusoidal conditions, phase difference between the voltage applied to a linear two-terminal element or two-terminal circuit and the electric current in the element or circuit.

NonConvergent
type: Class
comment: The superclass for all classes of entities that have a proper parts of the same type φ of the whole, and so that for every two distinct φ proper parts one is not part of the other.
EMMO 967080e5 2f42 4eb2 a3a9 c58143e835f9: The superclass for all classes of entities that have a proper parts of the same type φ of the whole, and so that for every two distinct φ proper parts one is not part of the other.

MechanicalEfficiency
type: Class
comment: Quotient of mechanical output and input power.
wikidataReference: https://www.wikidata.org/wiki/Q2628085
ISO80000Reference: 4-29
EMMO 967080e5 2f42 4eb2 a3a9 c58143e835f9: Quotient of mechanical output and input power.

IsentropicExponent
type: Class
comment: For an ideal gas, isentropic exponent is equal to ratio of the specific heat capacities.
qudtReference: https://qudt.org/vocab/quantitykind/IsentropicExponent
wikidataReference: https://www.wikidata.org/wiki/Q75775739
IEVReference: https://www.electropedia.org/iev/iev.nsf/display
ISO80000Reference: 5-17.2
EMMO 967080e5 2f42 4eb2 a3a9 c58143e835f9: For an ideal gas, isentropic exponent is equal to ratio of the specific heat capacities.

GrandCanonicalPartionFunction
type: Class
comment: Sum of canonical partition function Z (NA,NB,…) for the given number of particles A, B, ... multiplied by absolute activities of particles A, B, ...
alternative label: GrandPartionFunction
qudtReference: https://qudt.org/vocab/quantitykind/GrandCanonicalPartitionFunction
wikidataReference: https://www.wikidata.org/wiki/Q96176022
ISO80000Reference: 9-35.3
EMMO 967080e5 2f42 4eb2 a3a9 c58143e835f9: Sum of canonical partition function Z (NA,NB,…) for the given number of particles A, B, ... multiplied by absolute activities of particles A, B, ...

GoldSymbol
type: Class
comment: The symbol that stands for the gold atom.
subclass of: Restriction
subclass of: Restriction
  has value: Au
EMMO 967080e5 2f42 4eb2 a3a9 c58143e835f9: The symbol that stands for the gold atom.

ThermalInsulance
type: Class
comment: Reciprocal of the coefficient of heat transfer.
subclass of: Restriction
alternative label: CoefficientOfThermalInsulance
qudtReference: https://qudt.org/vocab/quantitykind/ThermalInsulance
wikidataReference: https://www.wikidata.org/wiki/Q2596212
IEVReference: https://www.electropedia.org/iev/iev.nsf/display
ISO80000Reference: 5-11
EMMO 967080e5 2f42 4eb2 a3a9 c58143e835f9: Reciprocal of the coefficient of heat transfer.

MagneticDipoleMoment
type: Class
comment: For an atom or nucleus, this energy is quantized and can be written as: W = g μ M B where g is the appropriate g factor, μ is mostly the Bohr magneton or nuclear magneton, M is magnetic quantum number, and B is magnitude of the magnetic flux density. -- ISO 80000
comment: Vector quantity μ causing a change to its energy ΔW in an external magnetic field of field flux density B: ΔW = −μ · B
subclass of: Restriction
qudtReference: http://qudt.org/vocab/quantitykind/MagneticDipoleMoment
IEVReference: https://www.electropedia.org/iev/iev.nsf/display
ISO80000Reference: 10-9.1
ISO80000Reference: 6-30
EMMO 967080e5 2f42 4eb2 a3a9 c58143e835f9: Vector quantity μ causing a change to its energy ΔW in an external magnetic field of field flux density B: ΔW = −μ · B
iupacReference: http://goldbook.iupac.org/terms/view/M03688

AcceptorDensity
type: Class
comment: quotient of number of acceptor levels and volume.
subclass of: Restriction
qudtReference: https://qudt.org/vocab/quantitykind/AcceptorDensity
wikidataReference: https://www.wikidata.org/wiki/Q105979968
ISO80000Reference: 12-29.5
EMMO 967080e5 2f42 4eb2 a3a9 c58143e835f9: quotient of number of acceptor levels and volume.

BondedAtom
type: Class
comment: A bonded atom that shares at least one electron to the atom-based entity of which is part of.
comment: A real bond between atoms is always something hybrid between covalent, metallic and ionic. In general, metallic and ionic bonds have atoms sharing electrons.
comment: The bond types that are covered by this definition are the strong electronic bonds: covalent, metallic and ionic.
comment: This class can be used to represent molecules as simplified quantum systems, in which outer molecule shared electrons are un-entangled with the inner shells of the atoms composing the molecule.
EMMO 967080e5 2f42 4eb2 a3a9 c58143e835f9: A bonded atom that shares at least one electron to the atom-based entity of which is part of.

InternalEnergy
type: Class
comment: A state quantity equal to the difference between the total energy of a system and the sum of the macroscopic kinetic and potential energies of the system.
alternative label: ThermodynamicEnergy
qudtReference: http://qudt.org/vocab/quantitykind/InternalEnergy
ISO80000Reference: 5.20-2
EMMO 967080e5 2f42 4eb2 a3a9 c58143e835f9: A state quantity equal to the difference between the total energy of a system and the sum of the macroscopic kinetic and potential energies of the system.
iupacReference: https://doi.org/10.1351/goldbook.I03103

NonActivePower
type: Class
comment: For a two-terminal element or a two-terminal circuit under periodic conditions, quantity equal to the square root of the difference of the squares of the apparent power S and the active power P.
qudtReference: https://qudt.org/vocab/quantitykind/NonActivePower
wikidataReference: https://www.wikidata.org/wiki/Q79813060
IEVReference: https://www.electropedia.org/iev/iev.nsf/display
ISO80000Reference: 6-61
EMMO 967080e5 2f42 4eb2 a3a9 c58143e835f9: For a two-terminal element or a two-terminal circuit under periodic conditions, quantity equal to the square root of the difference of the squares of the apparent power S and the active power P.

ResistanceToAlternativeCurrent
type: Class
comment: Real part of the impedance.
wikidataReference: https://www.wikidata.org/wiki/Q1048490
IEVReference: https://www.electropedia.org/iev/iev.nsf/display
ISO80000Reference: 6-51.2
EMMO 967080e5 2f42 4eb2 a3a9 c58143e835f9: Real part of the impedance.

MobiusStrip
type: Class
comment: A 2-manifold with one unconnected boundary and one "face".
EMMO 967080e5 2f42 4eb2 a3a9 c58143e835f9: A 2-manifold with one unconnected boundary and one "face".

ThuliumSymbol
type: Class
comment: The symbol that stands for the thulium atom.
subclass of: Restriction
  has value: Tm
EMMO 967080e5 2f42 4eb2 a3a9 c58143e835f9: The symbol that stands for the thulium atom.

hasTemporalCollectionSlice
type: ObjectProperty
comment: A temporal part that is a collection.
EMMO 967080e5 2f42 4eb2 a3a9 c58143e835f9: A temporal part that is a collection.

Replica
type: Class
comment: An icon that not only resembles the object, but also can express some of the object's functions.
equivalent class: Class
example: A small scale replica of a plane tested in a wind gallery shares the same functionality in terms of aerodynamic behaviour of the bigger one.
example: Pinocchio is a functional icon of a boy since it imitates the external behaviour without having the internal biological structure of a human being (it is made of magic wood...).
EMMO 967080e5 2f42 4eb2 a3a9 c58143e835f9: An icon that not only resembles the object, but also can express some of the object's functions.

SpecificEnthalpy
type: Class
comment: Enthalpy per unit mass.
qudtReference: https://qudt.org/vocab/quantitykind/SpecificEnthalpy
wikidataReference: https://www.wikidata.org/wiki/Q21572993
ISO80000Reference: 5-21.3
EMMO 967080e5 2f42 4eb2 a3a9 c58143e835f9: Enthalpy per unit mass.
wikipediaReference: https://en.wikipedia.org/wiki/Enthalpy#Specific_enthalpy

Torus
type: Class
comment: The simplest 2-manifold with genus 1.
EMMO 967080e5 2f42 4eb2 a3a9 c58143e835f9: The simplest 2-manifold with genus 1.

CapacitancePerLengthUnit
type: Class
comment: The class of units with dimensionality 'CapacitancePerLength'.
subclass of: Restriction
  has value: T+4 L-1 M-1 I+2 Θ0 N0 J0
EMMO 967080e5 2f42 4eb2 a3a9 c58143e835f9: The class of units with dimensionality 'CapacitancePerLength'.

Foaming
type: Class

ManufacturingDevice
type: Class
comment: A device that is designed to participate to a manufacturing process.
EMMO 967080e5 2f42 4eb2 a3a9 c58143e835f9: A device that is designed to participate to a manufacturing process.

MaterialByFunction
type: Class
alternative label: FunctionalMaterial

SurfaceTension
type: Class
comment: The tendency of liquid surfaces at rest to shrink into the minimum surface area possible.
subclass of: Restriction
alternative label: 4-26
qudtReference: https://qudt.org/vocab/quantitykind/SurfaceTension
wikidataReference: https://www.wikidata.org/wiki/Q170749
IEVReference: https://www.electropedia.org/iev/iev.nsf/display
EMMO 967080e5 2f42 4eb2 a3a9 c58143e835f9: The tendency of liquid surfaces at rest to shrink into the minimum surface area possible.
EMMO c7b62dd7 063a 4c2a 8504 42f7264ba83f: Surface tension is a contractive tendency of the surface of a liquid that allows it to resist an external force. -- QUDT
iupacReference: https://doi.org/10.1351/goldbook.S06192

NumericalData
type: Class
comment: Data that can be decoded under a quantitative schema and also associated with a graphical number symbols.
EMMO 967080e5 2f42 4eb2 a3a9 c58143e835f9: Data that can be decoded under a quantitative schema and also associated with a graphical number symbols.

hasQuantityValue
type: ObjectProperty
comment: A conventional relation that relates a quantity to its quantity value.
EMMO 967080e5 2f42 4eb2 a3a9 c58143e835f9: A conventional relation that relates a quantity to its quantity value.

ChemicalPotential
type: Class
comment: Energy per unit change in amount of substance.
subclass of: Restriction
qudtReference: http://qudt.org/vocab/quantitykind/ChemicalPotential
ISO80000Reference: 9-17
EMMO 967080e5 2f42 4eb2 a3a9 c58143e835f9: Energy per unit change in amount of substance.
iupacReference: https://doi.org/10.1351/goldbook.C01032

ArithmeticExpression
type: Class
subclass of: Class
  complement of: Restriction
example: 2+2

ElectricConductivityPerAmountUnit
type: Class
comment: The class of units with dimensionality 'ElectricConductivityPerAmount'.
subclass of: Restriction
  has value: T+3 L-3 M-1 I+2 Θ0 N-1 J0
EMMO 967080e5 2f42 4eb2 a3a9 c58143e835f9: The class of units with dimensionality 'ElectricConductivityPerAmount'.

hasTemporalInternal
type: ObjectProperty

KineticFrictionFactor
type: Class
comment: Proportionality factor between the magnitudes of the kinetic friction force, and the normal component of the contact force.
alternative label: DynamicFrictionFactor
wikidataReference: https://www.wikidata.org/wiki/Q73695445
IEVReference: https://www.electropedia.org/iev/iev.nsf/display
ISO80000Reference: 4-23.2
EMMO 967080e5 2f42 4eb2 a3a9 c58143e835f9: Proportionality factor between the magnitudes of the kinetic friction force, and the normal component of the contact force.
EMMO c7b62dd7 063a 4c2a 8504 42f7264ba83f: When it is not necessary to distinguish between dynamic friction factor and static friction factor, the name friction factor may be used for both. The dynamic friction factor µ is independent in first approximation of the contact surface.

PalladiumSymbol
type: Class
comment: The symbol that stands for the palladium atom.
subclass of: Restriction
subclass of: Restriction
  has value: Pd
EMMO 967080e5 2f42 4eb2 a3a9 c58143e835f9: The symbol that stands for the palladium atom.

generates
type: AsymmetricProperty
type: IrreflexiveProperty
type: ObjectProperty
comment: The relation between an object O that proper overlaps a process P, where the non-overlapping part of P is caused by O.
EMMO 967080e5 2f42 4eb2 a3a9 c58143e835f9: The relation between an object O that proper overlaps a process P, where the non-overlapping part of P is caused by O.

CollectiveAgency
type: Class
comment: Collective agency occurs when two or more individuals act as a group, in accordance with certain principles or procedures that constitute and organize the group.
subclass of: Restriction
EMMO 967080e5 2f42 4eb2 a3a9 c58143e835f9: Collective agency occurs when two or more individuals act as a group, in accordance with certain principles or procedures that constitute and organize the group.
EMMO c7b62dd7 063a 4c2a 8504 42f7264ba83f: The group acting collectively is intended to be represented as an item, meaning that all members of the group should have had at least one causal interaction with another member. The collective action in fact is taken in accordance with certain principles or procedures that constitute and organize the group itself that requires implicitly a causal interaction between members.

LowPressureCasting
type: Class

MolarVolume
type: Class
comment: Volume per amount of substance.
subclass of: Restriction
qudtReference: https://qudt.org/vocab/quantitykind/MolarVolume
wikidataReference: https://www.wikidata.org/wiki/Q487112
ISO80000Reference: 9-5
EMMO 967080e5 2f42 4eb2 a3a9 c58143e835f9: Volume per amount of substance.

TotalAngularMomentumQuantumNumber
type: Class
comment: Quantum number in an atom describing the magnitude of total angular momentum J.
qudtReference: https://qudt.org/vocab/quantitykind/TotalAngularMomentumQuantumNumber
wikidataReference: https://www.wikidata.org/wiki/Q1141095
ISO80000Reference: 10-13.6
EMMO 967080e5 2f42 4eb2 a3a9 c58143e835f9: Quantum number in an atom describing the magnitude of total angular momentum J.

LinearIonization
type: Class
comment: Differential quotient of q with respect to l, where q is the average total charge of all positive ions produced by an ionizing charged particle over a path l, divided by the elementary charge.
qudtReference: https://qudt.org/vocab/quantitykind/LinearIonization
wikidataReference: https://www.wikidata.org/wiki/Q98690755
IEVReference: https://www.electropedia.org/iev/iev.nsf/display
ISO80000Reference: 10-58
EMMO 967080e5 2f42 4eb2 a3a9 c58143e835f9: Differential quotient of q with respect to l, where q is the average total charge of all positive ions produced by an ionizing charged particle over a path l, divided by the elementary charge.

TechnetiumSymbol
type: Class
comment: The symbol that stands for the technetium atom.
subclass of: Restriction
  has value: Tc
EMMO 967080e5 2f42 4eb2 a3a9 c58143e835f9: The symbol that stands for the technetium atom.

Communicating
type: Class
comment: A semiosis where the interpreter perceives a referent, that generates the interpretant as interpreter's internal representation. Than the interpretant is communicated by the interpreter by the production of a sign, i.e. the entity that stands for the referent according to the interpreter.
example: I (interpreter) see an entity (referent) whose perception stimulates in me an internal representation (interpretant). Then I say: "Ketchup." (sign) with the intention of communicate externally something about that entity.
EMMO 967080e5 2f42 4eb2 a3a9 c58143e835f9: A semiosis where the interpreter perceives a referent, that generates the interpretant as interpreter's internal representation. Than the interpretant is communicated by the interpreter by the production of a sign, i.e. the entity that stands for the referent according to the interpreter.

RheniumSymbol
type: Class
comment: The symbol that stands for the rhenium atom.
subclass of: Restriction
subclass of: Restriction
  has value: Re
EMMO 967080e5 2f42 4eb2 a3a9 c58143e835f9: The symbol that stands for the rhenium atom.

Radioactivity
type: Class
comment: Decays per unit time.
subclass of: Restriction
alternative label: RadioactiveActivity
qudtReference: http://qudt.org/vocab/quantitykind/SpecificActivity
EMMO 967080e5 2f42 4eb2 a3a9 c58143e835f9: Decays per unit time.
iupacReference: https://doi.org/10.1351/goldbook.A00114

PhysicalBasedSimulationSoftware
type: Class
comment: A computational application that uses a physical model to predict the behaviour of a system, providing a identifiable analogy with the original object.
EMMO 967080e5 2f42 4eb2 a3a9 c58143e835f9: A computational application that uses a physical model to predict the behaviour of a system, providing a identifiable analogy with the original object.

ProtonMass
type: Class
comment: The rest mass of a proton.
qudtReference: http://qudt.org/vocab/constant/ProtonMass
EMMO 967080e5 2f42 4eb2 a3a9 c58143e835f9: The rest mass of a proton.
iupacReference: https://doi.org/10.1351/goldbook.P04914

MeanFreePathOfPhonons
type: Class
comment: average distance that phonons travel between two successive interactions
qudtReference: https://qudt.org/vocab/quantitykind/PhononMeanFreePath
wikidataReference: https://www.wikidata.org/wiki/Q105672255
ISO80000Reference: 12-15.1
EMMO 967080e5 2f42 4eb2 a3a9 c58143e835f9: average distance that phonons travel between two successive interactions

ThermalConductivity
type: Class
comment: At a point fixed in a medium with a temperature field, scalar quantity λ characterizing the ability of the medium to transmit heat through a surface element containing that point: φ = −λ grad T, where φ is the density of heat flow rate and T is thermodynamic temperature.
comment: In an anisotropic medium, thermal conductivity is a tensor quantity.
subclass of: Restriction
qudtReference: https://qudt.org/vocab/quantitykind/ThermalConductivity
wikidataReference: https://www.wikidata.org/wiki/Q487005
IEVReference: https://www.electropedia.org/iev/iev.nsf/display
dbpediaReference: https://dbpedia.org/page/Thermal_conductivity
ISO80000Reference: 5-9
EMMO 967080e5 2f42 4eb2 a3a9 c58143e835f9: At a point fixed in a medium with a temperature field, scalar quantity λ characterizing the ability of the medium to transmit heat through a surface element containing that point: φ = −λ grad T, where φ is the density of heat flow rate and T is thermodynamic temperature.

Plus
type: Class
subclass of: Restriction
  has value: +

ISO80000Reference
type: AnnotationProperty
comment: Corresponding item number in ISO 80 000.
sub property of: seeAlso
example: 3-1.1 (ISO80000 reference to length)
EMMO 967080e5 2f42 4eb2 a3a9 c58143e835f9: Corresponding item number in ISO 80 000.

MeanFreePathOfElectrons
type: Class
comment: Average distance that electrons travel between two successive interactions.
qudtReference: https://qudt.org/vocab/quantitykind/ElectronMeanFreePath
wikidataReference: https://www.wikidata.org/wiki/Q105672307
ISO80000Reference: 12-15.2
EMMO 967080e5 2f42 4eb2 a3a9 c58143e835f9: Average distance that electrons travel between two successive interactions.

AbsorbedDose
type: Class
comment: Energy imparted to matter by ionizing radiation in a suitable small element of volume divided by the mass of that element of volume.
subclass of: Restriction
qudtReference: http://qudt.org/vocab/quantitykind/AbsorbedDose
ISO80000Reference: 10-81.1
EMMO 967080e5 2f42 4eb2 a3a9 c58143e835f9: Energy imparted to matter by ionizing radiation in a suitable small element of volume divided by the mass of that element of volume.
iupacReference: https://doi.org/10.1351/goldbook.A00031

NuclearSpinQuantumNumber
type: Class
comment: Quantum number related to the total angular momentum, J, of a nucleus in any specified state, normally called nuclear spin.
qudtReference: https://qudt.org/vocab/quantitykind/NuclearSpinQuantumNumber
wikidataReference: https://www.wikidata.org/wiki/Q97577403
ISO80000Reference: 10-13.7
EMMO 967080e5 2f42 4eb2 a3a9 c58143e835f9: Quantum number related to the total angular momentum, J, of a nucleus in any specified state, normally called nuclear spin.

ElectricCurrentPhasor
type: Class
comment: A representation of current as a sinusoidal integral quantity using a complex quantity whose argument is equal to the initial phase and whose modulus is equal to the root-mean-square value.
qudtReference: https://qudt.org/vocab/quantitykind/ElectricCurrentPhasor
wikidataReference: https://www.wikidata.org/wiki/Q78514596
ISO80000Reference: 6-49
EMMO 967080e5 2f42 4eb2 a3a9 c58143e835f9: A representation of current as a sinusoidal integral quantity using a complex quantity whose argument is equal to the initial phase and whose modulus is equal to the root-mean-square value.
EMMO c7b62dd7 063a 4c2a 8504 42f7264ba83f: A phasor is a constant complex number, usually expressed in exponential form, representing the complex amplitude (magnitude and phase) of a sinusoidal function of time. Phasors are used by electrical engineers to simplify computations involving sinusoids, where they can often reduce a differential equation problem to an algebraic one.

MassFractionOfDryMatter
type: Class
comment: Quantity wd = 1 − wH2O, where wH2O is mass fraction of water.
qudtReference: https://qudt.org/vocab/quantitykind/MassFractionOfDryMatter
wikidataReference: https://www.wikidata.org/wiki/Q76379189
IEVReference: https://www.electropedia.org/iev/iev.nsf/display
ISO80000Reference: 5-32
EMMO 967080e5 2f42 4eb2 a3a9 c58143e835f9: Quantity wd = 1 − wH2O, where wH2O is mass fraction of water.

Molds
type: Class

Proton
type: Class
comment: A positive charged subatomic particle found in the atomic nucleus.
EMMO 967080e5 2f42 4eb2 a3a9 c58143e835f9: A positive charged subatomic particle found in the atomic nucleus.
wikipediaReference: https://en.wikipedia.org/wiki/Proton

NihoniumSymbol
type: Class
comment: The symbol that stands for the nihonium atom.
subclass of: Restriction
  has value: Nh
EMMO 967080e5 2f42 4eb2 a3a9 c58143e835f9: The symbol that stands for the nihonium atom.

IsochoricHeatCapacity
type: Class
comment: Heat capacity at constant volume.
alternative label: HeatCapacityAtConstantVolume
wikidataReference: https://www.wikidata.org/wiki/Q112187521
IEVReference: https://www.electropedia.org/iev/iev.nsf/display
ISO80000Reference: 5-16.3
EMMO 967080e5 2f42 4eb2 a3a9 c58143e835f9: Heat capacity at constant volume.

PoissonNumber
type: Class
comment: Ratio of transverse strain to axial strain.
alternative label: PoissonsRatio
wikidataReference: https://www.wikidata.org/wiki/Q190453
IEVReference: https://www.electropedia.org/iev/iev.nsf/display
ISO80000Reference: 4-18
EMMO 967080e5 2f42 4eb2 a3a9 c58143e835f9: Ratio of transverse strain to axial strain.

DynamicViscosity
type: Class
comment: The measure of the resistance of a fluid to flow when an external force is applied.
subclass of: Restriction
alternative label: Viscosity
qudtReference: https://qudt.org/vocab/quantitykind/DynamicViscosity
wikidataReference: https://www.wikidata.org/wiki/Q15152757
IEVReference: https://www.electropedia.org/iev/iev.nsf/display
ISO80000Reference: 4-24
EMMO 967080e5 2f42 4eb2 a3a9 c58143e835f9: The measure of the resistance of a fluid to flow when an external force is applied.
iupacReference: https://doi.org/10.1351/goldbook.D01877

NominalProperty
type: Class
comment: "Property of a phenomenon, body, or substance, where the property has no magnitude." "A nominal property has a value, which can be expressed in words, by alphanumerical codes, or by other means." International vocabulary of metrology (VIM)
comment: An 'ObjectiveProperty' that cannot be quantified.
example: CFC is a 'sign' that stands for the fact that the morphology of atoms composing the microstructure of an entity is predominantly Cubic Face Centered A color is a nominal property. Sex of a human being.
EMMO 967080e5 2f42 4eb2 a3a9 c58143e835f9: An 'ObjectiveProperty' that cannot be quantified.
EMMO bb49844b 45d7 4f0d 8cae 8e552cbc20d6: nominal property

MicrocanonicalPartitionFunction
type: Class
comment: Number of all quantum states consistent with given energy, volume, and external fields.
qudtReference: https://qudt.org/vocab/quantitykind/MicroCanonicalPartitionFunction
wikidataReference: https://www.wikidata.org/wiki/Q96106546
ISO80000Reference: 9-35.1
EMMO 967080e5 2f42 4eb2 a3a9 c58143e835f9: Number of all quantum states consistent with given energy, volume, and external fields.

PeriodDuration
type: Class
comment: duration of one cycle of a periodic event
alternative label: Period
qudtReference: https://qudt.org/vocab/quantitykind/Period
wikidataReference: https://www.wikidata.org/wiki/Q2642727
IEVReference: https://www.electropedia.org/iev/iev.nsf/display
ISO80000Reference: 3-14
EMMO 967080e5 2f42 4eb2 a3a9 c58143e835f9: duration of one cycle of a periodic event
iupacReference: https://doi.org/10.1351/goldbook.P04493

HalfLife
type: Class
comment: Mean duration required for the decay of one half of the atoms or nuclei.
qudtReference: https://qudt.org/vocab/quantitykind/Half-Life
wikidataReference: https://www.wikidata.org/wiki/Q98118544
IEVReference: https://www.electropedia.org/iev/iev.nsf/display
ISO80000Reference: 10-31
EMMO 967080e5 2f42 4eb2 a3a9 c58143e835f9: Mean duration required for the decay of one half of the atoms or nuclei.

RelativePressureCoefficient
type: Class
comment: Relative change of pressure with temperature at constant volume.
subclass of: Restriction
qudtReference: https://qudt.org/vocab/quantitykind/RelativePressureCoefficient
wikidataReference: https://www.wikidata.org/wiki/Q74761852
IEVReference: https://www.electropedia.org/iev/iev.nsf/display
ISO80000Reference: 5-3.3
EMMO 967080e5 2f42 4eb2 a3a9 c58143e835f9: Relative change of pressure with temperature at constant volume.

NonLeakageProbability
type: Class
comment: Probability that a neutron will not escape from the reactor during the slowing-down process or while it diffuses as a thermal neutron.
qudtReference: https://qudt.org/vocab/quantitykind/Non-LeakageProbability
wikidataReference: https://www.wikidata.org/wiki/Q99415566
ISO80000Reference: 10-77
EMMO 967080e5 2f42 4eb2 a3a9 c58143e835f9: Probability that a neutron will not escape from the reactor during the slowing-down process or while it diffuses as a thermal neutron.

Polynomial
type: Class
example: 2 * x^2 + x + 3

MagnesiumSymbol
type: Class
comment: The symbol that stands for the magnesium atom.
subclass of: Restriction
  has value: Mg
EMMO 967080e5 2f42 4eb2 a3a9 c58143e835f9: The symbol that stands for the magnesium atom.

HeatFlowRate
type: Class
comment: Amount of heat through a surface during a time interval divided by the duration of this interval.
qudtReference: https://qudt.org/vocab/quantitykind/HeatFlowRate
wikidataReference: https://www.wikidata.org/wiki/Q12160631
IEVReference: https://www.electropedia.org/iev/iev.nsf/display
ISO80000Reference: 5-7
EMMO 967080e5 2f42 4eb2 a3a9 c58143e835f9: Amount of heat through a surface during a time interval divided by the duration of this interval.

CoperniciumSymbol
type: Class
comment: The symbol that stands for the copernicium atom.
subclass of: Restriction
subclass of: Restriction
  has value: Cn
EMMO 967080e5 2f42 4eb2 a3a9 c58143e835f9: The symbol that stands for the copernicium atom.

hasEndTask
type: ObjectProperty
comment: The relation identifying the tasks of a workflow that are not a temporal cause of other parts of the workflow.
EMMO 967080e5 2f42 4eb2 a3a9 c58143e835f9: The relation identifying the tasks of a workflow that are not a temporal cause of other parts of the workflow.

ElectricReactance
type: Class
comment: The opposition of a circuit element to a change in current or voltage, due to that element's inductance or capacitance.
alternative label: Reactance
qudtReference: http://qudt.org/vocab/quantitykind/Reactance
wikidataReference: https://www.wikidata.org/wiki/Q193972
ISO80000Reference: 6-51.3
EMMO 967080e5 2f42 4eb2 a3a9 c58143e835f9: The opposition of a circuit element to a change in current or voltage, due to that element's inductance or capacitance.
EMMO c7b62dd7 063a 4c2a 8504 42f7264ba83f: The imaginary part of the impedance.
wikipediaReference: https://en.wikipedia.org/wiki/Electrical_reactance
iupacReference: https://doi.org/10.1351/goldbook.R05162

AngularMeasure
type: Class
comment: The abstract notion of angle.
qudtReference: https://qudt.org/vocab/quantitykind/Angle
wikidataReference: https://www.wikidata.org/wiki/Q1357788
IEVReference: https://www.electropedia.org/iev/iev.nsf/display
ISO80000Reference: 3-5
EMMO 967080e5 2f42 4eb2 a3a9 c58143e835f9: The abstract notion of angle.
iupacReference: https://doi.org/10.1351/goldbook.A00346

HydrogenSymbol
type: Class
comment: The symbol that stands for the hydrogen atom.
subclass of: Restriction
  has value: H
EMMO 967080e5 2f42 4eb2 a3a9 c58143e835f9: The symbol that stands for the hydrogen atom.

ElectricCurrentDensityPerTemperatureUnit
type: Class
comment: The class of units with dimensionality 'ElectricCurrentDensityPerTemperature'.
subclass of: Restriction
  has value: T0 L-2 M0 I+1 Θ-1 N0 J0
EMMO 967080e5 2f42 4eb2 a3a9 c58143e835f9: The class of units with dimensionality 'ElectricCurrentDensityPerTemperature'.

LevelWidth
type: Class
comment: In nuclear physics, quotient of the reduced Planck constant and the mean duration of life of an unstable particle or an excited state.
qudtReference: https://qudt.org/vocab/quantitykind/LevelWidth
wikidataReference: https://www.wikidata.org/wiki/Q98082340
ISO80000Reference: 10-26
EMMO 967080e5 2f42 4eb2 a3a9 c58143e835f9: In nuclear physics, quotient of the reduced Planck constant and the mean duration of life of an unstable particle or an excited state.
iupacReference: https://doi.org/10.1351/goldbook.L03507

MixingRatio
type: Class
comment: Ratio of the mass of water vapour to the mass of dry air in a given volume of air.
comment: The mixing ratio at saturation is denoted xsat.
alternative label: MassRatioOfWaterVapourToDryGas
wikidataReference: https://www.wikidata.org/wiki/Q76378940
IEVReference: https://www.electropedia.org/iev/iev.nsf/display
ISO80000Reference: 5-30
EMMO 967080e5 2f42 4eb2 a3a9 c58143e835f9: Ratio of the mass of water vapour to the mass of dry air in a given volume of air.

ThomsonCoefficient
type: Class
comment: Quotient of Thomson heat power developed, and the electric current and temperature difference.
subclass of: Restriction
qudtReference: https://qudt.org/vocab/quantitykind/ThomsonCoefficient
wikidataReference: https://www.wikidata.org/wiki/Q105801233
ISO80000Reference: 12-23
EMMO 967080e5 2f42 4eb2 a3a9 c58143e835f9: Quotient of Thomson heat power developed, and the electric current and temperature difference.

NuclearPrecessionAngularFrequency
type: Class
comment: Frequency by which the nucleus angular momentum vector precesses about the axis of an external magnetic field.
wikidataReference: https://www.wikidata.org/wiki/Q97641779
ISO80000Reference: 10-15.3
EMMO 967080e5 2f42 4eb2 a3a9 c58143e835f9: Frequency by which the nucleus angular momentum vector precesses about the axis of an external magnetic field.

TransportationDevice
type: Class

SamariumSymbol
type: Class
comment: The symbol that stands for the samarium atom.
subclass of: Restriction
  has value: Sm
EMMO 967080e5 2f42 4eb2 a3a9 c58143e835f9: The symbol that stands for the samarium atom.

Painting
type: Class

OxygenSymbol
type: Class
comment: The symbol that stands for the oxygen atom.
subclass of: Restriction
  has value: O
EMMO 967080e5 2f42 4eb2 a3a9 c58143e835f9: The symbol that stands for the oxygen atom.

Luminance
type: Class
comment: A photometric measure of the luminous intensity per unit area of light travelling in a given direction.
comment: Measured in cd/m². Not to confuse with Illuminance, which is measured in lux (cd sr/m²).
subclass of: Restriction
qudtReference: http://qudt.org/vocab/quantitykind/Luminance
EMMO 967080e5 2f42 4eb2 a3a9 c58143e835f9: A photometric measure of the luminous intensity per unit area of light travelling in a given direction.
iupacReference: https://doi.org/10.1351/goldbook.L03640

Degenerency
type: Class
comment: For a quantum level, the statistical weight of that level.
alternative label: Multiplicity
wikidataReference: https://www.wikidata.org/wiki/Q902301
ISO80000Reference: 9-36.2
EMMO 967080e5 2f42 4eb2 a3a9 c58143e835f9: For a quantum level, the statistical weight of that level.
iupacReference: https://doi.org/10.1351/goldbook.D01556

OsmoticCoefficientOfSolvent
type: Class
comment: Quantity characterizing the deviation of a solvent from ideal behavior.
alternative label: OsmoticFactorOfSolvent
qudtReference: https://qudt.org/vocab/quantitykind/OsmoticCoefficient
wikidataReference: https://www.wikidata.org/wiki/Q5776102
ISO80000Reference: 9-27.2
EMMO 967080e5 2f42 4eb2 a3a9 c58143e835f9: Quantity characterizing the deviation of a solvent from ideal behavior.
iupacReference: https://doi.org/10.1351/goldbook.O04342

AlgebraicEquation
type: Class
comment: An 'equation' that has parts two 'polynomial'-s
subclass of: Restriction
example: 2 * a - b = c

SpeedOfLightInVacuum
type: Class
comment: The speed of light in vacuum. Defines the base unit metre in the SI system.
qudtReference: http://qudt.org/vocab/constant/SpeedOfLight_Vacuum
ISO80000Reference: 6-35.2
EMMO 967080e5 2f42 4eb2 a3a9 c58143e835f9: The speed of light in vacuum. Defines the base unit metre in the SI system.
iupacReference: https://doi.org/10.1351/goldbook.S05854

File
type: Class
comment: In computing, a computer file is a resource for recording data on a computer storage device, primarily identified by its file path.
subclass of: Restriction
EMMO 967080e5 2f42 4eb2 a3a9 c58143e835f9: In computing, a computer file is a resource for recording data on a computer storage device, primarily identified by its file path.

Capacitance
type: Class
comment: The derivative of the electric charge of a system with respect to the electric potential.
subclass of: Restriction
alternative label: ElectricCapacitance
qudtReference: http://qudt.org/vocab/quantitykind/Capacitance
ISO80000Reference: 6-13
EMMO 967080e5 2f42 4eb2 a3a9 c58143e835f9: The derivative of the electric charge of a system with respect to the electric potential.
iupacReference: https://doi.org/10.1351/goldbook.C00791

RadiumSymbol
type: Class
comment: The symbol that stands for the radium atom.
subclass of: Restriction
subclass of: Restriction
  has value: Ra
EMMO 967080e5 2f42 4eb2 a3a9 c58143e835f9: The symbol that stands for the radium atom.

Mobility
type: Class
comment: Quotient of average drift speed imparted to a charged particle in a medium by an electric field, and the electric field strength.
subclass of: Restriction
qudtReference: https://qudt.org/vocab/quantitykind/Mobility
wikidataReference: https://www.wikidata.org/wiki/Q900648
IEVReference: https://www.electropedia.org/iev/iev.nsf/display
ISO80000Reference: 10-61
EMMO 967080e5 2f42 4eb2 a3a9 c58143e835f9: Quotient of average drift speed imparted to a charged particle in a medium by an electric field, and the electric field strength.
iupacReference: https://doi.org/10.1351/goldbook.M03955

PhaseSpeedOfElectromagneticWaves
type: Class
comment: Angular frequency divided by angular wavenumber.
qudtReference: https://qudt.org/vocab/quantitykind/ElectromagneticWavePhaseSpeed
wikidataReference: https://www.wikidata.org/wiki/Q77990619
ISO80000Reference: 6-35.1
EMMO 967080e5 2f42 4eb2 a3a9 c58143e835f9: Angular frequency divided by angular wavenumber.

IsothermalCompressibility
type: Class
comment: Quantity characterising the relative variation of volume with pressure at constant thermodynamic temperature.
qudtReference: https://qudt.org/vocab/quantitykind/IsothermalCompressibility
wikidataReference: https://www.wikidata.org/wiki/Q2990696
IEVReference: https://www.electropedia.org/iev/iev.nsf/display
ISO80000Reference: 5-5.1
EMMO 967080e5 2f42 4eb2 a3a9 c58143e835f9: Quantity characterising the relative variation of volume with pressure at constant thermodynamic temperature.

SolidFoam
type: Class
comment: A foam of trapped gas in a solid.
example: Aerogel
EMMO 967080e5 2f42 4eb2 a3a9 c58143e835f9: A foam of trapped gas in a solid.

PhysicalLaw
type: Class
comment: A law that provides a connection between a property of the object and other properties, capturing a fundamental physical phenomena.
EMMO 967080e5 2f42 4eb2 a3a9 c58143e835f9: A law that provides a connection between a property of the object and other properties, capturing a fundamental physical phenomena.

FermiumSymbol
type: Class
comment: The symbol that stands for the fermium atom.
subclass of: Restriction
  has value: Fm
EMMO 967080e5 2f42 4eb2 a3a9 c58143e835f9: The symbol that stands for the fermium atom.

HoleDensity
type: Class
comment: Number of holes in valence band per volume.
qudtReference: https://qudt.org/vocab/quantitykind/HoleDensity
wikidataReference: https://www.wikidata.org/wiki/Q105971101
ISO80000Reference: 12-29.2
EMMO 967080e5 2f42 4eb2 a3a9 c58143e835f9: Number of holes in valence band per volume.

Presses
type: Class

CentreOfMass
type: Class
comment: In non-relativistic physics, the centre of mass doesn’t depend on the chosen reference frame.
comment: The unique point where the weighted relative position of the distributed mass of an Item sums to zero. Equivalently, it is the point where if a force is applied to the Item, causes the Item to move in direction of force without rotation.
EMMO 967080e5 2f42 4eb2 a3a9 c58143e835f9: The unique point where the weighted relative position of the distributed mass of an Item sums to zero. Equivalently, it is the point where if a force is applied to the Item, causes the Item to move in direction of force without rotation.
wikipediaReference: https://en.wikipedia.org/wiki/Center_of_mass

GaugePressure
type: Class
comment: The pressure measured relative to the ambient atmospheric pressure.
subclass of: Restriction
wikidataReference: https://www.wikidata.org/wiki/Q109594211
ISO80000Reference: 4-14.2
EMMO 967080e5 2f42 4eb2 a3a9 c58143e835f9: The pressure measured relative to the ambient atmospheric pressure.
EMMO c7b62dd7 063a 4c2a 8504 42f7264ba83f: Gauge pressure can be measured using a diaphragm sensor, where one side of the diaphragm is exposed to the pressure media that is to be measured, while the other side is exposed to the ambient atmospheric pressure.

Fugacity
type: Class
comment: Measure of the tendency of a substance to leave a phase.
subclass of: Restriction
qudtReference: https://qudt.org/vocab/quantitykind/Fugacity
wikidataReference: https://www.wikidata.org/wiki/Q898412
ISO80000Reference: 9-20
EMMO 967080e5 2f42 4eb2 a3a9 c58143e835f9: Measure of the tendency of a substance to leave a phase.
iupacReference: https://doi.org/10.1351/goldbook.F02543

ConcreteOrPlasterPouring
type: Class

MolarConductivity
type: Class
comment: Conductivity per molar concentration of electrolyte.
subclass of: Restriction
qudtReference: https://qudt.org/vocab/quantitykind/MolarConductivity
wikidataReference: https://www.wikidata.org/wiki/Q1943278
ISO80000Reference: 9-45
EMMO 967080e5 2f42 4eb2 a3a9 c58143e835f9: Conductivity per molar concentration of electrolyte.
iupacReference: https://doi.org/10.1351/goldbook.M03976

DateData
type: Class
comment: A data representing a date.
EMMO 967080e5 2f42 4eb2 a3a9 c58143e835f9: A data representing a date.

FermiEnergy
type: Class
comment: In a metal, highest occupied energy level at zero thermodynamic temperature, where energy level means the energy of an electron in the interior of a substance.
qudtReference: https://qudt.org/vocab/quantitykind/FermiEnergy
wikidataReference: https://www.wikidata.org/wiki/Q431335
IEVReference: https://www.electropedia.org/iev/iev.nsf/display
ISO80000Reference: 12-27.1
EMMO 967080e5 2f42 4eb2 a3a9 c58143e835f9: In a metal, highest occupied energy level at zero thermodynamic temperature, where energy level means the energy of an electron in the interior of a substance.
iupacReference: https://doi.org/10.1351/goldbook.F02340

CompactMaterial
type: Class

HartreeEnergy
type: Class
comment: Energy of the electron in a hydrogen atom in its ground state
qudtReference: https://qudt.org/vocab/unit/E_h.html
wikidataReference: https://www.wikidata.org/wiki/Q476572
dbpediaReference: https://dbpedia.org/page/Hartree
ISO80000Reference: 10-8
EMMO 967080e5 2f42 4eb2 a3a9 c58143e835f9: Energy of the electron in a hydrogen atom in its ground state
wikipediaReference: https://en.wikipedia.org/wiki/Hartree
iupacReference: https://doi.org/10.1351/goldbook.H02748

StructureFactor
type: Class
comment: Mathematical description in crystallography.
subclass of: Restriction
qudtReference: https://qudt.org/vocab/quantitykind/StructureFactor
wikidataReference: https://www.wikidata.org/wiki/Q900684
ISO80000Reference: 12-5.4
EMMO 967080e5 2f42 4eb2 a3a9 c58143e835f9: Mathematical description in crystallography.

PackingFraction
type: Class
comment: Quotient of relative mass excess and the nucleon number.
qudtReference: https://qudt.org/vocab/quantitykind/PackingFraction
wikidataReference: https://www.wikidata.org/wiki/Q98058276
ISO80000Reference: 10-23.1
EMMO 967080e5 2f42 4eb2 a3a9 c58143e835f9: Quotient of relative mass excess and the nucleon number.

Learning
type: Class
comment: A semiosis where the interpreter perceives a referent, that generates the interpretant as interpreter's internal representation.The interpretant is not commmunicated to the external world, but kept in the internal representational space of the interpreter.
EMMO 967080e5 2f42 4eb2 a3a9 c58143e835f9: A semiosis where the interpreter perceives a referent, that generates the interpretant as interpreter's internal representation.The interpretant is not commmunicated to the external world, but kept in the internal representational space of the interpreter.

DippingForms
type: Class

hasDeduced
type: ObjectProperty
comment: A semiotic relation connecting a deducing interpreter to the "deduced" semiotic object in a deduction process.
EMMO 967080e5 2f42 4eb2 a3a9 c58143e835f9: A semiotic relation connecting a deducing interpreter to the "deduced" semiotic object in a deduction process.

WorkFunction
type: Class
comment: Least energy required for the emission of a conduction electron.
comment: Work function is the energy difference between an electron at rest at infinity and an electron at the Fermi level in the interior of a substance.
alternative label: ElectronWorkFunction
wikidataReference: https://www.wikidata.org/wiki/Q783800
IEVReference: https://www.electropedia.org/iev/iev.nsf/display
ISO80000Reference: 12-24.1
EMMO 967080e5 2f42 4eb2 a3a9 c58143e835f9: Least energy required for the emission of a conduction electron.
iupacReference: https://doi.org/10.1351/goldbook.E02015

ElectrolyticDeposition
type: Class

AbsoluteHumidity
type: Class
comment: Mass of the contained water vapour per volume.
alternative label: MassConcentrationOfWaterVapour
qudtReference: https://qudt.org/vocab/quantitykind/AbsoluteHumidity
qudtReference: https://qudt.org/vocab/quantitykind/MassConcentrationOfWaterVapour
wikidataReference: https://www.wikidata.org/wiki/Q76378808
IEVReference: https://www.electropedia.org/iev/iev.nsf/display
ISO80000Reference: 5-28
EMMO 967080e5 2f42 4eb2 a3a9 c58143e835f9: Mass of the contained water vapour per volume.

Macromolecule
type: Class
comment: A polyatomic entity containing a very large number of atoms.
example: Protein, nucleic acid, or synthetic polymer.
EMMO 967080e5 2f42 4eb2 a3a9 c58143e835f9: A polyatomic entity containing a very large number of atoms.

isDeclarerFor
type: ObjectProperty

LatticeVector
type: Class
comment: translation vector that maps the crystal lattice on itself
subclass of: Restriction
qudtReference: https://qudt.org/vocab/quantitykind/LatticeVector
wikidataReference: https://www.wikidata.org/wiki/Q105435234
ISO80000Reference: 12-1.1
EMMO 967080e5 2f42 4eb2 a3a9 c58143e835f9: translation vector that maps the crystal lattice on itself

DiffusionLength
type: Class
comment: In condensed matter physics, the square root of the product of diffusion coefficient and lifetime.
qudtReference: https://qudt.org/vocab/quantitykind/SolidStateDiffusionLength
wikidataReference: https://www.wikidata.org/wiki/Q106097176
IEVReference: https://www.electropedia.org/iev/iev.nsf/display
ISO80000Reference: 12-33
EMMO 967080e5 2f42 4eb2 a3a9 c58143e835f9: In condensed matter physics, the square root of the product of diffusion coefficient and lifetime.

ShearStrain
type: Class
comment: Displacement of one surface with respect to another divided by the distance between them.
qudtReference: https://qudt.org/vocab/quantitykind/ShearStrain
wikidataReference: https://www.wikidata.org/wiki/Q7561704
IEVReference: https://www.electropedia.org/iev/iev.nsf/display
ISO80000Reference: 4-17.3
EMMO 967080e5 2f42 4eb2 a3a9 c58143e835f9: Displacement of one surface with respect to another divided by the distance between them.
iupacReference: https://doi.org/10.1351/goldbook.S05637

BoronSymbol
type: Class
comment: The symbol that stands for the boron atom.
subclass of: Restriction
  has value: B
EMMO 967080e5 2f42 4eb2 a3a9 c58143e835f9: The symbol that stands for the boron atom.

LanthanumSymbol
type: Class
comment: The symbol that stands for the lanthanum atom.
subclass of: Restriction
subclass of: Restriction
  has value: La
EMMO 967080e5 2f42 4eb2 a3a9 c58143e835f9: The symbol that stands for the lanthanum atom.

Division
type: Class
subclass of: Restriction
  has value: /

DewPointTemperature
type: Class
comment: The corresponding Celsius temperature is denoted td and is also called dew point.
comment: Thermodynamic temperature at which vapour in air reaches saturation.
wikidataReference: https://www.wikidata.org/wiki/Q178828
IEVReference: https://www.electropedia.org/iev/iev.nsf/display
ISO80000Reference: 5-36
EMMO 967080e5 2f42 4eb2 a3a9 c58143e835f9: Thermodynamic temperature at which vapour in air reaches saturation.
iupacReference: https://doi.org/10.1351/goldbook.D01652

RybergConstant
type: Class
comment: The Rydberg constant represents the limiting value of the highest wavenumber (the inverse wavelength) of any photon that can be emitted from the hydrogen atom, or, alternatively, the wavenumber of the lowest-energy photon capable of ionizing the hydrogen atom from its ground state.
qudtReference: http://qudt.org/vocab/constant/RydbergConstant
EMMO 967080e5 2f42 4eb2 a3a9 c58143e835f9: The Rydberg constant represents the limiting value of the highest wavenumber (the inverse wavelength) of any photon that can be emitted from the hydrogen atom, or, alternatively, the wavenumber of the lowest-energy photon capable of ionizing the hydrogen atom from its ground state.
iupacReference: https://doi.org/10.1351/goldbook.R05430

RelativeMassFractionOfVapour
type: Class
comment: Quotient of mass concentration of water vapour and mass concentration at its saturation ψ = r/rsat where r is mass ratio of water vapour to dry gas and rsat is the mass ratio of water vapour to dry gas at saturation of the same temperature.
ISO80000Reference: 5-35
EMMO 967080e5 2f42 4eb2 a3a9 c58143e835f9: Quotient of mass concentration of water vapour and mass concentration at its saturation ψ = r/rsat where r is mass ratio of water vapour to dry gas and rsat is the mass ratio of water vapour to dry gas at saturation of the same temperature.

StructuralFormula
type: Class
comment: A graphical representation of a molecular structure showing the relative position in space of the atomic constituents and their bonds.
EMMO 967080e5 2f42 4eb2 a3a9 c58143e835f9: A graphical representation of a molecular structure showing the relative position in space of the atomic constituents and their bonds.

DataBasedSimulationSoftware
type: Class
comment: A computational application that uses existing data to predict the behaviour of a system without providing a identifiable analogy with the original object.
EMMO 967080e5 2f42 4eb2 a3a9 c58143e835f9: A computational application that uses existing data to predict the behaviour of a system without providing a identifiable analogy with the original object.

ArithmeticEquation
type: Class
example: 1 + 1 = 2

ScalarMagneticPotential
type: Class
comment: Scalar potential of an irrotational magnetic field strength.
subclass of: Restriction
wikidataReference: https://www.wikidata.org/wiki/Q17162107
IEVReference: https://www.electropedia.org/iev/iev.nsf/display
ISO80000Reference: 6-37.1
EMMO 967080e5 2f42 4eb2 a3a9 c58143e835f9: Scalar potential of an irrotational magnetic field strength.

CarbonSymbol
type: Class
comment: The symbol that stands for the carbon atom.
subclass of: Restriction
subclass of: Restriction
  has value: C
EMMO 967080e5 2f42 4eb2 a3a9 c58143e835f9: The symbol that stands for the carbon atom.

DieCasting
type: Class

VolumeFraction
type: Class
comment: Volume of a constituent of a mixture divided by the sum of volumes of all constituents prior to mixing.
qudtReference: http://qudt.org/vocab/quantitykind/VolumeFraction
ISO80000Reference: 9-14
EMMO 967080e5 2f42 4eb2 a3a9 c58143e835f9: Volume of a constituent of a mixture divided by the sum of volumes of all constituents prior to mixing.
iupacReference: https://doi.org/10.1351/goldbook.V06643

PotassiumSymbol
type: Class
comment: The symbol that stands for the potassium atom.
subclass of: Restriction
  has value: K
EMMO 967080e5 2f42 4eb2 a3a9 c58143e835f9: The symbol that stands for the potassium atom.

SubjectiveProperty
type: Class
comment: A quantity whos value that cannot be univocally determined and depends on an agent (e.g. a human individual, a community).
example: The measure of beauty on a scale from 1 to 10.
EMMO 967080e5 2f42 4eb2 a3a9 c58143e835f9: A quantity whos value that cannot be univocally determined and depends on an agent (e.g. a human individual, a community).

Gyroradius
type: Class
comment: Radius of the circular movement of an electrically charged particle in a magnetic field.
alternative label: LarmorRadius
wikidataReference: https://www.wikidata.org/wiki/Q1194458
ISO80000Reference: 10-17
EMMO 967080e5 2f42 4eb2 a3a9 c58143e835f9: Radius of the circular movement of an electrically charged particle in a magnetic field.

Folding
type: Class

FORTRAN
type: Class

Torque
type: Class
comment: Even though torque has the same physical dimension as energy, it is not of the same kind and can not be measured with energy units like joule or electron volt.
comment: The effectiveness of a force to produce rotation about an axis, measured by the product of the force and the perpendicular distance from the line of action of the force to the axis.
subclass of: Restriction
qudtReference: http://qudt.org/vocab/quantitykind/Torque
ISO80000Reference: 4-12.2
EMMO 967080e5 2f42 4eb2 a3a9 c58143e835f9: The effectiveness of a force to produce rotation about an axis, measured by the product of the force and the perpendicular distance from the line of action of the force to the axis.
iupacReference: https://doi.org/10.1351/goldbook.T06400

DampingCoefficient
type: Class
comment: Inverse of the time constant of an exponentially varying quantity.
IEVReference: https://www.electropedia.org/iev/iev.nsf/display
ISO80000Reference: 3-24
EMMO 967080e5 2f42 4eb2 a3a9 c58143e835f9: Inverse of the time constant of an exponentially varying quantity.

isInternalRepresentationBy
type: ObjectProperty

NonNumericalData
type: Class
comment: Data that are non-quantitatively interpreted (e.g., qualitative data, types).
EMMO 967080e5 2f42 4eb2 a3a9 c58143e835f9: Data that are non-quantitatively interpreted (e.g., qualitative data, types).

KineticEnergy
type: Class
comment: The energy of an object due to its motion.
qudtReference: http://qudt.org/vocab/quantitykind/KineticEnergy
ISO80000Reference: 4-28.2
EMMO 967080e5 2f42 4eb2 a3a9 c58143e835f9: The energy of an object due to its motion.
iupacReference: https://doi.org/10.1351/goldbook.K03402

IsobaricHeatCapacity
type: Class
comment: Heat capacity at constant pressure.
alternative label: HeatCapacityAtConstantPressure
wikidataReference: https://www.wikidata.org/wiki/Q112187490
IEVReference: https://www.electropedia.org/iev/iev.nsf/display
ISO80000Reference: 5-16.2
EMMO 967080e5 2f42 4eb2 a3a9 c58143e835f9: Heat capacity at constant pressure.

hasURLValue
type: DatatypeProperty
comment: The owl:dataProperty that provides a serialisation of an EMMO URL data entity.
range: anyURI
EMMO 967080e5 2f42 4eb2 a3a9 c58143e835f9: The owl:dataProperty that provides a serialisation of an EMMO URL data entity.

StandardUnit
type: Class
comment: A reference unit provided by a reference material. International vocabulary of metrology (VIM)
alternative label: ReferenceMaterial
example: Arbitrary amount-of-substance concentration of lutropin in a given sample of plasma (WHO international standard 80/552): 5.0 International Unit/l
EMMO 967080e5 2f42 4eb2 a3a9 c58143e835f9: A reference unit provided by a reference material. International vocabulary of metrology (VIM)

Strain
type: Class
comment: Change of the relative positions of parts of a body, excluding a displacement of the body as a whole.
qudtReference: http://qudt.org/vocab/quantitykind/Strain
ISO80000Reference: 4-17.1
EMMO 967080e5 2f42 4eb2 a3a9 c58143e835f9: Change of the relative positions of parts of a body, excluding a displacement of the body as a whole.

hasSimulatedObject
type: ObjectProperty
comment: Relates a simulation to the object or system that is simulated.
EMMO 967080e5 2f42 4eb2 a3a9 c58143e835f9: Relates a simulation to the object or system that is simulated.

hasNonWellFormedPart
type: ObjectProperty
comment: A part is connected with the rest item or a member with bi-directional causal relations that does not fall under hasNext (or its inverse) or hasContact.
EMMO 967080e5 2f42 4eb2 a3a9 c58143e835f9: A part is connected with the rest item or a member with bi-directional causal relations that does not fall under hasNext (or its inverse) or hasContact.

MolarGasConstant
type: Class
comment: Equivalent to the Boltzmann constant, but expressed in units of energy per temperature increment per mole (rather than energy per temperature increment per particle).
subclass of: Restriction
qudtReference: http://qudt.org/vocab/constant/MolarGasConstant
ISO80000Reference: 9-37.1
EMMO 967080e5 2f42 4eb2 a3a9 c58143e835f9: Equivalent to the Boltzmann constant, but expressed in units of energy per temperature increment per mole (rather than energy per temperature increment per particle).
iupacReference: https://doi.org/10.1351/goldbook.G02579

StyleSheetLanguage
type: Class
comment: A computer language that expresses the presentation of structured documents.
example: CSS
EMMO 967080e5 2f42 4eb2 a3a9 c58143e835f9: A computer language that expresses the presentation of structured documents.
wikipediaReference: https://en.wikipedia.org/wiki/Style_sheet_language

LondonPenetrationDepth
type: Class
comment: Distance a magnetic field penetrates the plane surface of a semi-finite superconductor.
qudtReference: https://qudt.org/vocab/quantitykind/LondonPenetrationDepth
wikidataReference: https://www.wikidata.org/wiki/Q3277853
IEVReference: https://www.electropedia.org/iev/iev.nsf/display
ISO80000Reference: 12-38.1
EMMO 967080e5 2f42 4eb2 a3a9 c58143e835f9: Distance a magnetic field penetrates the plane surface of a semi-finite superconductor.

MolarGibbsEnergy
type: Class
comment: Gibbs energy per amount of substance.
wikidataReference: https://www.wikidata.org/wiki/Q88863324
ISO80000Reference: 9-6.4
EMMO 967080e5 2f42 4eb2 a3a9 c58143e835f9: Gibbs energy per amount of substance.

Python
type: Class

KnownConstant
type: Class
comment: A variable that stand for a well known numerical constant (a known number).
subclass of: Restriction
example: π refers to the constant number ~3.14
EMMO 967080e5 2f42 4eb2 a3a9 c58143e835f9: A variable that stand for a well known numerical constant (a known number).

MolarHelmholtzEnergy
type: Class
comment: Helmholtz energy per amount of substance.
wikidataReference: https://www.wikidata.org/wiki/Q88862986
ISO80000Reference: 9-6.3
EMMO 967080e5 2f42 4eb2 a3a9 c58143e835f9: Helmholtz energy per amount of substance.

hasTemporalSection
type: ObjectProperty
comment: A temporal part that is not a slice.
EMMO 967080e5 2f42 4eb2 a3a9 c58143e835f9: A temporal part that is not a slice.

PoloniumSymbol
type: Class
comment: The symbol that stands for the polonium atom.
subclass of: Restriction
  has value: Po
EMMO 967080e5 2f42 4eb2 a3a9 c58143e835f9: The symbol that stands for the polonium atom.

MarkupLanguage
type: Class
comment: A grammar for annotating a document in a way that is syntactically distinguishable from the text.
example: HTML
EMMO 967080e5 2f42 4eb2 a3a9 c58143e835f9: A grammar for annotating a document in a way that is syntactically distinguishable from the text.
wikipediaReference: https://en.wikipedia.org/wiki/Markup_language

AreaDensity
type: Class
comment: Mass per unit area.
subclass of: Restriction
qudtReference: http://qudt.org/vocab/quantitykind/SurfaceDensity
EMMO 967080e5 2f42 4eb2 a3a9 c58143e835f9: Mass per unit area.
iupacReference: https://doi.org/10.1351/goldbook.S06167

NeodymiumSymbol
type: Class
comment: The symbol that stands for the neodymium atom.
subclass of: Restriction
subclass of: Restriction
  has value: Nd
EMMO 967080e5 2f42 4eb2 a3a9 c58143e835f9: The symbol that stands for the neodymium atom.

MassConcentrationOfWater
type: Class
comment: Quotient of the mass of water in a three-dimensional domain, irrespective of the form of aggregation, by the volume of the domain.
comment: The mass concentration of water at saturation is denoted wsat.
qudtReference: https://qudt.org/vocab/quantitykind/MassConcentrationOfWater
wikidataReference: https://www.wikidata.org/wiki/Q76378758
IEVReference: https://www.electropedia.org/iev/iev.nsf/display
ISO80000Reference: 5-27
EMMO 967080e5 2f42 4eb2 a3a9 c58143e835f9: Quotient of the mass of water in a three-dimensional domain, irrespective of the form of aggregation, by the volume of the domain.

ReactorTimeConstant
type: Class
comment: Duration required for the neutron fluence rate in a reactor to change by the factor e when the fluence rate is rising or falling exponentially.
qudtReference: https://qudt.org/vocab/quantitykind/ReactorTimeConstant
wikidataReference: https://www.wikidata.org/wiki/Q99518950
IEVReference: https://www.electropedia.org/iev/iev.nsf/display
ISO80000Reference: 10-79
EMMO 967080e5 2f42 4eb2 a3a9 c58143e835f9: Duration required for the neutron fluence rate in a reactor to change by the factor e when the fluence rate is rising or falling exponentially.

StatisticalWeightOfSubsystem
type: Class
comment: Number of different microstates in a subsystem.
wikidataReference: https://www.wikidata.org/wiki/Q96207431
ISO80000Reference: 9-36.1
EMMO 967080e5 2f42 4eb2 a3a9 c58143e835f9: Number of different microstates in a subsystem.

CadmiumSymbol
type: Class
comment: The symbol that stands for the cadmium atom.
subclass of: Restriction
  has value: Cd
EMMO 967080e5 2f42 4eb2 a3a9 c58143e835f9: The symbol that stands for the cadmium atom.

Gathering
type: Class
comment: A mixed tiling in which a tile is the next of spatially connected tiles.
EMMO 967080e5 2f42 4eb2 a3a9 c58143e835f9: A mixed tiling in which a tile is the next of spatially connected tiles.

hasDatum
type: ObjectProperty
comment: Relates a dataset to its datum.
EMMO 967080e5 2f42 4eb2 a3a9 c58143e835f9: Relates a dataset to its datum.

hasPortion
type: ObjectProperty
comment: The relation between a object whole and its spatial part of the same type.
example: A volume of 1 cc of milk within a 1 litre can be considered still milk as a whole. If you scale down to a cluster of molecules, than the milk cannot be considered a fluid no more (and then no more a milk).
EMMO 967080e5 2f42 4eb2 a3a9 c58143e835f9: The relation between a object whole and its spatial part of the same type.

Magnetization
type: Class
comment: At a given point within a domain of quasi-infinitesimal volume V, vector quantity equal to the magnetic area moment m of the substance contained within the domain divided by the volume V.
subclass of: Restriction
qudtReference: https://qudt.org/vocab/quantitykind/Magnetization
wikidataReference: https://www.wikidata.org/wiki/Q856711
IEVReference: https://www.electropedia.org/iev/iev.nsf/display
ISO80000Reference: 6-24
EMMO 967080e5 2f42 4eb2 a3a9 c58143e835f9: At a given point within a domain of quasi-infinitesimal volume V, vector quantity equal to the magnetic area moment m of the substance contained within the domain divided by the volume V.

Circle
type: Class
comment: Self-connected one-manyfold.
EMMO 967080e5 2f42 4eb2 a3a9 c58143e835f9: Self-connected one-manyfold.

MeitneriumSymbol
type: Class
comment: The symbol that stands for the meitnerium atom.
subclass of: Restriction
  has value: Mt
EMMO 967080e5 2f42 4eb2 a3a9 c58143e835f9: The symbol that stands for the meitnerium atom.

HallCoefficient
type: Class
comment: The relation between electric field strength and current density in an isotropic conductor.
subclass of: Restriction
qudtReference: https://qudt.org/vocab/quantitykind/HallCoefficient
wikidataReference: https://www.wikidata.org/wiki/Q997439
IEVReference: https://www.electropedia.org/iev/iev.nsf/display
ISO80000Reference: 12-19
EMMO 967080e5 2f42 4eb2 a3a9 c58143e835f9: The relation between electric field strength and current density in an isotropic conductor.

SpecificHeatCapacityAtSaturatedVaporPressure
type: Class
comment: Specific heat capacity at saturated vaport pressure.
qudtReference: https://qudt.org/vocab/quantitykind/SpecificHeatCapacityAtSaturation
wikidataReference: https://www.wikidata.org/wiki/Q75775005
ISO80000Reference: 5-16.4
EMMO 967080e5 2f42 4eb2 a3a9 c58143e835f9: Specific heat capacity at saturated vaport pressure.

VolumeFlowRate
type: Class
comment: Quantity equal to the volume dV of substance crossing a given surface during a time interval with infinitesimal duration dt, divided by this duration, thus qV = dV / dt-
subclass of: Restriction
alternative label: VolumetricFlowRate
qudtReference: https://qudt.org/vocab/quantitykind/VolumeFlowRate
wikidataReference: https://www.wikidata.org/wiki/Q1134348
IEVReference: https://www.electropedia.org/iev/iev.nsf/display
ISO80000Reference: 4-31
EMMO 967080e5 2f42 4eb2 a3a9 c58143e835f9: Quantity equal to the volume dV of substance crossing a given surface during a time interval with infinitesimal duration dt, divided by this duration, thus qV = dV / dt-
wikipediaReference: https://en.wikipedia.org/wiki/Volumetric_flow_rate

CarrierLifetime
type: Class
comment: Time constant for recombination or trapping of minority charge carriers in semiconductors
qudtReference: https://qudt.org/vocab/quantitykind/CarrierLifetime
wikidataReference: https://www.wikidata.org/wiki/Q5046374
ISO80000Reference: 12-32.2
EMMO 967080e5 2f42 4eb2 a3a9 c58143e835f9: Time constant for recombination or trapping of minority charge carriers in semiconductors

RadiantEnergy
type: Class
comment: Mean energy, excluding rest energy, of the particles that are emitted, transferred, or received.
wikidataReference: https://www.wikidata.org/wiki/Q1259526
ISO80000Reference: 10-45
EMMO 967080e5 2f42 4eb2 a3a9 c58143e835f9: Mean energy, excluding rest energy, of the particles that are emitted, transferred, or received.

isPropertyFor
type: ObjectProperty

BerylliumSymbol
type: Class
comment: The symbol that stands for the beryllium atom.
subclass of: Restriction
subclass of: Restriction
  has value: Be
EMMO 967080e5 2f42 4eb2 a3a9 c58143e835f9: The symbol that stands for the beryllium atom.

LarmonAngularFrequency
type: Class
comment: Angular frequency of the electron angular momentum vector precession about the axis of an external magnetic field.
ISO80000Reference: 10-15.1
EMMO 967080e5 2f42 4eb2 a3a9 c58143e835f9: Angular frequency of the electron angular momentum vector precession about the axis of an external magnetic field.

MagneticFieldStrength
type: Class
comment: Strength of a magnetic field. Commonly denoted H.
subclass of: Restriction
alternative label: MagnetizingFieldStrength
qudtReference: http://qudt.org/vocab/quantitykind/MagneticFieldStrength
wikidataReference: https://www.wikidata.org/wiki/Q28123
IEVReference: https://www.electropedia.org/iev/iev.nsf/display
ISO80000Reference: 6-25
EMMO 967080e5 2f42 4eb2 a3a9 c58143e835f9: Strength of a magnetic field. Commonly denoted H.
iupacReference: https://doi.org/10.1351/goldbook.M03683

Convergent
type: Class
comment: The superclass for all classes of entities that have a proper parts of the same type φ of the whole, and so that for every two distinct φ proper parts one is part of the other.
EMMO 967080e5 2f42 4eb2 a3a9 c58143e835f9: The superclass for all classes of entities that have a proper parts of the same type φ of the whole, and so that for every two distinct φ proper parts one is part of the other.

Illuminance
type: Class
comment: The total luminous flux incident on a surface, per unit area.
subclass of: Restriction
qudtReference: http://qudt.org/vocab/quantitykind/Illuminance
EMMO 967080e5 2f42 4eb2 a3a9 c58143e835f9: The total luminous flux incident on a surface, per unit area.
iupacReference: https://doi.org/10.1351/goldbook.I02941

GalliumSymbol
type: Class
comment: The symbol that stands for the gallium atom.
subclass of: Restriction
  has value: Ga
EMMO 967080e5 2f42 4eb2 a3a9 c58143e835f9: The symbol that stands for the gallium atom.

KinematicViscosity
type: Class
comment: Quotient of dynamic viscosity and mass density of a fluid.
subclass of: Restriction
qudtReference: https://qudt.org/vocab/quantitykind/KinematicViscosity
wikidataReference: https://www.wikidata.org/wiki/Q15106259
IEVReference: https://www.electropedia.org/iev/iev.nsf/display
ISO80000Reference: 4-25
EMMO 967080e5 2f42 4eb2 a3a9 c58143e835f9: Quotient of dynamic viscosity and mass density of a fluid.
iupacReference: https://doi.org/10.1351/goldbook.K03395

Gradient
type: Class
subclass of: Restriction
  has value: ∇

PlasticModeling
type: Class

MassEnergyTransferCoefficient
type: Class
comment: For ionizing uncharged particles of a given type and energy, the differential quotient of Rtr with respect to l. Where Rtr is the mean energy that is transferred to kinetic energy of charged particles by interactions of the uncharged particles of incident radiant energy R in traversing a distance l in the material of density rho, divided by rho and R
subclass of: Restriction
qudtReference: https://qudt.org/vocab/quantitykind/MassEnergyTransferCoefficient
wikidataReference: https://www.wikidata.org/wiki/Q99714619
IEVReference: https://www.electropedia.org/iev/iev.nsf/display
ISO80000Reference: 10-87
EMMO 967080e5 2f42 4eb2 a3a9 c58143e835f9: For ionizing uncharged particles of a given type and energy, the differential quotient of Rtr with respect to l. Where Rtr is the mean energy that is transferred to kinetic energy of charged particles by interactions of the uncharged particles of incident radiant energy R in traversing a distance l in the material of density rho, divided by rho and R

VoltagePhasor
type: Class
comment: Complex representation of an oscillating voltage.
qudtReference: https://qudt.org/vocab/quantitykind/VoltagePhasor
wikidataReference: https://www.wikidata.org/wiki/Q78514605
ISO80000Reference: 6-50
EMMO 967080e5 2f42 4eb2 a3a9 c58143e835f9: Complex representation of an oscillating voltage.

DisplacementCurrent
type: Class
comment: Scalar quantity equal to the flux of the displacement current density JD through a given directed surface S.
qudtReference: https://qudt.org/vocab/quantitykind/DisplacementCurrent
wikidataReference: https://www.wikidata.org/wiki/Q853178
IEVReference: https://www.electropedia.org/iev/iev.nsf/display
ISO80000Reference: 6-19.1
EMMO 967080e5 2f42 4eb2 a3a9 c58143e835f9: Scalar quantity equal to the flux of the displacement current density JD through a given directed surface S.

StaticFrictionCoefficient
type: Class
comment: Proportionality factor between the maximum magnitude of the tangential component of the static friction force and the magnitude of the normal component of the contact force between two bodies at relative rest with respect to each other.
alternative label: CoefficientOfStaticFriction
alternative label: StaticFrictionFactor
wikidataReference: https://www.wikidata.org/wiki/Q73695673
IEVReference: https://www.electropedia.org/iev/iev.nsf/display
ISO80000Reference: 4-23.1
EMMO 967080e5 2f42 4eb2 a3a9 c58143e835f9: Proportionality factor between the maximum magnitude of the tangential component of the static friction force and the magnitude of the normal component of the contact force between two bodies at relative rest with respect to each other.
EMMO c7b62dd7 063a 4c2a 8504 42f7264ba83f: When it is not necessary to distinguish between dynamic friction factor and static friction factor, the name friction factor may be used for both.

SeebeckCoefficient
type: Class
comment: Measure of voltage induced by change of temperature.
subclass of: Restriction
qudtReference: https://qudt.org/vocab/quantitykind/SeebeckCoefficient
wikidataReference: https://www.wikidata.org/wiki/Q1091448
ISO80000Reference: 12-21
EMMO 967080e5 2f42 4eb2 a3a9 c58143e835f9: Measure of voltage induced by change of temperature.

hasURNValue
type: DatatypeProperty
comment: The owl:dataProperty that provides a serialisation of an EMMO URN data entity.
range: anyURI
EMMO 967080e5 2f42 4eb2 a3a9 c58143e835f9: The owl:dataProperty that provides a serialisation of an EMMO URN data entity.

TotalIonization
type: Class
comment: Quotient of the total mean charge of all positive ions produced by an ionizing charged particle along its entire path and along the paths of any secondary charged particles, and the elementary charge.
qudtReference: https://qudt.org/vocab/quantitykind/TotalIonization
wikidataReference: https://www.wikidata.org/wiki/Q98690787
ISO80000Reference: 10-59
EMMO 967080e5 2f42 4eb2 a3a9 c58143e835f9: Quotient of the total mean charge of all positive ions produced by an ionizing charged particle along its entire path and along the paths of any secondary charged particles, and the elementary charge.

IridiumSymbol
type: Class
comment: The symbol that stands for the iridium atom.
subclass of: Restriction
subclass of: Restriction
  has value: Ir
EMMO 967080e5 2f42 4eb2 a3a9 c58143e835f9: The symbol that stands for the iridium atom.

hasModelledProperty
type: ObjectProperty
comment: Assigns a quantity to an object via a well-defined modelling procedure.
EMMO 967080e5 2f42 4eb2 a3a9 c58143e835f9: Assigns a quantity to an object via a well-defined modelling procedure.

UnintentionalAgency
type: Class
comment: A process that does not have an active participation of an intentional agent driving it.
subclass of: Restriction
EMMO 967080e5 2f42 4eb2 a3a9 c58143e835f9: A process that does not have an active participation of an intentional agent driving it.

BeginTask
type: Class
comment: An initial task of a workflow.
EMMO 967080e5 2f42 4eb2 a3a9 c58143e835f9: An initial task of a workflow.
EMMO c7b62dd7 063a 4c2a 8504 42f7264ba83f: There may be more than one begin task, if they run in parallel.

SuperconductionTransitionTemperature
type: Class
comment: Critical thermodynamic temperature of a superconductor.
qudtReference: https://qudt.org/vocab/quantitykind/SuperconductionTransitionTemperature
wikidataReference: https://www.wikidata.org/wiki/Q106103037
IEVReference: https://www.electropedia.org/iev/iev.nsf/display
ISO80000Reference: 12-35.3
EMMO 967080e5 2f42 4eb2 a3a9 c58143e835f9: Critical thermodynamic temperature of a superconductor.

JosephsonConstant
type: Class
comment: Inverse of the magnetic flux quantum.
comment: The DBpedia definition (http://dbpedia.org/page/Magnetic_flux_quantum) is outdated as May 20, 2019. It is now an exact quantity.
subclass of: Restriction
qudtReference: http://qudt.org/vocab/constant/JosephsonConstant
EMMO 967080e5 2f42 4eb2 a3a9 c58143e835f9: Inverse of the magnetic flux quantum.

MassRatioOfWaterToDryMatter
type: Class
comment: The mass concentration of water at saturation is denoted usat.
comment: Ratio of the mass of water to the mass of dry matter in a given volume of matter.
wikidataReference: https://www.wikidata.org/wiki/Q76378860
IEVReference: https://www.electropedia.org/iev/iev.nsf/display
ISO80000Reference: 5-29
EMMO 967080e5 2f42 4eb2 a3a9 c58143e835f9: Ratio of the mass of water to the mass of dry matter in a given volume of matter.

SpatialSequence
type: Class
comment: A monodimensional arrangement of tiles.
alternative label: Sequence
EMMO 967080e5 2f42 4eb2 a3a9 c58143e835f9: A monodimensional arrangement of tiles.

AngularVelocity
type: Class
comment: Axial vector quantity describing the rotation around an axis, with magnitude ω=|dφ/dt|, where dφ is the plane angle change during the infinitesimal time interval with duration dt, and with direction along the axis for which the rotation is clockwise.
subclass of: Restriction
qudtReference: https://qudt.org/vocab/quantitykind/AngularVelocity
IEVReference: https://www.electropedia.org/iev/iev.nsf/display
dbpediaReference: https://dbpedia.org/page/Angular_velocity
ISO80000Reference: 3-12
EMMO 967080e5 2f42 4eb2 a3a9 c58143e835f9: Axial vector quantity describing the rotation around an axis, with magnitude ω=|dφ/dt|, where dφ is the plane angle change during the infinitesimal time interval with duration dt, and with direction along the axis for which the rotation is clockwise.
wikipediaReference: https://en.wikipedia.org/wiki/Angular_velocity

CatalyticActivity
type: Class
comment: Increase in the rate of reaction of a specified chemical reaction that an enzyme produces in a specific assay system.
subclass of: Restriction
qudtReference: http://qudt.org/vocab/quantitykind/CatalyticActivity
EMMO 967080e5 2f42 4eb2 a3a9 c58143e835f9: Increase in the rate of reaction of a specified chemical reaction that an enzyme produces in a specific assay system.
iupacReference: https://doi.org/10.1351/goldbook.C00881

CopperSymbol
type: Class
comment: The symbol that stands for the copper atom.
subclass of: Restriction
subclass of: Restriction
  has value: Cu
EMMO 967080e5 2f42 4eb2 a3a9 c58143e835f9: The symbol that stands for the copper atom.

CyclotronAngularFrequency
type: Class
comment: Quotient of the product of the electric charge of a particle and the magnitude of the magnetic flux density of the magnetic field, and the particle mass.
qudtReference: https://qudt.org/vocab/quantitykind/CyclotronAngularFrequency
wikidataReference: https://www.wikidata.org/wiki/Q97708211
ISO80000Reference: 10-16
EMMO 967080e5 2f42 4eb2 a3a9 c58143e835f9: Quotient of the product of the electric charge of a particle and the magnitude of the magnetic flux density of the magnetic field, and the particle mass.

RelativeVolumeStrain
type: Class
comment: Quotient of change of volume and original volume.
alternative label: BulkStrain
alternative label: VolumeStrain
qudtReference: https://qudt.org/vocab/quantitykind/VolumeStrain
wikidataReference: https://www.wikidata.org/wiki/Q73432507
IEVReference: https://www.electropedia.org/iev/iev.nsf/display
ISO80000Reference: 4-17.4
EMMO 967080e5 2f42 4eb2 a3a9 c58143e835f9: Quotient of change of volume and original volume.
iupacReference: https://doi.org/10.1351/goldbook.V06648

StandardChemicalPotential
type: Class
comment: The value of the chemical potential under specified standard conditions (in the standard state).
qudtReference: https://qudt.org/vocab/quantitykind/StandardChemicalPotential
wikidataReference: https://www.wikidata.org/wiki/Q89333468
ISO80000Reference: 9-21
EMMO 967080e5 2f42 4eb2 a3a9 c58143e835f9: The value of the chemical potential under specified standard conditions (in the standard state).
iupacReference: https://doi.org/10.1351/goldbook.S05908

StandardAbsoluteActivityOfSolvent
type: Class
comment: For solvent A, standard absolute activity of the pure substance A at the same temperature and at a standard pressure.
wikidataReference: https://www.wikidata.org/wiki/Q89556185
ISO80000Reference: 9-27.3
EMMO 967080e5 2f42 4eb2 a3a9 c58143e835f9: For solvent A, standard absolute activity of the pure substance A at the same temperature and at a standard pressure.

CondensedFormula
type: Class
example: An expression that provides information about the element types that constiture a molecule or a molecular substance and their number, together with simple information about the connectivity of its groups by using parenthesis or by goruping element names according to its molecular structure.

SodiumSymbol
type: Class
comment: The symbol that stands for the sodium atom.
subclass of: Restriction
subclass of: Restriction
  has value: Na
EMMO 967080e5 2f42 4eb2 a3a9 c58143e835f9: The symbol that stands for the sodium atom.

MigrationLength
type: Class
comment: Square root of the migration area, M^2.
qudtReference: https://qudt.org/vocab/quantitykind/MigrationLength
wikidataReference: https://www.wikidata.org/wiki/Q98998318
ISO80000Reference: 10-73.3
EMMO 967080e5 2f42 4eb2 a3a9 c58143e835f9: Square root of the migration area, M^2.

CeramicSintering
type: Class

hasEndTile
type: AsymmetricProperty
type: IrreflexiveProperty
type: ObjectProperty
comment: The relation between the whole and a temporal tile that has only ingoing temporal connections.
alternative label: hasTemporalLast
EMMO 967080e5 2f42 4eb2 a3a9 c58143e835f9: The relation between the whole and a temporal tile that has only ingoing temporal connections.

IodineSymbol
type: Class
comment: The symbol that stands for the iodine atom.
subclass of: Restriction
subclass of: Restriction
  has value: I
EMMO 967080e5 2f42 4eb2 a3a9 c58143e835f9: The symbol that stands for the iodine atom.

RoentgeniumSymbol
type: Class
comment: The symbol that stands for the roentgenium atom.
subclass of: Restriction
subclass of: Restriction
  has value: Rg
EMMO 967080e5 2f42 4eb2 a3a9 c58143e835f9: The symbol that stands for the roentgenium atom.

ExposureRate
type: Class
comment: Time derivative of exposure.
subclass of: Restriction
qudtReference: https://qudt.org/vocab/quantitykind/ExposureRate
wikidataReference: https://www.wikidata.org/wiki/Q99720212
IEVReference: https://www.electropedia.org/iev/iev.nsf/display
ISO80000Reference: 10-89
EMMO 967080e5 2f42 4eb2 a3a9 c58143e835f9: Time derivative of exposure.

TotalCurrentDensity
type: Class
comment: Sum of electric current density and displacement current density.
qudtReference: https://qudt.org/vocab/quantitykind/TotalCurrentDensity
wikidataReference: https://www.wikidata.org/wiki/Q77680811
IEVReference: https://www.electropedia.org/iev/iev.nsf/display
ISO80000Reference: 6-20
EMMO 967080e5 2f42 4eb2 a3a9 c58143e835f9: Sum of electric current density and displacement current density.

ElementaryPhoton
type: Class
comment: A boson with spin of 1 that carries electromagnetism.
EMMO 967080e5 2f42 4eb2 a3a9 c58143e835f9: A boson with spin of 1 that carries electromagnetism.

NobeliumSymbol
type: Class
comment: The symbol that stands for the nobelium atom.
subclass of: Restriction
  has value: No
EMMO 967080e5 2f42 4eb2 a3a9 c58143e835f9: The symbol that stands for the nobelium atom.

Diameter
type: Class
comment: The diameter of a circle or a sphere is twice its radius.
comment: maximal distance of two points of an object, in a given direction or along a straight line passing through the centre.
qudtReference: https://qudt.org/vocab/quantitykind/Diameter
IEVReference: https://www.electropedia.org/iev/iev.nsf/display
dbpediaReference: https://dbpedia.org/page/Diameter
ISO80000Reference: 3-1.5
EMMO 967080e5 2f42 4eb2 a3a9 c58143e835f9: maximal distance of two points of an object, in a given direction or along a straight line passing through the centre.
wikipediaReference: https://en.wikipedia.org/wiki/Diameter

Activity
type: Class
comment: Number dN of spontaneous nuclear transitions or nuclear disintegrations for a radionuclide of amount N produced during a short time interval dt, divided by this time interval.
qudtReference: https://qudt.org/vocab/quantitykind/Activity
wikidataReference: https://www.wikidata.org/wiki/Q317949
IEVReference: https://www.electropedia.org/iev/iev.nsf/display
ISO80000Reference: 10-27
EMMO 967080e5 2f42 4eb2 a3a9 c58143e835f9: Number dN of spontaneous nuclear transitions or nuclear disintegrations for a radionuclide of amount N produced during a short time interval dt, divided by this time interval.
iupacReference: https://goldbook.iupac.org/terms/view/A00114

LossAngle
type: Class
comment: Arctan of the loss factor
qudtReference: https://www.qudt.org/vocab/quantitykind/LossAngle
wikidataReference: https://www.wikidata.org/wiki/Q20820438
IEVReference: https://www.electropedia.org/iev/iev.nsf/display
ISO80000Reference: 6-55
EMMO 967080e5 2f42 4eb2 a3a9 c58143e835f9: Arctan of the loss factor

LinearEnergyTransfer
type: Class
comment: Measure for the energy lost by charged particles per traversed distance, including only interactions up to a given energy.
subclass of: Restriction
qudtReference: https://qudt.org/vocab/quantitykind/LinearEnergyTransfer
wikidataReference: https://www.wikidata.org/wiki/Q1699996
IEVReference: https://www.electropedia.org/iev/iev.nsf/display
ISO80000Reference: 10-85
EMMO 967080e5 2f42 4eb2 a3a9 c58143e835f9: Measure for the energy lost by charged particles per traversed distance, including only interactions up to a given energy.
iupacReference: https://doi.org/10.1351/goldbook.L03550

FiberReinforcePlasticManufacturing
type: Class

Magnetizing
type: Class

InternalConversionFactor
type: Class
comment: Quotient of the number of internal conversion electrons and the number of gamma quanta emitted by the radioactive atom in a given transition, where a conversion electron represents an orbital electron emitted through the radioactive decay.
alternative label: InternalConversionCoefficient
qudtReference: https://qudt.org/vocab/quantitykind/InternalConversionFactor
wikidataReference: https://www.wikidata.org/wiki/Q6047819
IEVReference: https://www.electropedia.org/iev/iev.nsf/display
ISO80000Reference: 10-35
EMMO 967080e5 2f42 4eb2 a3a9 c58143e835f9: Quotient of the number of internal conversion electrons and the number of gamma quanta emitted by the radioactive atom in a given transition, where a conversion electron represents an orbital electron emitted through the radioactive decay.

LossFactor
type: Class
comment: Inverse of the quality factor.
qudtReference: https://qudt.org/vocab/quantitykind/LossFactor
wikidataReference: https://www.wikidata.org/wiki/Q79468728
ISO80000Reference: 6-54
EMMO 967080e5 2f42 4eb2 a3a9 c58143e835f9: Inverse of the quality factor.

MassieuFunction
type: Class
comment: Negative quotient of Helmholtz energy and temperature.
subclass of: Restriction
qudtReference: https://qudt.org/vocab/quantitykind/MassieuFunction
wikidataReference: https://www.wikidata.org/wiki/Q3077625
IEVReference: https://www.electropedia.org/iev/iev.nsf/display
ISO80000Reference: 5-22
EMMO 967080e5 2f42 4eb2 a3a9 c58143e835f9: Negative quotient of Helmholtz energy and temperature.

FranciumSymbol
type: Class
comment: The symbol that stands for the francium atom.
subclass of: Restriction
subclass of: Restriction
  has value: Fr
EMMO 967080e5 2f42 4eb2 a3a9 c58143e835f9: The symbol that stands for the francium atom.

Tortuosity
type: Class
comment: Parameter for diffusion and fluid flow in porous media.
wikidataReference: https://www.wikidata.org/wiki/Q2301683
EMMO 967080e5 2f42 4eb2 a3a9 c58143e835f9: Parameter for diffusion and fluid flow in porous media.

PromethiumSymbol
type: Class
comment: The symbol that stands for the promethium atom.
subclass of: Restriction
subclass of: Restriction
  has value: Pm
EMMO 967080e5 2f42 4eb2 a3a9 c58143e835f9: The symbol that stands for the promethium atom.

OrdinalQuantity
type: Class
comment: "Ordinal quantities, such as Rockwell C hardness, are usually not considered to be part of a system of quantities because they are related to other quantities through empirical relations only." International vocabulary of metrology (VIM)
comment: "Quantity, defined by a conventional measurement procedure, for which a total ordering relation can be established, according to magnitude, with other quantities of the same kind, but for which no algebraic operations among those quantities exist" International vocabulary of metrology (VIM)
example: Hardness Resilience
EMMO 967080e5 2f42 4eb2 a3a9 c58143e835f9: "Quantity, defined by a conventional measurement procedure, for which a total ordering relation can be established, according to magnitude, with other quantities of the same kind, but for which no algebraic operations among those quantities exist" International vocabulary of metrology (VIM)
EMMO bb49844b 45d7 4f0d 8cae 8e552cbc20d6: ordinal quantity

Irradiate
type: Class

HardeningByDrawing
type: Class

hasDescription
type: ObjectProperty
comment: A semiotic relation that connects a declared semiotic object to a description in a declaration process.
EMMO 967080e5 2f42 4eb2 a3a9 c58143e835f9: A semiotic relation that connects a declared semiotic object to a description in a declaration process.

LaserCutting
type: Class

CeramicMaterial
type: Class
comment: An inorganic non-metallic solid made from elements (metals, non-metals, semi-metals like silicon) combined into compounds (oxides, carbides, nitrides) that are typically hard, strong, brittle, corrosion-resistant, and good insulators.
alternative label: Ceramic
EMMO 967080e5 2f42 4eb2 a3a9 c58143e835f9: An inorganic non-metallic solid made from elements (metals, non-metals, semi-metals like silicon) combined into compounds (oxides, carbides, nitrides) that are typically hard, strong, brittle, corrosion-resistant, and good insulators.
EMMO c7b62dd7 063a 4c2a 8504 42f7264ba83f: Ceramic materials are hardened by intense heat and typically used from pottery and tiles to advanced electronics and aerospace parts.

DisplacementVector
type: Class
comment: In condensed matter physics, position vector of an atom or ion relative to its equilibrium position.
qudtReference: https://qudt.org/vocab/quantitykind/DisplacementVectorOfIon
wikidataReference: https://www.wikidata.org/wiki/Q105533558
ISO80000Reference: 12-7.3
EMMO 967080e5 2f42 4eb2 a3a9 c58143e835f9: In condensed matter physics, position vector of an atom or ion relative to its equilibrium position.

HardeningByForging
type: Class

NuclearQuadrupoleMoment
type: Class
comment: z component of the diagonalized tensor of nuclear quadrupole moment, in the quantum state with the nuclear spin in the field direction (z).
subclass of: Restriction
qudtReference: https://qudt.org/vocab/quantitykind/NuclearQuadrupoleMoment
wikidataReference: https://www.wikidata.org/wiki/Q97921226
ISO80000Reference: 10-18
EMMO 967080e5 2f42 4eb2 a3a9 c58143e835f9: z component of the diagonalized tensor of nuclear quadrupole moment, in the quantum state with the nuclear spin in the field direction (z).

CouplingFactor
type: Class
comment: Ratio of the absolute value of the mutual permeance related to two circuit elements to the geometric average of their self-permeances.
alternative label: InductiveCouplingFactor
wikidataReference: https://www.wikidata.org/wiki/Q78101715
IEVReference: https://www.electropedia.org/iev/iev.nsf/display
ISO80000Reference: 6-42.1
EMMO 967080e5 2f42 4eb2 a3a9 c58143e835f9: Ratio of the absolute value of the mutual permeance related to two circuit elements to the geometric average of their self-permeances.

AstatineSymbol
type: Class
comment: The symbol that stands for the astatine atom.
subclass of: Restriction
  has value: At
EMMO 967080e5 2f42 4eb2 a3a9 c58143e835f9: The symbol that stands for the astatine atom.

ComplexPower
type: Class
comment: Voltage phasor multiplied by complex conjugate of the current phasor.
alternative label: ComplexApparentPower
qudtReference: https://qudt.org/vocab/quantitykind/ComplexPower
wikidataReference: https://www.wikidata.org/wiki/Q65239736
IEVReference: https://www.electropedia.org/iev/iev.nsf/display
ISO80000Reference: 6-59
EMMO 967080e5 2f42 4eb2 a3a9 c58143e835f9: Voltage phasor multiplied by complex conjugate of the current phasor.

Join
type: Class
comment: A tessellation in which a tile is next for two or more non spatially connected tiles.
EMMO 967080e5 2f42 4eb2 a3a9 c58143e835f9: A tessellation in which a tile is next for two or more non spatially connected tiles.

Calendering
type: Class

wikipediaReference
type: AnnotationProperty
comment: URL to corresponding Wikipedia entry.
range: anyURI
sub property of: seeAlso
EMMO 967080e5 2f42 4eb2 a3a9 c58143e835f9: URL to corresponding Wikipedia entry.

Spin
type: Class
comment: Vector quantity expressing the internal angular momentum of a particle or a particle system.
qudtReference: https://qudt.org/vocab/quantitykind/Spin
wikidataReference: https://www.wikidata.org/wiki/Q133673
IEVReference: https://www.electropedia.org/iev/iev.nsf/display
ISO80000Reference: 10-10
EMMO 967080e5 2f42 4eb2 a3a9 c58143e835f9: Vector quantity expressing the internal angular momentum of a particle or a particle system.

ModulusOfRigidity
type: Class
comment: Ratio of shear stress to the shear strain.
subclass of: Restriction
alternative label: ShearModulus
qudtReference: https://qudt.org/vocab/quantitykind/ShearModulus
wikidataReference: https://www.wikidata.org/wiki/Q461466
IEVReference: https://www.electropedia.org/iev/iev.nsf/display
ISO80000Reference: 4-19.2
EMMO 967080e5 2f42 4eb2 a3a9 c58143e835f9: Ratio of shear stress to the shear strain.
iupacReference: https://doi.org/10.1351/goldbook.S05635

VolumicCrossSection
type: Class
comment: In nuclear physics, product of the number density of atoms of a given type and the cross section.
subclass of: Restriction
alternative label: MacroscopicCrossSection
qudtReference: https://qudt.org/vocab/quantitykind/MacroscopicCrossSection
wikidataReference: https://www.wikidata.org/wiki/Q98280520
ISO80000Reference: 10-42.1
EMMO 967080e5 2f42 4eb2 a3a9 c58143e835f9: In nuclear physics, product of the number density of atoms of a given type and the cross section.
iupacReference: https://doi.org/10.1351/goldbook.M03674

CuriumSymbol
type: Class
comment: The symbol that stands for the curium atom.
subclass of: Restriction
subclass of: Restriction
  has value: Cm
EMMO 967080e5 2f42 4eb2 a3a9 c58143e835f9: The symbol that stands for the curium atom.

Extrusion
type: Class

EnergyFluence
type: Class
comment: In nuclear physics, incident radiant energy per cross-sectional area.
subclass of: Restriction
qudtReference: https://qudt.org/vocab/quantitykind/EnergyFluence
wikidataReference: https://www.wikidata.org/wiki/Q98538612
IEVReference: https://www.electropedia.org/iev/iev.nsf/display
ISO80000Reference: 10-46
EMMO 967080e5 2f42 4eb2 a3a9 c58143e835f9: In nuclear physics, incident radiant energy per cross-sectional area.

HafniumSymbol
type: Class
comment: The symbol that stands for the hafnium atom.
subclass of: Restriction
subclass of: Restriction
  has value: Hf
EMMO 967080e5 2f42 4eb2 a3a9 c58143e835f9: The symbol that stands for the hafnium atom.

MassFractionOfWater
type: Class
comment: Quantity of dimension 1 equal to u/(1 + u), where u is mass ratio of water to dry matter.
qudtReference: https://qudt.org/vocab/quantitykind/MassFractionOfWater
wikidataReference: https://www.wikidata.org/wiki/Q76379025
IEVReference: https://www.electropedia.org/iev/iev.nsf/display
ISO80000Reference: 5-31
EMMO 967080e5 2f42 4eb2 a3a9 c58143e835f9: Quantity of dimension 1 equal to u/(1 + u), where u is mass ratio of water to dry matter.

FastFissionFactor
type: Class
comment: In an infinite medium, the ratio of the mean number of neutrons produced by fission due to neutrons of all energies to the mean number of neutrons produced by fissions due to thermal neutrons only.
qudtReference: https://qudt.org/vocab/quantitykind/FastFissionFactor
wikidataReference: https://www.wikidata.org/wiki/Q99197493
ISO80000Reference: 10-75
EMMO 967080e5 2f42 4eb2 a3a9 c58143e835f9: In an infinite medium, the ratio of the mean number of neutrons produced by fission due to neutrons of all energies to the mean number of neutrons produced by fissions due to thermal neutrons only.

VolumicTotalCrossSection
type: Class
comment: Product of the number density na of the atoms and the cross section σ_tot for a given type of atoms.
subclass of: Restriction
alternative label: MacroscopicTotalCrossSection
qudtReference: https://qudt.org/vocab/quantitykind/MacroscopicTotalCrossSection
wikidataReference: https://www.wikidata.org/wiki/Q98280548
ISO80000Reference: 10-42.2
EMMO 967080e5 2f42 4eb2 a3a9 c58143e835f9: Product of the number density na of the atoms and the cross section σ_tot for a given type of atoms.

StoichiometricNumberOfSubstance
type: Class
comment: For substance B, an integer number or a simple fraction, being negative for a reactant and positive for a product, occurring in the expression for a chemical reaction.
example: The factors 1/2 and 3/2 in the chemical reaction formula below are stoicheiometric mumbers of substance. (1/2)N2 + (3/2)H2 = NH3
qudtReference: https://qudt.org/vocab/quantitykind/StoichiometricNumber
wikidataReference: https://www.wikidata.org/wiki/Q95443720
IEVReference: https://www.electropedia.org/iev/iev.nsf/display
ISO80000Reference: 9-29
EMMO 967080e5 2f42 4eb2 a3a9 c58143e835f9: For substance B, an integer number or a simple fraction, being negative for a reactant and positive for a product, occurring in the expression for a chemical reaction.
iupacReference: https://doi.org/10.1351/goldbook.S06025

ElectronCharge
type: Class
comment: The charge of an electron.
comment: The negative of ElementaryCharge.
EMMO 70fe84ff 99b6 4206 a9fc 9a8931836d84: The charge of an electron.
EMMO 967080e5 2f42 4eb2 a3a9 c58143e835f9: The negative of ElementaryCharge.
iupacReference: https://doi.org/10.1351/goldbook.E01982

MultiplicationFactor
type: Class
comment: Quotient of the total number of fission or fission-dependent neutrons produced in the duration of a time interval and the total number of neutrons lost by absorption and leakage in that duration.
qudtReference: https://qudt.org/vocab/quantitykind/MultiplicationFactor
wikidataReference: https://www.wikidata.org/wiki/Q99440471
ISO80000Reference: 10-78.1
EMMO 967080e5 2f42 4eb2 a3a9 c58143e835f9: Quotient of the total number of fission or fission-dependent neutrons produced in the duration of a time interval and the total number of neutrons lost by absorption and leakage in that duration.

isContributedBy
type: AsymmetricProperty
type: IrreflexiveProperty
type: ObjectProperty

MolarEntropy
type: Class
comment: Entropy per amount of substance.
subclass of: Restriction
qudtReference: https://qudt.org/vocab/quantitykind/MolarEntropy
wikidataReference: https://www.wikidata.org/wiki/Q68972876
ISO80000Reference: 9-8
EMMO 967080e5 2f42 4eb2 a3a9 c58143e835f9: Entropy per amount of substance.

RutherfordiumSymbol
type: Class
comment: The symbol that stands for the rutherfordium atom.
subclass of: Restriction
  has value: Rf
EMMO 967080e5 2f42 4eb2 a3a9 c58143e835f9: The symbol that stands for the rutherfordium atom.

MoscoviumSymbol
type: Class
comment: The symbol that stands for the moscovium atom.
subclass of: Restriction
subclass of: Restriction
  has value: Mc
EMMO 967080e5 2f42 4eb2 a3a9 c58143e835f9: The symbol that stands for the moscovium atom.

TelluriumSymbol
type: Class
comment: The symbol that stands for the tellurium atom.
subclass of: Restriction
  has value: Te
EMMO 967080e5 2f42 4eb2 a3a9 c58143e835f9: The symbol that stands for the tellurium atom.

SeleniumSymbol
type: Class
comment: The symbol that stands for the selenium atom.
subclass of: Restriction
  has value: Se
EMMO 967080e5 2f42 4eb2 a3a9 c58143e835f9: The symbol that stands for the selenium atom.

DoseEquivalentQualityFactor
type: Class
comment: Factor taking into account health effects in the determination of the dose equivalent.
qudtReference: https://qudt.org/vocab/quantitykind/DoseEquivalentQualityFactor
wikidataReference: https://www.wikidata.org/wiki/Q2122099
IEVReference: https://www.electropedia.org/iev/iev.nsf/display
ISO80000Reference: 10-82
EMMO 967080e5 2f42 4eb2 a3a9 c58143e835f9: Factor taking into account health effects in the determination of the dose equivalent.

DrawForms
type: Class

isPartakenBy
type: AsymmetricProperty
type: IrreflexiveProperty
type: ObjectProperty
comment: The relation between an object O1 that through overlaps an object O2.
EMMO 967080e5 2f42 4eb2 a3a9 c58143e835f9: The relation between an object O1 that through overlaps an object O2.

RadonSymbol
type: Class
comment: The symbol that stands for the radon atom.
subclass of: Restriction
  has value: Rn
EMMO 967080e5 2f42 4eb2 a3a9 c58143e835f9: The symbol that stands for the radon atom.

StandaloneModelSimulation
type: Class
comment: A standalone simulation, where a single physics equation is solved.
EMMO 967080e5 2f42 4eb2 a3a9 c58143e835f9: A standalone simulation, where a single physics equation is solved.

Stress
type: Class
comment: Force per unit oriented surface area .
comment: Measure of the internal forces that neighboring particles of a continuous material exert on each other.
subclass of: Restriction
qudtReference: http://qudt.org/vocab/quantitykind/Stress
ISO80000Reference: 4-15
EMMO 967080e5 2f42 4eb2 a3a9 c58143e835f9: Measure of the internal forces that neighboring particles of a continuous material exert on each other.

Parameter
type: Class
comment: A variable whose value is assumed to be known independently from the equation, but whose value is not explicitated in the equation.
example: Viscosity in the Navier-Stokes equation

RelativeMassDefect
type: Class
comment: Quotient of mass defect and the unified atomic mass constant.
qudtReference: https://qudt.org/vocab/quantitykind/RelativeMassDefect
wikidataReference: https://www.wikidata.org/wiki/Q98038718
ISO80000Reference: 10-22.2
EMMO 967080e5 2f42 4eb2 a3a9 c58143e835f9: Quotient of mass defect and the unified atomic mass constant.

hasCharacterised
type: ObjectProperty

CASRN
type: Class
comment: Chemical Abstact Service registry number for a chemical substance from the American Chemical Society
example: Water is 7732-18-5
EMMO 967080e5 2f42 4eb2 a3a9 c58143e835f9: Chemical Abstact Service registry number for a chemical substance from the American Chemical Society

Exposure
type: Class
comment: Absolute value of the electric charge of ions produced in dry air by X- or gamma radiation per mass of air.
subclass of: Restriction
qudtReference: https://qudt.org/vocab/quantitykind/Exposure
wikidataReference: https://www.wikidata.org/wiki/Q336938
IEVReference: https://www.electropedia.org/iev/iev.nsf/display
ISO80000Reference: 10-88
EMMO 967080e5 2f42 4eb2 a3a9 c58143e835f9: Absolute value of the electric charge of ions produced in dry air by X- or gamma radiation per mass of air.

PorcelainOrCeramicCasting
type: Class

MaximumBetaParticleEnergy
type: Class
comment: Maximum kinetic energy of the emitted beta particle produced in the nuclear disintegration process.
qudtReference: https://qudt.org/vocab/quantitykind/MaximumBeta-ParticleEnergy
wikidataReference: https://www.wikidata.org/wiki/Q98148038
ISO80000Reference: 10-33
EMMO 967080e5 2f42 4eb2 a3a9 c58143e835f9: Maximum kinetic energy of the emitted beta particle produced in the nuclear disintegration process.

StandardAbsoluteActivityOfSolution
type: Class
comment: Property of a solute in a solution.
alternative label: StandardAbsoluteActivity
wikidataReference: https://www.wikidata.org/wiki/Q89485936
ISO80000Reference: 9-26
EMMO 967080e5 2f42 4eb2 a3a9 c58143e835f9: Property of a solute in a solution.

Riveting
type: Class

NeutronYieldPerAbsorption
type: Class
comment: Average number of fission neutrons, both prompt and delayed, emitted per neutron absorbed in a fissionable nuclide or in a nuclear fuel, as specified.
qudtReference: https://qudt.org/vocab/quantitykind/NeutronYieldPerAbsorption
wikidataReference: https://www.wikidata.org/wiki/Q99159075
ISO80000Reference: 10-74.2
EMMO 967080e5 2f42 4eb2 a3a9 c58143e835f9: Average number of fission neutrons, both prompt and delayed, emitted per neutron absorbed in a fissionable nuclide or in a nuclear fuel, as specified.

KermaRate
type: Class
comment: Time derivative of kerma.
subclass of: Restriction
qudtReference: https://qudt.org/vocab/quantitykind/KermaRate
wikidataReference: https://www.wikidata.org/wiki/Q99713105
IEVReference: https://www.electropedia.org/iev/iev.nsf/display
ISO80000Reference: 10-86.2
EMMO 967080e5 2f42 4eb2 a3a9 c58143e835f9: Time derivative of kerma.

Curvature
type: Class
comment: Inverse of the radius of curvature.
qudtReference: https://qudt.org/vocab/quantitykind/CurvatureFromRadius
wikidataReference: https://www.wikidata.org/wiki/Q214881
IEVReference: https://www.electropedia.org/iev/iev.nsf/display
dbpediaReference: https://dbpedia.org/page/Curvature
ISO80000Reference: 3-2
EMMO 967080e5 2f42 4eb2 a3a9 c58143e835f9: Inverse of the radius of curvature.

ComptonWavelength
type: Class
comment: Quotient of the Planck constant and the product of the mass of the particle and the speed of light in vacuum.
qudtReference: https://qudt.org/vocab/constant/ComptonWavelength
wikidataReference: https://www.wikidata.org/wiki/Q1145377
ISO80000Reference: 10-20
EMMO 967080e5 2f42 4eb2 a3a9 c58143e835f9: Quotient of the Planck constant and the product of the mass of the particle and the speed of light in vacuum.
wikipediaReference: https://en.wikipedia.org/wiki/Compton_wavelength

Assignment
type: Class
comment: A estimation of a property by a criteria based on the pre-existing knowledge of the estimator.
example: The Argon gas in my bottle has ionisation energy of 15.7596 eV. This is not measured but assigned to this material by previous knowledge.
EMMO 967080e5 2f42 4eb2 a3a9 c58143e835f9: A estimation of a property by a criteria based on the pre-existing knowledge of the estimator.

BariumSymbol
type: Class
comment: The symbol that stands for the barium atom.
subclass of: Restriction
subclass of: Restriction
  has value: Ba
EMMO 967080e5 2f42 4eb2 a3a9 c58143e835f9: The symbol that stands for the barium atom.

AssemblyLine
type: Class
comment: A manufacturing process in which interchangeable parts are added to a product in a sequential manner to create an end product.
comment: Is not collection, since the connection between the elements of an assembly line occurs through the flow of objects that are processed.
EMMO 967080e5 2f42 4eb2 a3a9 c58143e835f9: A manufacturing process in which interchangeable parts are added to a product in a sequential manner to create an end product.

MeanLinearRange
type: Class
comment: Mean total rectified path length travelled by a particle in the course of slowing down to rest in a given material averaged over a group of particles having the same initial energy.
qudtReference: https://qudt.org/vocab/quantitykind/MeanLinearRange
wikidataReference: https://www.wikidata.org/wiki/Q98681589
ISO80000Reference: 10-56
EMMO 967080e5 2f42 4eb2 a3a9 c58143e835f9: Mean total rectified path length travelled by a particle in the course of slowing down to rest in a given material averaged over a group of particles having the same initial energy.
iupacReference: https://doi.org/10.1351/goldbook.M03782

LiquidFoam
type: Class
comment: A foam of trapped gas in a liquid.
EMMO 967080e5 2f42 4eb2 a3a9 c58143e835f9: A foam of trapped gas in a liquid.

FiberboardManufacturing
type: Class

LinearMassDensity
type: Class
comment: Mass per length.
subclass of: Restriction
alternative label: LinearDensity
alternative label: LineicMass
qudtReference: https://qudt.org/vocab/quantitykind/LinearDensity
wikidataReference: https://www.wikidata.org/wiki/Q56298294
IEVReference: https://www.electropedia.org/iev/iev.nsf/display
ISO80000Reference: 4-6
EMMO 967080e5 2f42 4eb2 a3a9 c58143e835f9: Mass per length.

InChI
type: Class
comment: The International Chemical Identifier (InChI) textual identifier proposed by IUPAC to provide a standard encoding for databases of molecular information.
EMMO 967080e5 2f42 4eb2 a3a9 c58143e835f9: The International Chemical Identifier (InChI) textual identifier proposed by IUPAC to provide a standard encoding for databases of molecular information.

Sphere
type: Class
comment: A standard 2-manifold with no unconnected boundaries.
EMMO 967080e5 2f42 4eb2 a3a9 c58143e835f9: A standard 2-manifold with no unconnected boundaries.

FineStructureConstant
type: Class
comment: A fundamental physical constant characterizing the strength of the electromagnetic interaction between elementary charged particles.
qudtReference: http://qudt.org/vocab/constant/FineStructureConstant
EMMO 967080e5 2f42 4eb2 a3a9 c58143e835f9: A fundamental physical constant characterizing the strength of the electromagnetic interaction between elementary charged particles.
iupacReference: https://doi.org/10.1351/goldbook.F02389

ThermalResistance
type: Class
comment: The name “thermal resistance” and the symbol R are used in building technology to designate thermal insulance.
comment: Thermodynamic temperature difference divided by heat flow rate.
subclass of: Restriction
qudtReference: https://qudt.org/vocab/quantitykind/ThermalResistance
wikidataReference: https://www.wikidata.org/wiki/Q899628
IEVReference: https://www.electropedia.org/iev/iev.nsf/display
ISO80000Reference: 5-12
EMMO 967080e5 2f42 4eb2 a3a9 c58143e835f9: Thermodynamic temperature difference divided by heat flow rate.

ReactivePower
type: Class
comment: Imaginary part of the complex power.
qudtReference: https://qudt.org/vocab/quantitykind/ReactivePower
wikidataReference: https://www.wikidata.org/wiki/Q2144613
IEVReference: https://www.electropedia.org/iev/iev.nsf/display
ISO80000Reference: 6-60
EMMO 967080e5 2f42 4eb2 a3a9 c58143e835f9: Imaginary part of the complex power.

hasPrefixSymbol
type: DatatypeProperty
comment: Relates a SI prefixed unit to the prefix symbol.
range: string
deprecated: true
EMMO 967080e5 2f42 4eb2 a3a9 c58143e835f9: Relates a SI prefixed unit to the prefix symbol.

CanonicalPartitionFunction
type: Class
comment: Sum over quantum states of energy in a system in equilibrium.
qudtReference: https://qudt.org/vocab/quantitykind/CanonicalPartitionFunction
wikidataReference: https://www.wikidata.org/wiki/Q96142389
ISO80000Reference: 9-35.2
EMMO 967080e5 2f42 4eb2 a3a9 c58143e835f9: Sum over quantum states of energy in a system in equilibrium.
EMMO c7b62dd7 063a 4c2a 8504 42f7264ba83f: In physics, a partition function describes the statistical properties of a system in thermodynamic equilibrium. Partition functions are functions of the thermodynamic state variables, such as the temperature and volume. Most of the aggregate thermodynamic variables of the system, such as the total energy, free energy, entropy, and pressure, can be expressed in terms of the partition function or its derivatives. The partition function is dimensionless.

MaterialByForceResponse
type: Class

VectorData
type: Class
comment: The datatype for monodimensional arrays.
EMMO 8a137e9f 579c 4e28 baca e8980eb0c3db: SubClassOf: hasSpatialTile some ScalarData
EMMO 967080e5 2f42 4eb2 a3a9 c58143e835f9: The datatype for monodimensional arrays.

IonTransportNumber
type: Class
comment: Faction of electrical current carried by given ionic species.
alternative label: CurrentFraction
alternative label: TransferrenceNumber
qudtReference: https://qudt.org/vocab/quantitykind/IonTransportNumber
wikidataReference: https://www.wikidata.org/wiki/Q331854
ISO80000Reference: 9-46
EMMO 967080e5 2f42 4eb2 a3a9 c58143e835f9: Faction of electrical current carried by given ionic species.
iupacReference: https://doi.org/10.1351/goldbook.I03181
iupacReference: https://doi.org/10.1351/goldbook.T06489

BurgersVector
type: Class
comment: Vector characterising a dislocation in a crystal lattice.
subclass of: Restriction
qudtReference: https://qudt.org/vocab/quantitykind/BurgersVector
wikidataReference: https://www.wikidata.org/wiki/Q623093
ISO80000Reference: 12-6
EMMO 967080e5 2f42 4eb2 a3a9 c58143e835f9: Vector characterising a dislocation in a crystal lattice.

NewtonianConstantOfGravity
type: Class
comment: Physical constant in Newton's law of gravitation and in Einstein's general theory of relativity.
subclass of: Restriction
qudtReference: http://qudt.org/vocab/constant/NewtonianConstantOfGravitation
EMMO 967080e5 2f42 4eb2 a3a9 c58143e835f9: Physical constant in Newton's law of gravitation and in Einstein's general theory of relativity.
iupacReference: https://doi.org/10.1351/goldbook.G02695

Assigned
type: Class
comment: An estimated that has been assigned by an agent.
example: Input parameter to a model that has been assigned by a modeller (agent).
EMMO 967080e5 2f42 4eb2 a3a9 c58143e835f9: An estimated that has been assigned by an agent.

GrueneisenParamter
type: Class
comment: Describes the effect that changing the volume of a crystal lattice has on its vibrational properties, and, as a consequence, the effect that changing temperature has on the size or dynamics of the lattice.
wikidataReference: https://www.wikidata.org/wiki/Q444656
ISO80000Reference: 12-14
EMMO 967080e5 2f42 4eb2 a3a9 c58143e835f9: Describes the effect that changing the volume of a crystal lattice has on its vibrational properties, and, as a consequence, the effect that changing temperature has on the size or dynamics of the lattice.

Cementing
type: Class

MassNumber
type: Class
comment: Number of nucleons in an atomic nucleus.
subclass of: Restriction
alternative label: AtomicMassNumber
alternative label: NucleonNumber
qudtReference: http://qudt.org/vocab/quantitykind/MassNumber
EMMO 967080e5 2f42 4eb2 a3a9 c58143e835f9: Number of nucleons in an atomic nucleus.

NuclearRadius
type: Class
comment: Conventional radius of sphere in which the nuclear matter is included,
qudtReference: https://qudt.org/vocab/quantitykind/NuclearRadius
wikidataReference: https://www.wikidata.org/wiki/Q3535676
ISO80000Reference: 10-19.1
EMMO 967080e5 2f42 4eb2 a3a9 c58143e835f9: Conventional radius of sphere in which the nuclear matter is included,

ScalarData
type: Class
comment: A symbolic data that is not array data.
EMMO 967080e5 2f42 4eb2 a3a9 c58143e835f9: A symbolic data that is not array data.
EMMO c7b62dd7 063a 4c2a 8504 42f7264ba83f: Scalar data are primitive symbolic data that are not built up of other types of symbolic data.

AverageEnergyLossPerElementaryChargeProduced
type: Class
comment: Quotient of the initial kinetic energy Ek of an ionizing charged particle and the total ionization Ni produced by that particle.
qudtReference: https://qudt.org/vocab/quantitykind/AverageEnergyLossPerElementaryChargeProduced
wikidataReference: https://www.wikidata.org/wiki/Q98793042
ISO80000Reference: 10-60
EMMO 967080e5 2f42 4eb2 a3a9 c58143e835f9: Quotient of the initial kinetic energy Ek of an ionizing charged particle and the total ionization Ni produced by that particle.

RhodiumSymbol
type: Class
comment: The symbol that stands for the rhodium atom.
subclass of: Restriction
  has value: Rh
EMMO 967080e5 2f42 4eb2 a3a9 c58143e835f9: The symbol that stands for the rhodium atom.

VacuumMagneticPermeability
type: Class
comment: The DBpedia and UIPAC Gold Book definitions (http://dbpedia.org/page/Vacuum_permeability, https://doi.org/10.1351/goldbook.P04504) are outdated since May 20, 2019. It is now a measured constant.
comment: The value of magnetic permeability in a classical vacuum.
alternative label: PermeabilityOfVacuum
qudtReference: http://qudt.org/vocab/constant/ElectromagneticPermeabilityOfVacuum
ISO80000Reference: 6-26.1
EMMO 967080e5 2f42 4eb2 a3a9 c58143e835f9: The value of magnetic permeability in a classical vacuum.

TotalAngularMomentum
type: Class
comment: Vector quantity in a quantum system composed of the vectorial sum of angular momentum L and spin s.
qudtReference: https://qudt.org/vocab/quantitykind/TotalAngularMomentum
wikidataReference: https://www.wikidata.org/wiki/Q97496506
ISO80000Reference: 10-11
EMMO 967080e5 2f42 4eb2 a3a9 c58143e835f9: Vector quantity in a quantum system composed of the vectorial sum of angular momentum L and spin s.

MassConcentrationOfWaterVapour
type: Class
comment: Quotient of the mass of water vapour in moist gas by the total gas volume.
comment: The mass concentration of water at saturation is denoted vsat.
qudtReference: https://qudt.org/vocab/quantitykind/MassConcentrationOfWaterVapour
wikidataReference: https://www.wikidata.org/wiki/Q76378808
IEVReference: https://www.electropedia.org/iev/iev.nsf/display
EMMO 967080e5 2f42 4eb2 a3a9 c58143e835f9: Quotient of the mass of water vapour in moist gas by the total gas volume.

PeltierCoefficient
type: Class
comment: Quotient of Peltier heat power developed at a junction, and the electric current flowing from substance a to substance b.
subclass of: Restriction
qudtReference: https://qudt.org/vocab/quantitykind/PeltierCoefficient
wikidataReference: https://www.wikidata.org/wiki/Q105801003
ISO80000Reference: 12-22
EMMO 967080e5 2f42 4eb2 a3a9 c58143e835f9: Quotient of Peltier heat power developed at a junction, and the electric current flowing from substance a to substance b.

RotationalDisplacement
type: Class
comment: Quotient of the traversed circular path length of a point in space during a rotation and its distance from the axis or centre of rotation.
alternative label: AngularDisplacement
wikidataReference: https://www.wikidata.org/wiki/Q3305038
ISO80000Reference: 3-6
EMMO 967080e5 2f42 4eb2 a3a9 c58143e835f9: Quotient of the traversed circular path length of a point in space during a rotation and its distance from the axis or centre of rotation.
wikipediaReference: https://en.wikipedia.org/wiki/Angular_displacement

HolmiumSymbol
type: Class
comment: The symbol that stands for the holmium atom.
subclass of: Restriction
  has value: Ho
EMMO 967080e5 2f42 4eb2 a3a9 c58143e835f9: The symbol that stands for the holmium atom.

Permeance
type: Class
comment: Inverse of the reluctance.
subclass of: Restriction
qudtReference: https://qudt.org/vocab/quantitykind/Permeance
wikidataReference: https://www.wikidata.org/wiki/Q77997985
IEVReference: https://www.electropedia.org/iev/iev.nsf/display
ISO80000Reference: 6-40
EMMO 967080e5 2f42 4eb2 a3a9 c58143e835f9: Inverse of the reluctance.

SpecificGibbsEnergy
type: Class
comment: Gibbs energy per unit mass.
qudtReference: https://qudt.org/vocab/quantitykind/SpecificGibbsEnergy
wikidataReference: https://www.wikidata.org/wiki/Q76360636
ISO80000Reference: 5-21.5
EMMO 967080e5 2f42 4eb2 a3a9 c58143e835f9: Gibbs energy per unit mass.

hasFractionalCollection
type: ObjectProperty
comment: A sub collection realtion where the proper part is cutting members of the collection.
EMMO 967080e5 2f42 4eb2 a3a9 c58143e835f9: A sub collection realtion where the proper part is cutting members of the collection.

CentrifugalCasting
type: Class

FlameCutting
type: Class

PlasmaCutting
type: Class

LuminousFlux
type: Class
comment: Perceived power of light.
subclass of: Restriction
qudtReference: http://qudt.org/vocab/quantitykind/LuminousFlux
ISO80000Reference: 7-13
EMMO 967080e5 2f42 4eb2 a3a9 c58143e835f9: Perceived power of light.
iupacReference: https://doi.org/10.1351/goldbook.L03646

ExtentOfReaction
type: Class
comment: Difference between equilibrium and initial amount of a substance, divided by its stoichiometric number.
subclass of: Restriction
qudtReference: https://qudt.org/vocab/quantitykind/ExtentOfReaction
wikidataReference: https://www.wikidata.org/wiki/Q899046
ISO80000Reference: 9-31
EMMO 967080e5 2f42 4eb2 a3a9 c58143e835f9: Difference between equilibrium and initial amount of a substance, divided by its stoichiometric number.
iupacReference: https://doi.org/10.1351/goldbook.E02283

GibbsEnergy
type: Class
comment: Type of thermodynamic potential; useful for calculating reversible work in certain systems.
alternative label: GibbsFreeEnergy
wikidataReference: https://www.wikidata.org/wiki/Q334631
IEVReference: https://www.electropedia.org/iev/iev.nsf/display
ISO80000Reference: 5-20.5
EMMO 967080e5 2f42 4eb2 a3a9 c58143e835f9: Type of thermodynamic potential; useful for calculating reversible work in certain systems.
iupacReference: https://doi.org/10.1351/goldbook.G02629

Acceleration
type: Class
comment: Derivative of velocity with respect to time.
subclass of: Restriction
qudtReference: http://qudt.org/vocab/quantitykind/Acceleration
ISO80000Reference: 3-9.1
EMMO 967080e5 2f42 4eb2 a3a9 c58143e835f9: Derivative of velocity with respect to time.
iupacReference: https://doi.org/10.1351/goldbook.A00051

ThermodynamicEfficiency
type: Class
comment: Performance measure of a device that uses thermal energy, expressed as the ratio of work done over thermal energy used.
alternative label: ThermalEfficiency
qudtReference: https://qudt.org/vocab/quantitykind/ThermalEfficiency
wikidataReference: https://www.wikidata.org/wiki/Q1452104
ISO80000Reference: 5-25.1
EMMO 967080e5 2f42 4eb2 a3a9 c58143e835f9: Performance measure of a device that uses thermal energy, expressed as the ratio of work done over thermal energy used.

Dust
type: Class
comment: A suspension of fine particles in the atmosphere.
EMMO 967080e5 2f42 4eb2 a3a9 c58143e835f9: A suspension of fine particles in the atmosphere.

RadiantFlux
type: Class
comment: The radiant energy emitted, reflected, transmitted or received, per unit time.
qudtReference: http://qudt.org/vocab/quantitykind/RadiantFlux
EMMO 967080e5 2f42 4eb2 a3a9 c58143e835f9: The radiant energy emitted, reflected, transmitted or received, per unit time.
iupacReference: https://doi.org/10.1351/goldbook.R05046

MolybdenumSymbol
type: Class
comment: The symbol that stands for the molybdenum atom.
subclass of: Restriction
  has value: Mo
EMMO 967080e5 2f42 4eb2 a3a9 c58143e835f9: The symbol that stands for the molybdenum atom.

Width
type: Class
comment: Length in a given direction regarded as horizontal.
comment: The terms breadth and width are often used by convention, as distinguished from length and from height or thickness.
alternative label: Breadth
qudtReference: https://qudt.org/vocab/quantitykind/Width
wikidataReference: https://www.wikidata.org/wiki/Q35059
IEVReference: https://www.electropedia.org/iev/iev.nsf/display
ISO80000Reference: 3-1.2
EMMO 967080e5 2f42 4eb2 a3a9 c58143e835f9: Length in a given direction regarded as horizontal.

PlatinumSymbol
type: Class
comment: The symbol that stands for the platinum atom.
subclass of: Restriction
subclass of: Restriction
  has value: Pt
EMMO 967080e5 2f42 4eb2 a3a9 c58143e835f9: The symbol that stands for the platinum atom.

MagneticSusceptibility
type: Class
comment: Scalar or tensor quantity the product of which by the magnetic constant μ0 and by the magnetic field strength H is equal to the magnetic polarization J.
qudtReference: https://qudt.org/vocab/unit/SUSCEPTIBILITY_MAG.html
wikidataReference: https://www.wikidata.org/wiki/Q691463
IEVReference: https://www.electropedia.org/iev/iev.nsf/display
ISO80000Reference: 6-28
EMMO 967080e5 2f42 4eb2 a3a9 c58143e835f9: Scalar or tensor quantity the product of which by the magnetic constant μ0 and by the magnetic field strength H is equal to the magnetic polarization J.

OganessonSymbol
type: Class
comment: The symbol that stands for the oganesson atom.
subclass of: Restriction
  has value: Og
EMMO 967080e5 2f42 4eb2 a3a9 c58143e835f9: The symbol that stands for the oganesson atom.

ExchangeIntegral
type: Class
comment: constituent of the interaction energy between the spins of adjacent electrons in matter arising from the overlap of electron state functions
qudtReference: https://qudt.org/vocab/quantitykind/ExchangeIntegral
wikidataReference: https://www.wikidata.org/wiki/Q10882959
ISO80000Reference: 12-34
EMMO 967080e5 2f42 4eb2 a3a9 c58143e835f9: constituent of the interaction energy between the spins of adjacent electrons in matter arising from the overlap of electron state functions

GyromagneticRatioOfTheElectron
type: Class
comment: Proportionality constant between the magnetic dipole moment and the angular momentum of the electron.
alternative label: GyromagneticCoefficientOfTheElectron
alternative label: MagnetogyricRatioOfTheElectron
wikidataReference: https://www.wikidata.org/wiki/Q97543076
ISO80000Reference: 10-12.2
EMMO 967080e5 2f42 4eb2 a3a9 c58143e835f9: Proportionality constant between the magnetic dipole moment and the angular momentum of the electron.

ElectronRadius
type: Class
comment: Radius of a sphere such that the relativistic electron energy is distributed uniformly.
wikidataReference: https://www.wikidata.org/wiki/Q2152581
ISO80000Reference: 10-19.2
EMMO 967080e5 2f42 4eb2 a3a9 c58143e835f9: Radius of a sphere such that the relativistic electron energy is distributed uniformly.

ElectrolyticConductivity
type: Class
comment: Electric conductivity of an electrolyte.
qudtReference: https://qudt.org/vocab/quantitykind/ElectrolyticConductivity
wikidataReference: https://www.wikidata.org/wiki/Q907564
IEVReference: https://www.electropedia.org/iev/iev.nsf/display
ISO80000Reference: 9-44
EMMO 967080e5 2f42 4eb2 a3a9 c58143e835f9: Electric conductivity of an electrolyte.

ShortRangeOrderParameter
type: Class
comment: fraction of nearest-neighbour atom pairs in an Ising ferromagnet having magnetic moments in one direction, minus the fraction having magnetic moments in the opposite direction
qudtReference: https://qudt.org/vocab/quantitykind/Short-RangeOrderParameter
wikidataReference: https://www.wikidata.org/wiki/Q105495979
ISO80000Reference: 12-5.1
EMMO 967080e5 2f42 4eb2 a3a9 c58143e835f9: fraction of nearest-neighbour atom pairs in an Ising ferromagnet having magnetic moments in one direction, minus the fraction having magnetic moments in the opposite direction

MagnetomotiveForce
type: Class
comment: Scalar line integral of the magnetic field strength along a closed path.
subclass of: Restriction
qudtReference: https://qudt.org/vocab/quantitykind/MagnetomotiveForce
wikidataReference: https://www.wikidata.org/wiki/Q1266982
IEVReference: https://www.electropedia.org/iev/iev.nsf/display
ISO80000Reference: 6-37.3
EMMO 967080e5 2f42 4eb2 a3a9 c58143e835f9: Scalar line integral of the magnetic field strength along a closed path.

SpeedFractionUnit
type: Class
comment: Unit for quantities of dimension one that are the fraction of two speeds.
example: Unit for refractive index.
EMMO 967080e5 2f42 4eb2 a3a9 c58143e835f9: Unit for quantities of dimension one that are the fraction of two speeds.

SolidAngle
type: Class
comment: Ratio of area on a sphere to its radius squared.
qudtReference: http://qudt.org/vocab/quantitykind/SolidAngle
ISO80000Reference: 3-6
EMMO 967080e5 2f42 4eb2 a3a9 c58143e835f9: Ratio of area on a sphere to its radius squared.
iupacReference: https://doi.org/10.1351/goldbook.S05732

Hypothesis
type: Class
comment: A hypothesis is a theory, estimated and objective, since its estimated premises are objective.
EMMO 967080e5 2f42 4eb2 a3a9 c58143e835f9: A hypothesis is a theory, estimated and objective, since its estimated premises are objective.

SilverSymbol
type: Class
comment: The symbol that stands for the silver atom.
subclass of: Restriction
  has value: Ag
EMMO 967080e5 2f42 4eb2 a3a9 c58143e835f9: The symbol that stands for the silver atom.

SpecificInternalEnergy
type: Class
comment: Internal energy per unit mass.
qudtReference: https://qudt.org/vocab/quantitykind/SpecificInternalEnergy
wikidataReference: https://www.wikidata.org/wiki/Q76357367
ISO80000Reference: 5-21.2
EMMO 967080e5 2f42 4eb2 a3a9 c58143e835f9: Internal energy per unit mass.

ArchetypeManufacturing
type: Class
comment: A manufacturing in which the product is a solid body with a well defined geometrical shape made from shapeless original material parts, whose cohesion is created during the process.
see also: DIN 8580:2020
alternative label: Urformen @de
alternative label: PrimitiveForming
EMMO 967080e5 2f42 4eb2 a3a9 c58143e835f9: A manufacturing in which the product is a solid body with a well defined geometrical shape made from shapeless original material parts, whose cohesion is created during the process.

DiffusionArea
type: Class
comment: One-sixth of the mean square distance between the point where a neutron enters a specified class and the point where it leaves this class.
subclass of: Restriction
qudtReference: https://qudt.org/vocab/quantitykind/DiffusionArea
wikidataReference: https://www.wikidata.org/wiki/Q98966292
ISO80000Reference: 10-72.2
EMMO 967080e5 2f42 4eb2 a3a9 c58143e835f9: One-sixth of the mean square distance between the point where a neutron enters a specified class and the point where it leaves this class.

NeptuniumSymbol
type: Class
comment: The symbol that stands for the neptunium atom.
subclass of: Restriction
subclass of: Restriction
  has value: Np
EMMO 967080e5 2f42 4eb2 a3a9 c58143e835f9: The symbol that stands for the neptunium atom.

Kerma
type: Class
comment: Kinetic energy released per mass.
qudtReference: https://qudt.org/vocab/quantitykind/Kerma
wikidataReference: https://www.wikidata.org/wiki/Q1739288
IEVReference: https://www.electropedia.org/iev/iev.nsf/display
ISO80000Reference: 10-86.1
EMMO 967080e5 2f42 4eb2 a3a9 c58143e835f9: Kinetic energy released per mass.

MolarMass
type: Class
comment: Mass per amount of substance.
subclass of: Restriction
qudtReference: https://qudt.org/vocab/quantitykind/MolarMass
wikidataReference: https://www.wikidata.org/wiki/Q145623
ISO80000Reference: 9-4
EMMO 967080e5 2f42 4eb2 a3a9 c58143e835f9: Mass per amount of substance.

TransientLiquidPhaseSintering
type: Class

ReactionEnergy
type: Class
comment: In a nuclear reaction, sum of the kinetic energies and photon energies of the reaction products minus the sum of the kinetic and photon energies of the reactants.
qudtReference: https://qudt.org/vocab/quantitykind/ReactionEnergy
wikidataReference: https://www.wikidata.org/wiki/Q98164745
ISO80000Reference: 10-37.1
EMMO 967080e5 2f42 4eb2 a3a9 c58143e835f9: In a nuclear reaction, sum of the kinetic energies and photon energies of the reaction products minus the sum of the kinetic and photon energies of the reactants.

ThoriumSymbol
type: Class
comment: The symbol that stands for the thorium atom.
subclass of: Restriction
subclass of: Restriction
  has value: Th
EMMO 967080e5 2f42 4eb2 a3a9 c58143e835f9: The symbol that stands for the thorium atom.

TransformationLanguage
type: Class
comment: A construction language designed to transform some input text in a certain formal language into a modified output text that meets some specific goal.
example: Tritium, XSLT, XQuery, STX, FXT, XDuce, CDuce, HaXml, XMLambda, FleXML
EMMO 967080e5 2f42 4eb2 a3a9 c58143e835f9: A construction language designed to transform some input text in a certain formal language into a modified output text that meets some specific goal.
wikipediaReference: https://en.wikipedia.org/wiki/Transformation_language

MutualInductance
type: Class
comment: Given an electric current in a thin conducting loop and the linked flux caused by that electric current in another loop, the mutual inductance of the two loops is the linked flux divided by the electric current.
wikidataReference: https://www.wikidata.org/wiki/Q78101401
IEVReference: https://www.electropedia.org/iev/iev.nsf/display
ISO80000Reference: 6-41.2
EMMO 967080e5 2f42 4eb2 a3a9 c58143e835f9: Given an electric current in a thin conducting loop and the linked flux caused by that electric current in another loop, the mutual inductance of the two loops is the linked flux divided by the electric current.
iupacReference: https://doi.org/10.1351/goldbook.M04076

Molality
type: Class
comment: quotient of the amount of substance nB of solute B by the mass m of the solvent: bB = nB / m.
subclass of: Restriction
alternative label: AmountPerMass
wikidataReference: https://www.wikidata.org/wiki/Q172623
IEVReference: https://www.electropedia.org/iev/iev.nsf/display
ISO80000Reference: 9-15
EMMO 967080e5 2f42 4eb2 a3a9 c58143e835f9: quotient of the amount of substance nB of solute B by the mass m of the solvent: bB = nB / m.
iupacReference: https://doi.org/10.1351/goldbook.M03970

VonKlitzingConstant
type: Class
comment: Resistance quantum.
comment: The von Klitzing constant is defined as Planck constant divided by the square of the elementary charge.
qudtReference: http://qudt.org/vocab/constant/VonKlitzingConstant
EMMO 70fe84ff 99b6 4206 a9fc 9a8931836d84: The von Klitzing constant is defined as Planck constant divided by the square of the elementary charge.
EMMO 967080e5 2f42 4eb2 a3a9 c58143e835f9: Resistance quantum.

LinearAttenuationCoefficient
type: Class
comment: In nuclear physics, fraction of interacting particles per distance traversed in a given material.
wikidataReference: https://www.wikidata.org/wiki/Q98583077
IEVReference: https://www.electropedia.org/iev/iev.nsf/display
ISO80000Reference: 10-49
EMMO 967080e5 2f42 4eb2 a3a9 c58143e835f9: In nuclear physics, fraction of interacting particles per distance traversed in a given material.

LinkedModelsSimulation
type: Class
comment: A chain of linked physics based model simulations, where equations are solved sequentially.
EMMO 967080e5 2f42 4eb2 a3a9 c58143e835f9: A chain of linked physics based model simulations, where equations are solved sequentially.

SurfaceMassDensity
type: Class
comment: at a given point on a two-dimensional domain of quasi-infinitesimal area dA, scalar quantity equal to the mass dm within the domain divided by the area dA, thus ρA = dm/dA.
subclass of: Restriction
alternative label: AreicMass
alternative label: SurfaceDensity
wikidataReference: https://www.wikidata.org/wiki/Q1907514
IEVReference: https://www.electropedia.org/iev/iev.nsf/display
ISO80000Reference: 4-5
EMMO 967080e5 2f42 4eb2 a3a9 c58143e835f9: at a given point on a two-dimensional domain of quasi-infinitesimal area dA, scalar quantity equal to the mass dm within the domain divided by the area dA, thus ρA = dm/dA.
iupacReference: https://doi.org/10.1351/goldbook.S06167

Attenuation
type: Class
comment: Decrease in magnitude of any kind of flux through a medium.
alternative label: Extinction
ISO80000Reference: 3-26.1
EMMO 967080e5 2f42 4eb2 a3a9 c58143e835f9: Decrease in magnitude of any kind of flux through a medium.
wikipediaReference: https://en.wikipedia.org/wiki/Attenuation
iupacReference: https://doi.org/10.1351/goldbook.A00515

ClassicalData
type: Class
comment: Data that are expressed through classical physics mechanisms, having one value and one state, and being in the same place at the same time.
EMMO 967080e5 2f42 4eb2 a3a9 c58143e835f9: Data that are expressed through classical physics mechanisms, having one value and one state, and being in the same place at the same time.

BismuthSymbol
type: Class
comment: The symbol that stands for the bismuth atom.
subclass of: Restriction
subclass of: Restriction
  has value: Bi
EMMO 967080e5 2f42 4eb2 a3a9 c58143e835f9: The symbol that stands for the bismuth atom.

MolarEnthalpy
type: Class
comment: Enthalpy per amount of substance.
wikidataReference: https://www.wikidata.org/wiki/Q88769977
ISO80000Reference: 9-6.2
EMMO 967080e5 2f42 4eb2 a3a9 c58143e835f9: Enthalpy per amount of substance.

TotalCrossSection
type: Class
comment: Sum of all cross sections corresponding to the various reactions or processes between an incident particle of specified type and energy and a target entity.
qudtReference: https://qudt.org/vocab/quantitykind/TotalCrossSection
wikidataReference: https://www.wikidata.org/wiki/Q98206553
ISO80000Reference: 10-38.2
EMMO 967080e5 2f42 4eb2 a3a9 c58143e835f9: Sum of all cross sections corresponding to the various reactions or processes between an incident particle of specified type and energy and a target entity.

ElectricSusceptibility
type: Class
comment: Electric polarization divided by electric constant and electric field strength.
qudtReference: https://qudt.org/vocab/quantitykind/ElectricSusceptibility
wikidataReference: https://www.wikidata.org/wiki/Q598305
IEVReference: https://www.electropedia.org/iev/iev.nsf/display
ISO80000Reference: 6-16
EMMO 967080e5 2f42 4eb2 a3a9 c58143e835f9: Electric polarization divided by electric constant and electric field strength.
wikipediaReference: https://en.wikipedia.org/wiki/Electric_susceptibility

hasCharacteriser
type: ObjectProperty

NumberOfTurnsInAWinding
type: Class
comment: Number of turns in a winding.
wikidataReference: https://www.wikidata.org/wiki/Q77995997
ISO80000Reference: 6-38
EMMO 967080e5 2f42 4eb2 a3a9 c58143e835f9: Number of turns in a winding.

HassiumSymbol
type: Class
comment: The symbol that stands for the hassium atom.
subclass of: Restriction
subclass of: Restriction
  has value: Hs
EMMO 967080e5 2f42 4eb2 a3a9 c58143e835f9: The symbol that stands for the hassium atom.

ModulusOfImpedance
type: Class
comment: Quotient of the rms value of the voltage between the terminals of a two-terminal element or a two-terminal circuit by the rms value of the electric current in the element or circuit.
qudtReference: https://qudt.org/vocab/quantitykind/ModulusOfImpedance
wikidataReference: https://www.wikidata.org/wiki/Q25457909
IEVReference: https://www.electropedia.org/iev/iev.nsf/display
ISO80000Reference: 6-51.4
EMMO 967080e5 2f42 4eb2 a3a9 c58143e835f9: Quotient of the rms value of the voltage between the terminals of a two-terminal element or a two-terminal circuit by the rms value of the electric current in the element or circuit.

SparkPlasmaSintering
type: Class

NeelTemperature
type: Class
comment: Critical thermodynamic temperature of an antiferromagnet.
wikidataReference: https://www.wikidata.org/wiki/Q830311
IEVReference: https://www.electropedia.org/iev/iev.nsf/display
ISO80000Reference: 12-35.2
EMMO 967080e5 2f42 4eb2 a3a9 c58143e835f9: Critical thermodynamic temperature of an antiferromagnet.

IonizationEnergy
type: Class
comment: Difference between energy of an electron at rest at infinity and a certain energy level which is the energy of an electron in the interior of a substance.
qudtReference: https://qudt.org/vocab/quantitykind/IonizationEnergy
wikidataReference: https://www.wikidata.org/wiki/Q483769
IEVReference: https://www.electropedia.org/iev/iev.nsf/display
ISO80000Reference: 12-24.2
EMMO 967080e5 2f42 4eb2 a3a9 c58143e835f9: Difference between energy of an electron at rest at infinity and a certain energy level which is the energy of an electron in the interior of a substance.
iupacReference: https://doi.org/10.1351/goldbook.I03199

NiobiumSymbol
type: Class
comment: The symbol that stands for the niobium atom.
subclass of: Restriction
subclass of: Restriction
  has value: Nb
EMMO 967080e5 2f42 4eb2 a3a9 c58143e835f9: The symbol that stands for the niobium atom.

NonAgent
type: Class
comment: A participant that does not have an active role in driving the process.
EMMO 967080e5 2f42 4eb2 a3a9 c58143e835f9: A participant that does not have an active role in driving the process.

AmericiumSymbol
type: Class
comment: The symbol that stands for the americium atom.
subclass of: Restriction
subclass of: Restriction
  has value: Am
EMMO 967080e5 2f42 4eb2 a3a9 c58143e835f9: The symbol that stands for the americium atom.

SpecificEntropy
type: Class
comment: Quotient of entropy and mass.
subclass of: Restriction
qudtReference: https://qudt.org/vocab/quantitykind/SpecificEntropy
wikidataReference: https://www.wikidata.org/wiki/Q69423705
ISO80000Reference: 5-19
EMMO 967080e5 2f42 4eb2 a3a9 c58143e835f9: Quotient of entropy and mass.

NumberOfElements
type: Class
comment: Number of direct parts of a Reductionistic.
comment: Using direct parthood EMMO creates a well-defined broadcasting between granularity levels. This also make it possible to count the direct parts of each granularity level.
subclass of: Restriction
EMMO 967080e5 2f42 4eb2 a3a9 c58143e835f9: Number of direct parts of a Reductionistic.

MaterialLaw
type: Class
comment: A law that provides a connection between a material property and other properties of the object.
EMMO 967080e5 2f42 4eb2 a3a9 c58143e835f9: A law that provides a connection between a material property and other properties of the object.

Volume
type: Class
comment: Extent of an object in space.
subclass of: Restriction
qudtReference: http://qudt.org/vocab/quantitykind/Volume
wikidataReference: https://www.wikidata.org/wiki/Q39297
IEVReference: https://www.electropedia.org/iev/iev.nsf/display
dbpediaReference: https://dbpedia.org/page/Volume
ISO80000Reference: 3-4
EMMO 967080e5 2f42 4eb2 a3a9 c58143e835f9: Extent of an object in space.

GravityCasting
type: Class

LawrenciumSymbol
type: Class
comment: The symbol that stands for the lawrencium atom.
subclass of: Restriction
subclass of: Restriction
  has value: Lr
EMMO 967080e5 2f42 4eb2 a3a9 c58143e835f9: The symbol that stands for the lawrencium atom.

Assigner
type: Class
comment: A estimator that uses its predefined knowledge to declare a property of an object.
example: I estimate the molecular mass of the gas in my bottle as 1.00784 u because it is tagged as H.
EMMO 967080e5 2f42 4eb2 a3a9 c58143e835f9: A estimator that uses its predefined knowledge to declare a property of an object.

ShellScript
type: Class
comment: A command language designed to be run by a command-line interpreter, like a Unix shell.
EMMO 967080e5 2f42 4eb2 a3a9 c58143e835f9: A command language designed to be run by a command-line interpreter, like a Unix shell.
wikipediaReference: https://en.wikipedia.org/wiki/Shell_script

DegreeOfDissociation
type: Class
comment: Dissociation may occur stepwise.
comment: Ratio of the number of dissociation events to the maximum number of theoretically possible dissociation events.
alternative label: DissociationFraction
qudtReference: https://qudt.org/vocab/quantitykind/DegreeOfDissociation
wikidataReference: https://www.wikidata.org/wiki/Q907334
IEVReference: https://www.electropedia.org/iev/iev.nsf/display
ISO80000Reference: 9-43
EMMO 967080e5 2f42 4eb2 a3a9 c58143e835f9: Ratio of the number of dissociation events to the maximum number of theoretically possible dissociation events.
iupacReference: https://doi.org/10.1351/goldbook.D01566

ElectricFieldStrength
type: Class
comment: Vector field quantity E which exerts on any charged particle at rest a force F equal to the product of E and the electric charge Q of the particle.
subclass of: Restriction
qudtReference: https://qudt.org/vocab/quantitykind/ElectricFieldStrength
wikidataReference: https://www.wikidata.org/wiki/Q20989
IEVReference: https://www.electropedia.org/iev/iev.nsf/display
ISO80000Reference: 6-10
EMMO 967080e5 2f42 4eb2 a3a9 c58143e835f9: Vector field quantity E which exerts on any charged particle at rest a force F equal to the product of E and the electric charge Q of the particle.

CompositeMaterial
type: Class
comment: A material that contains two or more constituent materials.
alternative label: Composite
EMMO 967080e5 2f42 4eb2 a3a9 c58143e835f9: A material that contains two or more constituent materials.

hasSpatialSlice
type: ObjectProperty
comment: A relation that identify a proper part of the whole that extends itself in time along the overall lifetime of the whole, and whose parts never cover the full spatial extension of the 4D whole.
alternative label: hasSpatialIntegralPart
EMMO 967080e5 2f42 4eb2 a3a9 c58143e835f9: A relation that identify a proper part of the whole that extends itself in time along the overall lifetime of the whole, and whose parts never cover the full spatial extension of the 4D whole.
EMMO c7b62dd7 063a 4c2a 8504 42f7264ba83f: In EMMO FOL this is a defined property. In OWL spatial relations are primitive.

CaesiumSymbol
type: Class
comment: The symbol that stands for the caesium atom.
subclass of: Restriction
subclass of: Restriction
  has value: Cs
EMMO 967080e5 2f42 4eb2 a3a9 c58143e835f9: The symbol that stands for the caesium atom.

EnergyFluenceRate
type: Class
comment: In nuclear physics, time derivative of the energy fluence.
subclass of: Restriction
qudtReference: https://qudt.org/vocab/quantitykind/EnergyFluenceRate
wikidataReference: https://www.wikidata.org/wiki/Q98538655
ISO80000Reference: 10-47
EMMO 967080e5 2f42 4eb2 a3a9 c58143e835f9: In nuclear physics, time derivative of the energy fluence.

Hyperon
type: Class
comment: A baryon containing one or more strange quarks, but no charm, bottom, or top quark.
subclass of: Restriction
EMMO 967080e5 2f42 4eb2 a3a9 c58143e835f9: A baryon containing one or more strange quarks, but no charm, bottom, or top quark.
EMMO c7b62dd7 063a 4c2a 8504 42f7264ba83f: This form of matter may exist in a stable form within the core of some neutron stars.
wikipediaReference: https://en.wikipedia.org/wiki/Hyperon

TensorMeson
type: Class
comment: A meson with spin two.
EMMO 967080e5 2f42 4eb2 a3a9 c58143e835f9: A meson with spin two.

Modeller
type: Class
comment: A estimator that uses modelling to declare a property of an object (i.e. infer a property from other properties).
EMMO 967080e5 2f42 4eb2 a3a9 c58143e835f9: A estimator that uses modelling to declare a property of an object (i.e. infer a property from other properties).

ActivityDensity
type: Class
comment: Activity per unit volume of the sample.
subclass of: Restriction
alternative label: ActivityConcentration
alternative label: VolumetricActivity
alternative label: VolumicActivity
qudtReference: https://qudt.org/vocab/quantitykind/ActivityConcentration
wikidataReference: https://www.wikidata.org/wiki/Q423263
IEVReference: https://www.electropedia.org/iev/iev.nsf/display
ISO80000Reference: 10-29
EMMO 967080e5 2f42 4eb2 a3a9 c58143e835f9: Activity per unit volume of the sample.

RubidiumSymbol
type: Class
comment: The symbol that stands for the rubidium atom.
subclass of: Restriction
  has value: Rb
EMMO 967080e5 2f42 4eb2 a3a9 c58143e835f9: The symbol that stands for the rubidium atom.

HyperfineTransitionFrequencyOfCs
type: Class
comment: The frequency standard in the SI system in which the photon absorption by transitions between the two hyperfine ground states of caesium-133 atoms are used to control the output frequency. It defines the base unit second in the SI system.
EMMO 967080e5 2f42 4eb2 a3a9 c58143e835f9: The frequency standard in the SI system in which the photon absorption by transitions between the two hyperfine ground states of caesium-133 atoms are used to control the output frequency. It defines the base unit second in the SI system.

PropagationCoefficient
type: Class
comment: Measure of the change of amplitude and phase angle of a plane wave propagating in a given direction.
qudtReference: https://qudt.org/vocab/quantitykind/PropagationCoefficient.html
wikidataReference: https://www.wikidata.org/wiki/Q1434913
IEVReference: https://www.electropedia.org/iev/iev.nsf/display
ISO80000Reference: 3-26.3
EMMO 967080e5 2f42 4eb2 a3a9 c58143e835f9: Measure of the change of amplitude and phase angle of a plane wave propagating in a given direction.

hasTemporalEnd
type: ObjectProperty

GroupVelocity
type: Class
comment: Speed with which the envelope of a wave propagates in space.
alternative label: GroupSpeed
wikidataReference: https://www.wikidata.org/wiki/Q217361
IEVReference: https://www.electropedia.org/iev/iev.nsf/display
dbpediaReference: https://dbpedia.org/page/Group_velocity
ISO80000Reference: 3-23.2
EMMO 967080e5 2f42 4eb2 a3a9 c58143e835f9: Speed with which the envelope of a wave propagates in space.
wikipediaReference: https://en.wikipedia.org/wiki/Group_velocity

MaterialSynthesis
type: Class
comment: The creation of a material entity starting from fundamental substances, involving chemical phenomena (e.g. reaction, bonding).
EMMO 967080e5 2f42 4eb2 a3a9 c58143e835f9: The creation of a material entity starting from fundamental substances, involving chemical phenomena (e.g. reaction, bonding).
EMMO c7b62dd7 063a 4c2a 8504 42f7264ba83f: Deals with undefined shapes both input and output.

HeliumSymbol
type: Class
comment: The symbol that stands for the helium atom.
subclass of: Restriction
  has value: He
EMMO 967080e5 2f42 4eb2 a3a9 c58143e835f9: The symbol that stands for the helium atom.

OsmiumSymbol
type: Class
comment: The symbol that stands for the osmium atom.
subclass of: Restriction
  has value: Os
EMMO 967080e5 2f42 4eb2 a3a9 c58143e835f9: The symbol that stands for the osmium atom.

PolymericMaterial
type: Class
comment: A substance made of macromolecules formed by linking many smaller, repeating chemical units called monomers into long chains or networks, resulting in unique properties like toughness, elasticity, or flexibility, found in both natural forms (like DNA, protein) and synthetic plastics, rubbers, and fibers.
EMMO 967080e5 2f42 4eb2 a3a9 c58143e835f9: A substance made of macromolecules formed by linking many smaller, repeating chemical units called monomers into long chains or networks, resulting in unique properties like toughness, elasticity, or flexibility, found in both natural forms (like DNA, protein) and synthetic plastics, rubbers, and fibers.

SpecificationLanguage
type: Class
comment: A language used to describe what a computer system should do.
example: ACSL, VDM, LOTUS, MML, ...
EMMO 967080e5 2f42 4eb2 a3a9 c58143e835f9: A language used to describe what a computer system should do.
wikipediaReference: https://en.wikipedia.org/wiki/Specification_language

XenonSymbol
type: Class
comment: The symbol that stands for the xenon atom.
subclass of: Restriction
subclass of: Restriction
  has value: Xe
EMMO 967080e5 2f42 4eb2 a3a9 c58143e835f9: The symbol that stands for the xenon atom.

NuclearMagneton
type: Class
comment: Absolute value of the magnetic moment of a nucleus.
subclass of: Restriction
wikidataReference: https://www.wikidata.org/wiki/Q1166093
ISO80000Reference: 10-9.3
EMMO 967080e5 2f42 4eb2 a3a9 c58143e835f9: Absolute value of the magnetic moment of a nucleus.
iupacReference: https://doi.org/10.1351/goldbook.N04236

SlowingDownLength
type: Class
comment: Square root of the slowing down area.
qudtReference: https://qudt.org/vocab/quantitykind/Slowing-DownLength
wikidataReference: https://www.wikidata.org/wiki/Q98996963
ISO80000Reference: 10-73.1
EMMO 967080e5 2f42 4eb2 a3a9 c58143e835f9: Square root of the slowing down area.

Action
type: Class
comment: Physical quantity of dimension energy × time.
subclass of: Restriction
qudtReference: https://qudt.org/vocab/quantitykind/Action
wikidataReference: https://www.wikidata.org/wiki/Q846785
IEVReference: https://www.electropedia.org/iev/iev.nsf/display
ISO80000Reference: 4-32
EMMO 967080e5 2f42 4eb2 a3a9 c58143e835f9: Physical quantity of dimension energy × time.

Susceptance
type: Class
comment: Imaginary part of the admittance.
qudtReference: https://qudt.org/vocab/quantitykind/Susceptance
wikidataReference: https://www.wikidata.org/wiki/Q509598
IEVReference: https://www.electropedia.org/iev/iev.nsf/display
ISO80000Reference: 6-52.3
EMMO 967080e5 2f42 4eb2 a3a9 c58143e835f9: Imaginary part of the admittance.

AluminiumSymbol
type: Class
comment: The symbol that stands for the aluminium atom.
subclass of: Restriction
  has value: Al
EMMO 967080e5 2f42 4eb2 a3a9 c58143e835f9: The symbol that stands for the aluminium atom.

NonTemporalRole
type: Class
comment: An holistic spatial part of a whole.
alternative label: HolisticSpatialPart
EMMO 967080e5 2f42 4eb2 a3a9 c58143e835f9: An holistic spatial part of a whole.

MagneticTension
type: Class
comment: Scalar quantity equal to the line integral of the magnetic field strength H along a specified path linking two points a and b.
subclass of: Restriction
qudtReference: https://qudt.org/vocab/quantitykind/MagneticTension
wikidataReference: https://www.wikidata.org/wiki/Q77993836
IEVReference: https://www.electropedia.org/iev/iev.nsf/display
ISO80000Reference: 6-37.2
EMMO 967080e5 2f42 4eb2 a3a9 c58143e835f9: Scalar quantity equal to the line integral of the magnetic field strength H along a specified path linking two points a and b.

MassAttenuationCoefficient
type: Class
comment: Quotient of the linear attenuation coefficient µ and the mass density ρ of the medium.
subclass of: Restriction
qudtReference: https://qudt.org/vocab/quantitykind/MassAttenuationCoefficient
wikidataReference: https://www.wikidata.org/wiki/Q98591983
IEVReference: https://www.electropedia.org/iev/iev.nsf/display
ISO80000Reference: 10-50
EMMO 967080e5 2f42 4eb2 a3a9 c58143e835f9: Quotient of the linear attenuation coefficient µ and the mass density ρ of the medium.

Expressing
type: Class
comment: A semiosis where the interpreter wants to express an interpretant (e.g., an idea, a reasoning, a distant entity) to the rest of the world by the production of a sign. In the intention of the interpreter, the sign should impress another agent with an intended interpretation that should match his one.
EMMO 967080e5 2f42 4eb2 a3a9 c58143e835f9: A semiosis where the interpreter wants to express an interpretant (e.g., an idea, a reasoning, a distant entity) to the rest of the world by the production of a sign. In the intention of the interpreter, the sign should impress another agent with an intended interpretation that should match his one.

hasMeasuredProperty
type: ObjectProperty
comment: Assigns a quantity to an object via a well-defined measurement procedure.
EMMO 967080e5 2f42 4eb2 a3a9 c58143e835f9: Assigns a quantity to an object via a well-defined measurement procedure.

YtterbiumSymbol
type: Class
comment: The symbol that stands for the ytterbium atom.
subclass of: Restriction
subclass of: Restriction
  has value: Yb
EMMO 967080e5 2f42 4eb2 a3a9 c58143e835f9: The symbol that stands for the ytterbium atom.

FermiTemperature
type: Class
comment: in the free electron model, the Fermi energy divided by the Boltzmann constant
qudtReference: https://qudt.org/vocab/quantitykind/FermiTemperature
wikidataReference: https://www.wikidata.org/wiki/Q105942324
ISO80000Reference: 12-28
EMMO 967080e5 2f42 4eb2 a3a9 c58143e835f9: in the free electron model, the Fermi energy divided by the Boltzmann constant

iupacReference
type: AnnotationProperty
comment: DOI to corresponding concept in IUPAC
range: anyURI
sub property of: seeAlso

KineticFrictionForce
type: Class
comment: Force opposing the motion of a body sliding on a surface.
alternative label: DynamicFrictionForce
wikidataReference: https://www.wikidata.org/wiki/Q91005629
ISO80000Reference: 4-9.4
EMMO 967080e5 2f42 4eb2 a3a9 c58143e835f9: Force opposing the motion of a body sliding on a surface.

ArtificialAgency
type: Class
comment: An intentional agency exercised by artificial systems that have internal states that enables adaptive regulation of the agent’s coupling with the environment and metabolic self-maintenance.
subclass of: Restriction
EMMO 967080e5 2f42 4eb2 a3a9 c58143e835f9: An intentional agency exercised by artificial systems that have internal states that enables adaptive regulation of the agent’s coupling with the environment and metabolic self-maintenance.

ThermalConductance
type: Class
comment: Reciprocal of the thermal resistance.
subclass of: Restriction
qudtReference: https://qudt.org/vocab/quantitykind/ThermalConductance
wikidataReference: https://www.wikidata.org/wiki/Q17176562
IEVReference: https://www.electropedia.org/iev/iev.nsf/display
ISO80000Reference: 5-13
EMMO 967080e5 2f42 4eb2 a3a9 c58143e835f9: Reciprocal of the thermal resistance.
iupacReference: https://doi.org/10.1351/goldbook.T06298

hasBeginTile
type: AsymmetricProperty
type: IrreflexiveProperty
type: ObjectProperty
comment: The relation between the whole and a temporal tile that has only outgoing temporal connections.
alternative label: hasTemporalFirst
EMMO 967080e5 2f42 4eb2 a3a9 c58143e835f9: The relation between the whole and a temporal tile that has only outgoing temporal connections.

Unknown
type: Class
comment: The dependent variable for which an equation has been written.
example: Velocity, for the Navier-Stokes equation.
EMMO 967080e5 2f42 4eb2 a3a9 c58143e835f9: The dependent variable for which an equation has been written.

RadiusOfCurvature
type: Class
comment: Radius of the osculating circle of a planar curve at a particular point of the curve.
IEVReference: https://www.electropedia.org/iev/iev.nsf/display
dbpediaReference: https://dbpedia.org/page/Radius_of_curvature
ISO80000Reference: 3-1.12
EMMO 967080e5 2f42 4eb2 a3a9 c58143e835f9: Radius of the osculating circle of a planar curve at a particular point of the curve.
wikipediaReference: https://en.wikipedia.org/wiki/Radius_of_curvature

ThermoelectricVoltage
type: Class
comment: Voltage between substances a and b caused by the thermoelectric effect.
wikidataReference: https://www.wikidata.org/wiki/Q105761637
ISO80000Reference: 12-20
EMMO 967080e5 2f42 4eb2 a3a9 c58143e835f9: Voltage between substances a and b caused by the thermoelectric effect.

PerLengthUnit
type: Class
comment: The class of units with dimensionality 'PerLength'.
subclass of: Restriction
  has value: T0 L-1 M0 I0 Θ0 N0 J0
EMMO 967080e5 2f42 4eb2 a3a9 c58143e835f9: The class of units with dimensionality 'PerLength'.

PhaseCoefficient
type: Class
comment: Change of phase angle with the length along the path travelled by a plane wave.
alternative label: PhaseChangeCoefficient
qudtReference: https://qudt.org/vocab/quantitykind/PhaseCoefficient
wikidataReference: https://www.wikidata.org/wiki/Q32745742
IEVReference: https://www.electropedia.org/iev/iev.nsf/display
ISO80000Reference: 3-26.2
EMMO 967080e5 2f42 4eb2 a3a9 c58143e835f9: Change of phase angle with the length along the path travelled by a plane wave.
EMMO c7b62dd7 063a 4c2a 8504 42f7264ba83f: The imaginary part of the propagation coefficient.
wikipediaReference: https://en.wikipedia.org/wiki/Propagation_constant#Phase_constant

CaliforniumSymbol
type: Class
comment: The symbol that stands for the californium atom.
subclass of: Restriction
  has value: Cf
EMMO 967080e5 2f42 4eb2 a3a9 c58143e835f9: The symbol that stands for the californium atom.

ThermodynamicGrueneisenParameter
type: Class
comment: A dimensionless thermodynamic parameter named after German physicist Eduard Grüneisen.
wikidataReference: https://www.wikidata.org/wiki/Q105658620
ISO80000Reference: 12-13
EMMO 967080e5 2f42 4eb2 a3a9 c58143e835f9: A dimensionless thermodynamic parameter named after German physicist Eduard Grüneisen.
wikipediaReference: https://en.wikipedia.org/wiki/Gr%C3%BCneisen_parameter

BoltzmannConstant
type: Class
comment: A physical constant relating energy at the individual particle level with temperature. It is the gas constant R divided by the Avogadro constant. It defines the Kelvin unit in the SI system.
comment: The DBpedia definition (http://dbpedia.org/page/Boltzmann_constant) is outdated as May 20, 2019. It is now an exact quantity.
qudtReference: http://qudt.org/vocab/constant/BoltzmannConstant
EMMO 967080e5 2f42 4eb2 a3a9 c58143e835f9: A physical constant relating energy at the individual particle level with temperature. It is the gas constant R divided by the Avogadro constant. It defines the Kelvin unit in the SI system.
iupacReference: https://doi.org/10.1351/goldbook.B00695

MathematicalConstruct
type: Class
comment: A construct of two or more mathematical symbols.
subclass of: Restriction
equivalent class: Class
EMMO 967080e5 2f42 4eb2 a3a9 c58143e835f9: A construct of two or more mathematical symbols.

EarthMass
type: Class
comment: Earth mass (M⊕) is the unit of mass equal to that of the Earth. In SI Units, 1 M⊕ = 5.9722 × 10²⁴ kg. Earth mass is often used to describe masses of rocky terrestrial planets. The four terrestrial planets of the Solar System, Mercury, Venus, Earth, and Mars, have masses of 0.055, 0.815, 1.000, and 0.107 Earth masses respectively. -- QUDT
subclass of: Restriction
  has value: 5.97219e+24
subclass of: Restriction
  has value: 0e+00
alternative label: Earth mass
qudtReference: http://qudt.org/vocab/unit/EarthMass
unitSymbol: M⊕
EMMO 967080e5 2f42 4eb2 a3a9 c58143e835f9: Earth mass (M⊕) is the unit of mass equal to that of the Earth. In SI Units, 1 M⊕ = 5.9722 × 10²⁴ kg. Earth mass is often used to describe masses of rocky terrestrial planets. The four terrestrial planets of the Solar System, Mercury, Venus, Earth, and Mars, have masses of 0.055, 0.815, 1.000, and 0.107 Earth masses respectively. -- QUDT
wikipediaReference: http://en.wikipedia.org/wiki/Earth_mass

ElectronVoltPerKelvin
type: Class
comment: `Electron Volt per Kelvin` is a unit for 'Heat Capacity' expressed as eV/K. -- QUDT
subclass of: Restriction
  has value: 1.602177e-19
subclass of: Restriction
  has value: 0e+00
alternative label: Electron Volt per Kelvin
qudtReference: http://qudt.org/vocab/unit/EV-PER-K
ucumCode: eV.K-1
ucumCode: eV/K
unitSymbol: ev/K
EMMO 967080e5 2f42 4eb2 a3a9 c58143e835f9: `Electron Volt per Kelvin` is a unit for 'Heat Capacity' expressed as eV/K. -- QUDT

ElectronVoltPerTesla
type: Class
comment: "Electron Volt per Tesla" is a unit for 'Magnetic Dipole Moment' expressed as eV T⁻¹. -- QUDT
subclass of: Restriction
  has value: 1.602177e-19
subclass of: Restriction
  has value: 0e+00
alternative label: Electron Volt per Tesla
qudtReference: http://qudt.org/vocab/unit/EV-PER-T
ucumCode: eV.T-1
ucumCode: eV/T
unitSymbol: eV/T
EMMO 967080e5 2f42 4eb2 a3a9 c58143e835f9: "Electron Volt per Tesla" is a unit for 'Magnetic Dipole Moment' expressed as eV T⁻¹. -- QUDT

ElectronVoltSecond
type: Class
comment: "Electron Volt Second" is a unit for 'Angular Momentum' expressed as eV s. -- QUDT
subclass of: Restriction
  has value: 0e+00
subclass of: Restriction
  has value: 1.602177e-19
alternative label: Electron Volt Second
qudtReference: http://qudt.org/vocab/unit/EV-SEC
ucumCode: eV.s
unitSymbol: eV⋅s
EMMO 967080e5 2f42 4eb2 a3a9 c58143e835f9: "Electron Volt Second" is a unit for 'Angular Momentum' expressed as eV s. -- QUDT

ElectronvoltPerAngstrom
type: Class
comment: unit electronvolt divided by the unit angstrom -- QUDT
subclass of: Restriction
  has value: 1.602177e-09
subclass of: Restriction
  has value: 0e+00
alternative label: Electronvolt Per Angstrom
qudtReference: http://qudt.org/vocab/unit/EV-PER-ANGSTROM
ucumCode: eV.Ao-1
ucumCode: eV/Ao
unitSymbol: eV/Å
EMMO 967080e5 2f42 4eb2 a3a9 c58143e835f9: unit electronvolt divided by the unit angstrom -- QUDT

ElectronvoltPerMetre
type: Class
comment: unit electronvolt divided by the SI base unit metre -- QUDT
subclass of: Restriction
  has value: 1.602177e-19
subclass of: Restriction
  has value: 0e+00
alternative label: Electronvolt Per Metre
qudtReference: http://qudt.org/vocab/unit/EV-PER-M
ucumCode: eV.m-1
ucumCode: eV/m
unitSymbol: eV/m
EMMO 967080e5 2f42 4eb2 a3a9 c58143e835f9: unit electronvolt divided by the SI base unit metre -- QUDT

ElementaryCharge
type: Class
comment: `Elementary Charge`, usually denoted as `e`, is the electric charge carried by a single proton, or equivalently, the negation (opposite) of the electric charge carried by a single electron. This elementary charge is a fundamental physical constant. To avoid confusion over its sign, e is sometimes called the elementary positive charge. This charge has a measured value of approximately 1.602176634 × 10⁻¹⁹ coulombs. In the cgs system, e is 4.80320471257026372 × 10⁻¹⁰ statcoulombs. -- QUDT
subclass of: Restriction
  has value: 1.602177e-19
subclass of: Restriction
  has value: 0e+00
alternative label: Elementary Charge
qudtReference: http://qudt.org/vocab/unit/E
ucumCode: [e]
unitSymbol: e
EMMO 967080e5 2f42 4eb2 a3a9 c58143e835f9: `Elementary Charge`, usually denoted as `e`, is the electric charge carried by a single proton, or equivalently, the negation (opposite) of the electric charge carried by a single electron. This elementary charge is a fundamental physical constant. To avoid confusion over its sign, e is sometimes called the elementary positive charge. This charge has a measured value of approximately 1.602176634 × 10⁻¹⁹ coulombs. In the cgs system, e is 4.80320471257026372 × 10⁻¹⁰ statcoulombs. -- QUDT

Erg
type: Class
comment: An erg is the unit of energy and mechanical work in the centimetre-gram-second (CGS) system of units, symbol 'erg'. Its name is derived from the Greek ergon, meaning 'work'. An erg is the amount of work done by a force of one dyne exerted for a distance of one centimeter. In the CGS base units, it is equal to one gram centimeter-squared per second-squared (g · cm²/s²). It is thus equal to 10⁻⁷ joules or 100 nanojoules in SI units. 1 erg = 10⁻⁷ J = 100 nJ, 1 erg = 624.15 GeV = 6.2415 × 10¹¹ eV, 1 erg = 1 dyne· cm = 1 g · cm²/s². -- QUDT
subclass of: Restriction
  has value: 1e-07
subclass of: Restriction
  has value: 0e+00
qudtReference: http://qudt.org/vocab/unit/ERG
ucumCode: erg
unitSymbol: erg
EMMO 967080e5 2f42 4eb2 a3a9 c58143e835f9: An erg is the unit of energy and mechanical work in the centimetre-gram-second (CGS) system of units, symbol 'erg'. Its name is derived from the Greek ergon, meaning 'work'. An erg is the amount of work done by a force of one dyne exerted for a distance of one centimeter. In the CGS base units, it is equal to one gram centimeter-squared per second-squared (g · cm²/s²). It is thus equal to 10⁻⁷ joules or 100 nanojoules in SI units. 1 erg = 10⁻⁷ J = 100 nJ, 1 erg = 624.15 GeV = 6.2415 × 10¹¹ eV, 1 erg = 1 dyne· cm = 1 g · cm²/s². -- QUDT
wikipediaReference: http://en.wikipedia.org/wiki/Erg

ErgPerCentiMetre
type: Class
comment: CGS unit of the length-related energy -- QUDT
subclass of: Restriction
  has value: 1e-05
subclass of: Restriction
  has value: 0e+00
alternative label: Erg Per Centimetre
qudtReference: http://qudt.org/vocab/unit/ERG-PER-CentiM
ucumCode: erg.cm-1
ucumCode: erg/cm
unitSymbol: erg/cm
EMMO 967080e5 2f42 4eb2 a3a9 c58143e835f9: CGS unit of the length-related energy -- QUDT

ErgPerCubicCentiMetre
type: Class
subclass of: Restriction
  has value: 1e-01
subclass of: Restriction
  has value: 0e+00
alternative label: Erg per Cubic Centimetre
qudtReference: http://qudt.org/vocab/unit/ERG-PER-CentiM3
ucumCode: erg.cm-3
ucumCode: erg/cm3
unitSymbol: erg/cm³

ErgPerGram
type: Class
comment: CGS unit of the mass-related energy -- QUDT
subclass of: Restriction
  has value: 1e-04
subclass of: Restriction
  has value: 0e+00
alternative label: Erg per Gram
qudtReference: http://qudt.org/vocab/unit/ERG-PER-G
ucumCode: erg.g-1
ucumCode: erg/g
unitSymbol: erg/g
EMMO 967080e5 2f42 4eb2 a3a9 c58143e835f9: CGS unit of the mass-related energy -- QUDT

ErgPerGramSecond
type: Class
comment: CGS unit of the mass-related power -- QUDT
subclass of: Restriction
  has value: 1e-04
subclass of: Restriction
  has value: 0e+00
alternative label: Erg Per Gram Second
qudtReference: http://qudt.org/vocab/unit/ERG-PER-GM-SEC
ucumCode: erg.g-1.s-1
ucumCode: erg/(g.s)
unitSymbol: erg/(g⋅s)
EMMO 967080e5 2f42 4eb2 a3a9 c58143e835f9: CGS unit of the mass-related power -- QUDT

ErgPerSecond
type: Class
comment: "Erg per Second" is a C.G.S System unit for 'Power' expressed as erg/s. -- QUDT
subclass of: Restriction
  has value: 1e-07
subclass of: Restriction
  has value: 0e+00
alternative label: Erg per Second
qudtReference: http://qudt.org/vocab/unit/ERG-PER-SEC
ucumCode: erg.s-1
ucumCode: erg/s
unitSymbol: erg/s
EMMO 967080e5 2f42 4eb2 a3a9 c58143e835f9: "Erg per Second" is a C.G.S System unit for 'Power' expressed as erg/s. -- QUDT

ErgPerSquareCentiMetreSecond
type: Class
comment: "Erg per Square Centimeter Second" is a C.G.S System unit for 'Power Per Area' expressed as erg/(cm²-s). -- QUDT
subclass of: Restriction
  has value: 1e-03
subclass of: Restriction
  has value: 0e+00
alternative label: Erg per Square Centimetre Second
qudtReference: http://qudt.org/vocab/unit/ERG-PER-CentiM2-SEC
ucumCode: erg.cm-2.s-1
ucumCode: erg/(cm2.s)
unitSymbol: erg/(cm²⋅s)
EMMO 967080e5 2f42 4eb2 a3a9 c58143e835f9: "Erg per Square Centimeter Second" is a C.G.S System unit for 'Power Per Area' expressed as erg/(cm²-s). -- QUDT

ErgSecond
type: Class
subclass of: Restriction
  has value: 1e-07
subclass of: Restriction
  has value: 0e+00
alternative label: Erg Second
qudtReference: http://qudt.org/vocab/unit/ERG-SEC
ucumCode: erg.s
unitSymbol: erg⋅s

Erlang
type: Class
comment: The "Erlang" is a dimensionless unit that is used in telephony as a measure of offered load or carried load on service-providing elements such as telephone circuits or telephone switching equipment. -- QUDT
subclass of: Restriction
  has value: 1e+00
subclass of: Restriction
  has value: 0e+00
qudtReference: http://qudt.org/vocab/unit/ERLANG
unitSymbol: E
EMMO 967080e5 2f42 4eb2 a3a9 c58143e835f9: The "Erlang" is a dimensionless unit that is used in telephony as a measure of offered load or carried load on service-providing elements such as telephone circuits or telephone switching equipment. -- QUDT
wikipediaReference: http://en.wikipedia.org/wiki/Erlang_(unit)

ExaByte
type: Class
comment: The exabyte is a multiple of the unit byte for digital information. The prefix exa means 10¹⁸ in the International System of Units (SI), so ExaByte is 10¹⁸ Bytes. -- QUDT
subclass of: Restriction
  some values from: Byte
subclass of: Restriction
  has value: 1e+18
subclass of: Restriction
  has value: 0e+00
qudtReference: http://qudt.org/vocab/unit/ExaBYTE
ucumCode: EBy
unitSymbol: EB
EMMO 967080e5 2f42 4eb2 a3a9 c58143e835f9: The exabyte is a multiple of the unit byte for digital information. The prefix exa means 10¹⁸ in the International System of Units (SI), so ExaByte is 10¹⁸ Bytes. -- QUDT
wikipediaReference: https://en.wikipedia.org/wiki/Byte#Multiple-byte_units

ExaCoulomb
type: Class
comment: An ExaCoulomb is 10¹⁸ C. -- QUDT
subclass of: Restriction
  some values from: Coulomb
subclass of: Restriction
  has value: 1e+18
subclass of: Restriction
  has value: 0e+00
qudtReference: http://qudt.org/vocab/unit/ExaC
ucumCode: EC
unitSymbol: EC
EMMO 967080e5 2f42 4eb2 a3a9 c58143e835f9: An ExaCoulomb is 10¹⁸ C. -- QUDT

ExaJoule
type: Class
comment: 1 000 000 000 000 000 000-fold of the derived SI unit joule -- QUDT
subclass of: Restriction
  some values from: Joule
subclass of: Restriction
  has value: 1e+18
subclass of: Restriction
  has value: 0e+00
qudtReference: http://qudt.org/vocab/unit/ExaJ
ucumCode: EJ
unitSymbol: EJ
EMMO 967080e5 2f42 4eb2 a3a9 c58143e835f9: 1 000 000 000 000 000 000-fold of the derived SI unit joule -- QUDT

ExbiByte
type: Class
comment: The exbibyte is a multiple of the unit byte for digital information. The prefix exbi means 1024⁶ -- QUDT
subclass of: Restriction
  some values from: Byte
subclass of: Restriction
  has value: 1.152922e+18
subclass of: Restriction
  has value: 0e+00
qudtReference: http://qudt.org/vocab/unit/ExbiBYTE
unitSymbol: EiB
EMMO 967080e5 2f42 4eb2 a3a9 c58143e835f9: The exbibyte is a multiple of the unit byte for digital information. The prefix exbi means 1024⁶ -- QUDT
wikipediaReference: https://en.wikipedia.org/wiki/Byte#Multiple-byte_units

FailuresInTime
type: Class
comment: unit of failure rate -- QUDT
alternative label: Failures In Time
qudtReference: http://qudt.org/vocab/unit/failures-in-time
ucumCode: s-1{failures}
unitSymbol: failures/s
EMMO 967080e5 2f42 4eb2 a3a9 c58143e835f9: unit of failure rate -- QUDT

FaradPerKiloMetre
type: Class
comment: SI derived unit farad divided by the 1 000-fold of the SI base unit metre -- QUDT
subclass of: Restriction
  has value: 1e-03
subclass of: Restriction
  has value: 0e+00
alternative label: Farad Per Kilometre
qudtReference: http://qudt.org/vocab/unit/FARAD-PER-KiloM
ucumCode: F.km-1
ucumCode: F/km
unitSymbol: F/km
EMMO 967080e5 2f42 4eb2 a3a9 c58143e835f9: SI derived unit farad divided by the 1 000-fold of the SI base unit metre -- QUDT

Faraday
type: Class
comment: "Faraday" is a unit for 'Electric Charge' expressed as F. -- QUDT
subclass of: Restriction
  has value: 9.648534e+04
subclass of: Restriction
  has value: 0e+00
qudtReference: http://qudt.org/vocab/unit/F
unitSymbol: F
EMMO 967080e5 2f42 4eb2 a3a9 c58143e835f9: "Faraday" is a unit for 'Electric Charge' expressed as F. -- QUDT

Fathom
type: Class
comment: A fathom = 1.8288 meters, is a unit of length in the imperial and the U.S. customary systems, used especially for measuring the depth of water. There are two yards in an imperial or U.S. fathom. Originally based on the distance between the man's outstretched arms, the size of a fathom has varied slightly depending on whether it was defined as a thousandth of an (Admiralty) nautical mile or as a multiple of the imperial yard. Abbreviations: f, fath, fm, fth, fthm. -- QUDT
subclass of: Restriction
  has value: 1.8288e+00
subclass of: Restriction
  has value: 0e+00
qudtReference: http://qudt.org/vocab/unit/FATH
ucumCode: [fth_i]
unitSymbol: fathom
EMMO 967080e5 2f42 4eb2 a3a9 c58143e835f9: A fathom = 1.8288 meters, is a unit of length in the imperial and the U.S. customary systems, used especially for measuring the depth of water. There are two yards in an imperial or U.S. fathom. Originally based on the distance between the man's outstretched arms, the size of a fathom has varied slightly depending on whether it was defined as a thousandth of an (Admiralty) nautical mile or as a multiple of the imperial yard. Abbreviations: f, fath, fm, fth, fthm. -- QUDT
wikipediaReference: http://en.wikipedia.org/wiki/Fathom

FemtoCoulomb
type: Class
comment: A FemtoCoulomb is 10⁻¹⁵ C. -- QUDT
subclass of: Restriction
  some values from: Coulomb
subclass of: Restriction
  has value: 1e-15
subclass of: Restriction
  has value: 0e+00
qudtReference: http://qudt.org/vocab/unit/FemtoC
ucumCode: fC
unitSymbol: fC
EMMO 967080e5 2f42 4eb2 a3a9 c58143e835f9: A FemtoCoulomb is 10⁻¹⁵ C. -- QUDT

FemtoGram
type: Class
subclass of: Restriction
  some values from: Gram
subclass of: Restriction
  has value: 1e-18
subclass of: Restriction
  has value: 0e+00
qudtReference: http://qudt.org/vocab/unit/FemtoGM
unitSymbol: fg

FemtoGramPerKilogram
type: Class
comment: One part per 10**18 by mass of the measurand in the matrix. -- QUDT
subclass of: Restriction
  some values from: GramPerKilogram
subclass of: Restriction
  has value: 1e-18
subclass of: Restriction
  has value: 0e+00
alternative label: Femtograms per kilogram
qudtReference: http://qudt.org/vocab/unit/FemtoGM-PER-KiloGM
ucumCode: fg.kg-1
unitSymbol: fg/kg
EMMO 967080e5 2f42 4eb2 a3a9 c58143e835f9: One part per 10**18 by mass of the measurand in the matrix. -- QUDT

FemtoGramPerLitre
type: Class
comment: One 10**18 part of the SI standard unit of mass of the measurand per litre volume of matrix.. -- QUDT
subclass of: Restriction
  some values from: GramPerLitre
subclass of: Restriction
  has value: 1e-15
subclass of: Restriction
  has value: 0e+00
alternative label: Femtograms per litre
qudtReference: http://qudt.org/vocab/unit/FemtoGM-PER-L
ucumCode: fg.L-1
unitSymbol: fg/L
EMMO 967080e5 2f42 4eb2 a3a9 c58143e835f9: One 10**18 part of the SI standard unit of mass of the measurand per litre volume of matrix.. -- QUDT

FemtoJoule
type: Class
comment: 0,000 000 000 000 001-fold of the derived SI unit joule -- QUDT
subclass of: Restriction
  has value: 0e+00
subclass of: Restriction
  some values from: Joule
subclass of: Restriction
  has value: 1e-15
qudtReference: http://qudt.org/vocab/unit/FemtoJ
ucumCode: fJ
unitSymbol: fJ
EMMO 967080e5 2f42 4eb2 a3a9 c58143e835f9: 0,000 000 000 000 001-fold of the derived SI unit joule -- QUDT

FemtoLitre
type: Class
comment: 0.000000000000001-fold of the unit litre -- QUDT
subclass of: Restriction
  some values from: Litre
subclass of: Restriction
  has value: 1e-18
subclass of: Restriction
  has value: 0e+00
qudtReference: http://qudt.org/vocab/unit/FemtoL
ucumCode: fL
unitSymbol: fL
EMMO 967080e5 2f42 4eb2 a3a9 c58143e835f9: 0.000000000000001-fold of the unit litre -- QUDT

FemtoMetre
type: Class
comment: The `femtometre` is an SI unit of length equal to 10⁻¹⁵ meter. This distance can also be called `fermi` and was so named in honour of Enrico Fermi. It is often encountered in nuclear physics as a characteristic of this scale. The symbol for the fermi is also fm. -- QUDT
subclass of: Restriction
  some values from: Metre
subclass of: Restriction
  has value: 1e-15
subclass of: Restriction
  has value: 0e+00
qudtReference: http://qudt.org/vocab/unit/FemtoM
ucumCode: fm
unitSymbol: fm
EMMO 967080e5 2f42 4eb2 a3a9 c58143e835f9: The `femtometre` is an SI unit of length equal to 10⁻¹⁵ meter. This distance can also be called `fermi` and was so named in honour of Enrico Fermi. It is often encountered in nuclear physics as a characteristic of this scale. The symbol for the fermi is also fm. -- QUDT

FemtoMole
type: Class
subclass of: Restriction
  some values from: Mole
subclass of: Restriction
  has value: 1e-15
subclass of: Restriction
  has value: 0e+00
qudtReference: http://qudt.org/vocab/unit/FemtoMOL
unitSymbol: fmol

FemtoMolePerKilogram
type: Class
comment: A 10**15 part quantity of substance of the measurand per kilogram mass of matrix. -- QUDT
subclass of: Restriction
  has value: 1e-15
subclass of: Restriction
  has value: 0e+00
alternative label: Femtomoles per kilogram
qudtReference: http://qudt.org/vocab/unit/FemtoMOL-PER-KiloGM
ucumCode: fmol.kg-1
unitSymbol: fmol/kg
EMMO 967080e5 2f42 4eb2 a3a9 c58143e835f9: A 10**15 part quantity of substance of the measurand per kilogram mass of matrix. -- QUDT

FemtoMolePerLitre
type: Class
comment: A 10**18 part quantity of substance of the measurand per litre volume of matrix. -- QUDT
subclass of: Restriction
  some values from: MolePerLitre
subclass of: Restriction
  has value: 1e-12
subclass of: Restriction
  has value: 0e+00
alternative label: Femtomoles per litre
qudtReference: http://qudt.org/vocab/unit/FemtoMOL-PER-L
ucumCode: fmol.L-1
unitSymbol: fmol/L
EMMO 967080e5 2f42 4eb2 a3a9 c58143e835f9: A 10**18 part quantity of substance of the measurand per litre volume of matrix. -- QUDT

Fermi
type: Class
comment: The `fermi`, or `femtometer` (other spelling femtometre, symbol fm) is an SI unit of length equal to 10⁻¹⁵ metre. This distance is often encountered in nuclear physics as a characteristic of this scale. The symbol for the fermi is also fm. -- QUDT
subclass of: Restriction
  has value: 1e-15
subclass of: Restriction
  has value: 0e+00
alternative label: fermi
qudtReference: http://qudt.org/vocab/unit/FM
unitSymbol: fm
EMMO 967080e5 2f42 4eb2 a3a9 c58143e835f9: The `fermi`, or `femtometer` (other spelling femtometre, symbol fm) is an SI unit of length equal to 10⁻¹⁵ metre. This distance is often encountered in nuclear physics as a characteristic of this scale. The symbol for the fermi is also fm. -- QUDT
wikipediaReference: http://en.wikipedia.org/wiki/Fermi_(unit)

Foot
type: Class
comment: A foot is a unit of length defined as being 0.3048 m exactly and used in the imperial system of units and United States customary units. It is subdivided into 12 inches. The foot is still officially used in Canada and still commonly used in the United Kingdom, although the latter has partially metricated its units of measurement. -- QUDT
subclass of: Restriction
  has value: 3.048e-01
subclass of: Restriction
  has value: 0e+00
qudtReference: http://qudt.org/vocab/unit/FT
ucumCode: [ft_i]
unitSymbol: ft
EMMO 967080e5 2f42 4eb2 a3a9 c58143e835f9: A foot is a unit of length defined as being 0.3048 m exactly and used in the imperial system of units and United States customary units. It is subdivided into 12 inches. The foot is still officially used in Canada and still commonly used in the United Kingdom, although the latter has partially metricated its units of measurement. -- QUDT

FootCandle
type: Class
comment: "Foot Candle" is a unit for 'Luminous Flux Per Area' expressed as fc. -- QUDT
subclass of: Restriction
  has value: 1.0764e+01
subclass of: Restriction
  has value: 0e+00
alternative label: Foot Candle
qudtReference: http://qudt.org/vocab/unit/FC
unitSymbol: fc
EMMO 967080e5 2f42 4eb2 a3a9 c58143e835f9: "Foot Candle" is a unit for 'Luminous Flux Per Area' expressed as fc. -- QUDT
wikipediaReference: http://en.wikipedia.org/wiki/Foot-candle

FootLambert
type: Class
comment: "Foot Lambert" is a C.G.S System unit for 'Luminance' expressed as ft-L. -- QUDT
subclass of: Restriction
  has value: 3.426259e+00
subclass of: Restriction
  has value: 0e+00
alternative label: Foot Lambert
qudtReference: http://qudt.org/vocab/unit/FT-LA
ucumCode: [ft_i].Lmb
unitSymbol: ft⋅L
EMMO 967080e5 2f42 4eb2 a3a9 c58143e835f9: "Foot Lambert" is a C.G.S System unit for 'Luminance' expressed as ft-L. -- QUDT

FootOfMercury
type: Class
comment: not SI conform unit of the pressure, at which 1 ftHg corresponds to the static pressure, which is excited by a mercury column with a height of 1 foot -- QUDT
subclass of: Restriction
  has value: 4.063666e+04
subclass of: Restriction
  has value: 0e+00
alternative label: Foot Of Mercury
qudtReference: http://qudt.org/vocab/unit/FT_HG
ucumCode: [ft_i'Hg]
unitSymbol: ftHg
EMMO 967080e5 2f42 4eb2 a3a9 c58143e835f9: not SI conform unit of the pressure, at which 1 ftHg corresponds to the static pressure, which is excited by a mercury column with a height of 1 foot -- QUDT

FootOfWater
type: Class
comment: "Foot of Water" is a unit for 'Force Per Area' expressed as ftH2O. -- QUDT
subclass of: Restriction
  has value: 0e+00
subclass of: Restriction
  has value: 2.989067e+03
alternative label: Foot of Water
qudtReference: http://qudt.org/vocab/unit/FT_H2O
ucumCode: [ft_i'H2O]
unitSymbol: ftH₂0
EMMO 967080e5 2f42 4eb2 a3a9 c58143e835f9: "Foot of Water" is a unit for 'Force Per Area' expressed as ftH2O. -- QUDT

FootPerDay
type: Class
comment: "Foot per Day" is an Imperial unit for 'Linear Velocity' expressed as ft/d. -- QUDT
subclass of: Restriction
  has value: 3.527778e-06
subclass of: Restriction
  has value: 0e+00
alternative label: Foot per Day
qudtReference: http://qudt.org/vocab/unit/FT-PER-DAY
ucumCode: [ft_i].d-1
ucumCode: [ft_i]/d
unitSymbol: ft/day
EMMO 967080e5 2f42 4eb2 a3a9 c58143e835f9: "Foot per Day" is an Imperial unit for 'Linear Velocity' expressed as ft/d. -- QUDT

FootPerDegreeFahrenheit
type: Class
comment: unit foot as a linear measure according to the Anglo-American and the Imperial system of units divided by the unit for temperature degree Fahrenheit -- QUDT
subclass of: Restriction
  has value: 5.4864e-01
subclass of: Restriction
  has value: 0e+00
alternative label: Foot Per Degree Fahrenheit
qudtReference: http://qudt.org/vocab/unit/FT-PER-DEG_F
ucumCode: [ft_i].[lbf_av].[degF]
unitSymbol: ft/°F
EMMO 967080e5 2f42 4eb2 a3a9 c58143e835f9: unit foot as a linear measure according to the Anglo-American and the Imperial system of units divided by the unit for temperature degree Fahrenheit -- QUDT

FootPerHour
type: Class
comment: "Foot per Hour" is an Imperial unit for 'Linear Velocity' expressed as ft/hr. -- QUDT
subclass of: Restriction
  has value: 8.466667e-05
subclass of: Restriction
  has value: 0e+00
alternative label: Foot per Hour
qudtReference: http://qudt.org/vocab/unit/FT-PER-HR
ucumCode: [ft_i].h-1
ucumCode: [ft_i]/h
unitSymbol: ft/hr
EMMO 967080e5 2f42 4eb2 a3a9 c58143e835f9: "Foot per Hour" is an Imperial unit for 'Linear Velocity' expressed as ft/hr. -- QUDT

FootPerMinute
type: Class
comment: "Foot per Minute" is an Imperial unit for 'Linear Velocity' expressed as ft/min. -- QUDT
subclass of: Restriction
  has value: 5.08e-03
subclass of: Restriction
  has value: 0e+00
alternative label: Foot per Minute
qudtReference: http://qudt.org/vocab/unit/FT-PER-MIN
ucumCode: [ft_i].min-1
ucumCode: [ft_i]/min
unitSymbol: ft/min
EMMO 967080e5 2f42 4eb2 a3a9 c58143e835f9: "Foot per Minute" is an Imperial unit for 'Linear Velocity' expressed as ft/min. -- QUDT

FootPerSecond
type: Class
comment: `foot per second` (plural `feet per second`) is a unit of both speed (scalar) and velocity (vector quantity, which includes direction). It expresses the distance in feet (ft) traveled or displaced, divided by the time in seconds (s, or sec). The corresponding unit in the International System of Units (SI) is the `metre per second`. Abbreviations include ft/s, ft/sec and fps, and the rarely used scientific notation ft s. -- QUDT
subclass of: Restriction
  has value: 3.048e-01
subclass of: Restriction
  has value: 0e+00
alternative label: Foot per Second
qudtReference: http://qudt.org/vocab/unit/FT-PER-SEC
ucumCode: [ft_i].s-1
ucumCode: [ft_i]/s
unitSymbol: ft/s
EMMO 967080e5 2f42 4eb2 a3a9 c58143e835f9: `foot per second` (plural `feet per second`) is a unit of both speed (scalar) and velocity (vector quantity, which includes direction). It expresses the distance in feet (ft) traveled or displaced, divided by the time in seconds (s, or sec). The corresponding unit in the International System of Units (SI) is the `metre per second`. Abbreviations include ft/s, ft/sec and fps, and the rarely used scientific notation ft s. -- QUDT
wikipediaReference: http://en.wikipedia.org/wiki/Foot_per_second

FootPerSquareSecond
type: Class
comment: `Foot per Square Second` is an Imperial unit for `Linear Acceleration` expressed as ft/s². -- QUDT
subclass of: Restriction
  has value: 3.048e-01
subclass of: Restriction
  has value: 0e+00
alternative label: Foot per Square Second
qudtReference: http://qudt.org/vocab/unit/FT-PER-SEC2
ucumCode: [ft_i].s-2
ucumCode: [ft_i]/s2
unitSymbol: ft/s²
EMMO 967080e5 2f42 4eb2 a3a9 c58143e835f9: `Foot per Square Second` is an Imperial unit for `Linear Acceleration` expressed as ft/s². -- QUDT

FootPoundForce
type: Class
comment: "Foot Pound Force" is an Imperial unit for 'Energy And Work' expressed as ft-lbf. -- QUDT
subclass of: Restriction
  has value: 1.355818e+00
subclass of: Restriction
  has value: 0e+00
alternative label: Foot Pound Force
qudtReference: http://qudt.org/vocab/unit/FT-LB_F
ucumCode: [ft_i].[lbf_av]
unitSymbol: ft⋅lbf
EMMO 967080e5 2f42 4eb2 a3a9 c58143e835f9: "Foot Pound Force" is an Imperial unit for 'Energy And Work' expressed as ft-lbf. -- QUDT
wikipediaReference: http://en.wikipedia.org/wiki/Foot-pound_force

FootPoundForcePerHour
type: Class
comment: "Foot Pound Force per Hour" is an Imperial unit for 'Power' expressed as ft-lbf/hr. -- QUDT
subclass of: Restriction
  has value: 3.766161e-03
subclass of: Restriction
  has value: 0e+00
alternative label: Foot Pound Force per Hour
qudtReference: http://qudt.org/vocab/unit/FT-LB_F-PER-HR
ucumCode: [ft_i].[lbf_av].h-1
unitSymbol: ft⋅lbf/hr
EMMO 967080e5 2f42 4eb2 a3a9 c58143e835f9: "Foot Pound Force per Hour" is an Imperial unit for 'Power' expressed as ft-lbf/hr. -- QUDT

FootPoundForcePerMinute
type: Class
comment: "Foot Pound Force per Minute" is an Imperial unit for 'Power' expressed as ft-lbf/min. -- QUDT
subclass of: Restriction
  has value: 0e+00
subclass of: Restriction
  has value: 2.259697e-02
alternative label: Foot Pound Force per Minute
qudtReference: http://qudt.org/vocab/unit/FT-LB_F-PER-MIN
ucumCode: [ft_i].[lbf_av].min-1
unitSymbol: ft⋅lbf/min
EMMO 967080e5 2f42 4eb2 a3a9 c58143e835f9: "Foot Pound Force per Minute" is an Imperial unit for 'Power' expressed as ft-lbf/min. -- QUDT

FootPoundForcePerSecond
type: Class
comment: "Foot Pound Force per Second" is an Imperial unit for 'Power' expressed as ft-lbf/s. -- QUDT
subclass of: Restriction
  has value: 1.355818e+00
subclass of: Restriction
  has value: 0e+00
alternative label: Foot Pound Force per Second
qudtReference: http://qudt.org/vocab/unit/FT-LB_F-PER-SEC
ucumCode: [ft_i].[lbf_av].s-1
unitSymbol: ft⋅lbf/s
EMMO 967080e5 2f42 4eb2 a3a9 c58143e835f9: "Foot Pound Force per Second" is an Imperial unit for 'Power' expressed as ft-lbf/s. -- QUDT

FootPoundForcePerSquareFootSecond
type: Class
comment: "Foot Pound Force per Square Foot Second" is an Imperial unit for 'Power Per Area' expressed as ft · lbf/(ft² · s). -- QUDT
subclass of: Restriction
  has value: 1.45939e+01
subclass of: Restriction
  has value: 0e+00
alternative label: Foot Pound Force per Square Foot Second
qudtReference: http://qudt.org/vocab/unit/FT-LB_F-PER-FT2-SEC
ucumCode: [ft_i].[lbf_av].[sft_i]-1.s-1
unitSymbol: ft⋅lbf/ft²s
EMMO 967080e5 2f42 4eb2 a3a9 c58143e835f9: "Foot Pound Force per Square Foot Second" is an Imperial unit for 'Power Per Area' expressed as ft · lbf/(ft² · s). -- QUDT

FootPoundForcePerSquareMetre
type: Class
comment: "Foot Pound Force per Square Meter" is a unit for 'Energy Per Area' expressed as ft-lbf/m². -- QUDT
alternative label: Foot Pound Force per Square Metre
qudtReference: http://qudt.org/vocab/unit/FT-LB_F-PER-M2
ucumCode: [ft_i].[lbf_av].m-2
unitSymbol: ft⋅lbf/m²
EMMO 967080e5 2f42 4eb2 a3a9 c58143e835f9: "Foot Pound Force per Square Meter" is a unit for 'Energy Per Area' expressed as ft-lbf/m². -- QUDT

FootPoundForceSecond
type: Class
comment: "Foot Pound Force Second" is a unit for 'Angular Momentum' expressed as lbf / s. -- QUDT
alternative label: Foot Pound Force Second
qudtReference: http://qudt.org/vocab/unit/FT-LB_F-SEC
ucumCode: [ft_i].[lbf_av].s
unitSymbol: lbf/s
EMMO 967080e5 2f42 4eb2 a3a9 c58143e835f9: "Foot Pound Force Second" is a unit for 'Angular Momentum' expressed as lbf / s. -- QUDT

FootPoundPerSquareFoot
type: Class
comment: "Foot Pound per Square Foot" is an Imperial unit for 'Energy Per Area' expressed as ft-lbf/ft². -- QUDT
subclass of: Restriction
  has value: 1.45939e+01
subclass of: Restriction
  has value: 0e+00
alternative label: Foot Pound per Square Foot
qudtReference: http://qudt.org/vocab/unit/FT-LB_F-PER-FT2
ucumCode: [ft_i].[lbf_av].[sft_i]-1
unitSymbol: ft⋅lbf/ft²
EMMO 967080e5 2f42 4eb2 a3a9 c58143e835f9: "Foot Pound per Square Foot" is an Imperial unit for 'Energy Per Area' expressed as ft-lbf/ft². -- QUDT

FootPoundal
type: Class
comment: "Foot Poundal" is an Imperial unit for 'Energy And Work' expressed as ft-pdl. -- QUDT
subclass of: Restriction
  has value: 4.214011e-02
subclass of: Restriction
  has value: 0e+00
alternative label: Foot Poundal
qudtReference: http://qudt.org/vocab/unit/FT-PDL
unitSymbol: ft⋅pdl
EMMO 967080e5 2f42 4eb2 a3a9 c58143e835f9: "Foot Poundal" is an Imperial unit for 'Energy And Work' expressed as ft-pdl. -- QUDT

Fraction
type: Class
comment: Fraction is a unit for 'Dimensionless Ratio' expressed as the value of the ratio itself. -- QUDT
subclass of: Restriction
  has value: 1e+00
subclass of: Restriction
  has value: 0e+00
qudtReference: http://qudt.org/vocab/unit/FRACTION
unitSymbol: ÷
EMMO 967080e5 2f42 4eb2 a3a9 c58143e835f9: Fraction is a unit for 'Dimensionless Ratio' expressed as the value of the ratio itself. -- QUDT

FractionalArea
type: Class
comment: "Fractional area" is a unit for 'Solid Angle' expressed as fa. -- QUDT
subclass of: Restriction
  has value: 1.256637e+01
subclass of: Restriction
  has value: 0e+00
alternative label: Fractional area
qudtReference: http://qudt.org/vocab/unit/FA
unitSymbol: fa
EMMO 967080e5 2f42 4eb2 a3a9 c58143e835f9: "Fractional area" is a unit for 'Solid Angle' expressed as fa. -- QUDT

FramePerSecond
type: Class
comment: "Frame per Second" is a unit for 'Video Frame Rate' expressed as fps. -- QUDT
alternative label: Frame per Second
qudtReference: http://qudt.org/vocab/unit/FRAME-PER-SEC
ucumCode: /s{frame}
ucumCode: s-1{frame}
unitSymbol: fps
EMMO 967080e5 2f42 4eb2 a3a9 c58143e835f9: "Frame per Second" is a unit for 'Video Frame Rate' expressed as fps. -- QUDT

Franklin
type: Class
comment: "Franklin" is a unit for 'Electric Charge' expressed as Fr. -- QUDT
subclass of: Restriction
  has value: 3.335641e-10
subclass of: Restriction
  has value: 0e+00
qudtReference: http://qudt.org/vocab/unit/FR
unitSymbol: Fr
EMMO 967080e5 2f42 4eb2 a3a9 c58143e835f9: "Franklin" is a unit for 'Electric Charge' expressed as Fr. -- QUDT
wikipediaReference: http://en.wikipedia.org/wiki/Franklin

FrenchGauge
type: Class
comment: unit for the diameter of thin tubes in the medical technology (e.g. catheter) and telecommunications engineering (e.g. fiberglasses). -- QUDT
subclass of: Restriction
  has value: 3.333333e-04
subclass of: Restriction
  has value: 0e+00
alternative label: French Gauge
qudtReference: http://qudt.org/vocab/unit/GAUGE_FR
ucumCode: [Ch]
unitSymbol: French gauge
EMMO 967080e5 2f42 4eb2 a3a9 c58143e835f9: unit for the diameter of thin tubes in the medical technology (e.g. catheter) and telecommunications engineering (e.g. fiberglasses). -- QUDT

Furlong
type: Class
comment: A furlong is a measure of distance in imperial units and U.S. customary units equal to one-eighth of a mile, equivalent to 220 yards, 660 feet, 40 rods, or 10 chains. The exact value of the furlong varies slightly among English-speaking countries. Five furlongs are approximately 1 kilometre (1.0058 km is a closer approximation). Since the original definition of the metre was one-quarter of one ten-millionth of the circumference of the Earth (along the great circle coincident with the meridian of longitude passing through Paris), the circumference of the Earth is about 40,000 km or about 200,000 furlongs. -- QUDT
subclass of: Restriction
  has value: 2.01168e+02
subclass of: Restriction
  has value: 0e+00
qudtReference: http://qudt.org/vocab/unit/FUR
ucumCode: [fur_us]
unitSymbol: furlong
EMMO 967080e5 2f42 4eb2 a3a9 c58143e835f9: A furlong is a measure of distance in imperial units and U.S. customary units equal to one-eighth of a mile, equivalent to 220 yards, 660 feet, 40 rods, or 10 chains. The exact value of the furlong varies slightly among English-speaking countries. Five furlongs are approximately 1 kilometre (1.0058 km is a closer approximation). Since the original definition of the metre was one-quarter of one ten-millionth of the circumference of the Earth (along the great circle coincident with the meridian of longitude passing through Paris), the circumference of the Earth is about 40,000 km or about 200,000 furlongs. -- QUDT
wikipediaReference: http://en.wikipedia.org/wiki/Furlong

Gal_Uk
type: Class
comment: unit of the volume for fluids according to the Imperial system of units -- QUDT
subclass of: Restriction
  has value: 4.54609e-03
subclass of: Restriction
  has value: 0e+00
alternative label: Gallon (UK)
qudtReference: http://qudt.org/vocab/unit/GAL_UK
ucumCode: [gal_br]
unitSymbol: gal{UK}
EMMO 967080e5 2f42 4eb2 a3a9 c58143e835f9: unit of the volume for fluids according to the Imperial system of units -- QUDT

Gal_Uk_Per_Day
type: Class
comment: unit gallon (UK dry or liq.) according to the Imperial system of units divided by the SI unit day -- QUDT
subclass of: Restriction
  has value: 5.261678e-08
subclass of: Restriction
  has value: 0e+00
alternative label: Gallon (UK) Per Day
qudtReference: http://qudt.org/vocab/unit/GAL_UK-PER-DAY
ucumCode: [gal_br].d-1
unitSymbol: gal{UK}/day
EMMO 967080e5 2f42 4eb2 a3a9 c58143e835f9: unit gallon (UK dry or liq.) according to the Imperial system of units divided by the SI unit day -- QUDT

Gal_Uk_Per_Hr
type: Class
comment: unit gallon (UK dry or Liq.) according to the Imperial system of units divided by the SI unit hour -- QUDT
subclass of: Restriction
  has value: 1.262803e-06
subclass of: Restriction
  has value: 0e+00
alternative label: Gallon (UK) Per Hour
qudtReference: http://qudt.org/vocab/unit/GAL_UK-PER-HR
ucumCode: [gal_br].h-1
unitSymbol: gal{UK}/hr
EMMO 967080e5 2f42 4eb2 a3a9 c58143e835f9: unit gallon (UK dry or Liq.) according to the Imperial system of units divided by the SI unit hour -- QUDT

Gal_Uk_Per_Min
type: Class
comment: unit gallon (UK dry or liq.) according to the Imperial system of units divided by the SI unit minute -- QUDT
subclass of: Restriction
  has value: 7.576817e-05
subclass of: Restriction
  has value: 0e+00
alternative label: Gallon (UK) Per Minute
qudtReference: http://qudt.org/vocab/unit/GAL_UK-PER-MIN
ucumCode: [gal_br].m-1
unitSymbol: gal{UK}/min
EMMO 967080e5 2f42 4eb2 a3a9 c58143e835f9: unit gallon (UK dry or liq.) according to the Imperial system of units divided by the SI unit minute -- QUDT

Gal_Uk_Per_Sec
type: Class
comment: unit gallon (UK dry or liq.) according to the Imperial system of units divided by the SI base unit second -- QUDT
subclass of: Restriction
  has value: 0e+00
subclass of: Restriction
  has value: 4.54609e-03
alternative label: Gallon (UK) Per Second
qudtReference: http://qudt.org/vocab/unit/GAL_UK-PER-SEC
ucumCode: [gal_br].s-1
unitSymbol: gal{UK}/s
EMMO 967080e5 2f42 4eb2 a3a9 c58143e835f9: unit gallon (UK dry or liq.) according to the Imperial system of units divided by the SI base unit second -- QUDT

Gal_Us_Per_Hr
type: Class
comment: unit gallon (US, liq.) according to the Anglo-American system of units divided by the SI unit hour -- QUDT
subclass of: Restriction
  has value: 1.051503e-06
subclass of: Restriction
  has value: 0e+00
alternative label: Gallon (US) Per Hour
qudtReference: http://qudt.org/vocab/unit/GAL_US-PER-HR
ucumCode: [gal_us].h-1
unitSymbol: gal{US}/hr
EMMO 967080e5 2f42 4eb2 a3a9 c58143e835f9: unit gallon (US, liq.) according to the Anglo-American system of units divided by the SI unit hour -- QUDT

Gal_Us_Per_Sec
type: Class
comment: unit gallon (US, liq.) according to the Anglo-American system of units divided by the SI base unit second -- QUDT
subclass of: Restriction
  has value: 3.785412e-03
subclass of: Restriction
  has value: 0e+00
alternative label: Gallon (US Liquid) Per Second
qudtReference: http://qudt.org/vocab/unit/GAL_US-PER-SEC
ucumCode: [gal_us].s-1
unitSymbol: gal{US}/s
EMMO 967080e5 2f42 4eb2 a3a9 c58143e835f9: unit gallon (US, liq.) according to the Anglo-American system of units divided by the SI base unit second -- QUDT

Galileo
type: Class
comment: CGS unit of acceleration called gal with the definition: 1 Gal = 1 cm/s -- QUDT
subclass of: Restriction
  has value: 1e-02
subclass of: Restriction
  has value: 0e+00
qudtReference: http://qudt.org/vocab/unit/GALILEO
ucumCode: Gal
unitSymbol: Gal
EMMO 967080e5 2f42 4eb2 a3a9 c58143e835f9: CGS unit of acceleration called gal with the definition: 1 Gal = 1 cm/s -- QUDT
wikipediaReference: http://en.wikipedia.org/wiki/Gal

Gamma
type: Class
comment: "Gamma" is a C.G.S System unit for 'Magnetic Field'. -- QUDT
subclass of: Restriction
  has value: 1e-09
subclass of: Restriction
  has value: 0e+00
qudtReference: http://qudt.org/vocab/unit/Gamma
unitSymbol: γ
EMMO 967080e5 2f42 4eb2 a3a9 c58143e835f9: "Gamma" is a C.G.S System unit for 'Magnetic Field'. -- QUDT
wikipediaReference: http://en.wikipedia.org/wiki/Gamma

Gi_Uk
type: Class
comment: unit of the volume for fluids according to the Imperial system of units (1/32 Imperial Gallon) -- QUDT
subclass of: Restriction
  has value: 1.420653e-04
subclass of: Restriction
  has value: 0e+00
alternative label: Gill (UK)
qudtReference: http://qudt.org/vocab/unit/GI_UK
ucumCode: [gil_br]
unitSymbol: gill{UK}
EMMO 967080e5 2f42 4eb2 a3a9 c58143e835f9: unit of the volume for fluids according to the Imperial system of units (1/32 Imperial Gallon) -- QUDT

Gi_Uk_Per_Day
type: Class
comment: unit of the volume gill (UK) for fluids according to the Imperial system of units divided by the unit for time day -- QUDT
subclass of: Restriction
  has value: 1.644274e-09
subclass of: Restriction
  has value: 0e+00
alternative label: Gill (UK) Per Day
qudtReference: http://qudt.org/vocab/unit/GI_UK-PER-DAY
ucumCode: [gil_br].d-1
unitSymbol: gill{UK}/day
EMMO 967080e5 2f42 4eb2 a3a9 c58143e835f9: unit of the volume gill (UK) for fluids according to the Imperial system of units divided by the unit for time day -- QUDT

Gi_Uk_Per_Hr
type: Class
comment: unit of the volume gill (UK) for fluids according to the Imperial system of units divided by the unit for time hour -- QUDT
subclass of: Restriction
  has value: 3.946258e-08
subclass of: Restriction
  has value: 0e+00
alternative label: Gill (UK) Per Hour
qudtReference: http://qudt.org/vocab/unit/GI_UK-PER-HR
ucumCode: [gil_br].h-1
unitSymbol: gill{UK}/hr
EMMO 967080e5 2f42 4eb2 a3a9 c58143e835f9: unit of the volume gill (UK) for fluids according to the Imperial system of units divided by the unit for time hour -- QUDT

Gi_Uk_Per_Min
type: Class
comment: unit of the volume gill (UK) for fluids according to the Imperial system of units divided by the unit for time minute -- QUDT
subclass of: Restriction
  has value: 2.367755e-06
subclass of: Restriction
  has value: 0e+00
alternative label: Gill (UK) Per Minute
qudtReference: http://qudt.org/vocab/unit/GI_UK-PER-MIN
ucumCode: [gil_br].min-1
unitSymbol: gill{UK}/min
EMMO 967080e5 2f42 4eb2 a3a9 c58143e835f9: unit of the volume gill (UK) for fluids according to the Imperial system of units divided by the unit for time minute -- QUDT

Gi_Uk_Per_Sec
type: Class
comment: unit of the volume gill (UK) for fluids according to the Imperial system of units divided by the SI base unit second -- QUDT
subclass of: Restriction
  has value: 1.420653e-04
subclass of: Restriction
  has value: 0e+00
alternative label: Gill (UK) Per Second
qudtReference: http://qudt.org/vocab/unit/GI_UK-PER-SEC
ucumCode: [gil_br].s-1
unitSymbol: gill{UK}/s
EMMO 967080e5 2f42 4eb2 a3a9 c58143e835f9: unit of the volume gill (UK) for fluids according to the Imperial system of units divided by the SI base unit second -- QUDT

Gi_Us
type: Class
comment: unit of the volume according the Anglo-American system of units (1/32 US Gallon) -- QUDT
subclass of: Restriction
  has value: 1.182941e-04
subclass of: Restriction
  has value: 0e+00
alternative label: Gill (US)
qudtReference: http://qudt.org/vocab/unit/GI_US
ucumCode: [gil_us]
unitSymbol: gill{US}
EMMO 967080e5 2f42 4eb2 a3a9 c58143e835f9: unit of the volume according the Anglo-American system of units (1/32 US Gallon) -- QUDT

Gi_Us_Per_Day
type: Class
comment: unit of the volume gill (US) for fluids according to the Anglo-American system of units divided by the unit for time day -- QUDT
subclass of: Restriction
  has value: 1.369145e-09
subclass of: Restriction
  has value: 0e+00
alternative label: Gill (US) Per Day
qudtReference: http://qudt.org/vocab/unit/GI_US-PER-DAY
ucumCode: [gil_us].d-1
unitSymbol: gill{US}/day
EMMO 967080e5 2f42 4eb2 a3a9 c58143e835f9: unit of the volume gill (US) for fluids according to the Anglo-American system of units divided by the unit for time day -- QUDT

Gi_Us_Per_Hr
type: Class
comment: unit of the volume gill (US) for fluids according to the Anglo-American system of units divided by the unit for time hour -- QUDT
subclass of: Restriction
  has value: 3.285947e-08
subclass of: Restriction
  has value: 0e+00
alternative label: Gill (US) Per Hour
qudtReference: http://qudt.org/vocab/unit/GI_US-PER-HR
ucumCode: [gil_us].h-1
unitSymbol: gill{US}/hr
EMMO 967080e5 2f42 4eb2 a3a9 c58143e835f9: unit of the volume gill (US) for fluids according to the Anglo-American system of units divided by the unit for time hour -- QUDT

Gi_Us_Per_Min
type: Class
comment: unit of the volume gill (US) for fluids according to the Anglo-American system of units divided by the unit for time minute -- QUDT
subclass of: Restriction
  has value: 1.971568e-06
subclass of: Restriction
  has value: 0e+00
alternative label: Gill (US) Per Minute
qudtReference: http://qudt.org/vocab/unit/GI_US-PER-MIN
ucumCode: [gil_us].min-1
unitSymbol: gill{US}/min
EMMO 967080e5 2f42 4eb2 a3a9 c58143e835f9: unit of the volume gill (US) for fluids according to the Anglo-American system of units divided by the unit for time minute -- QUDT

Gi_Us_Per_Sec
type: Class
comment: unit of the volume gill (US) for fluids according to the Anglo-American system of units divided by the SI base unit second -- QUDT
subclass of: Restriction
  has value: 1.182941e-04
subclass of: Restriction
  has value: 0e+00
alternative label: Gill (US) Per Second
qudtReference: http://qudt.org/vocab/unit/GI_US-PER-SEC
ucumCode: [gil_us].s-1
unitSymbol: gill{US}/s
EMMO 967080e5 2f42 4eb2 a3a9 c58143e835f9: unit of the volume gill (US) for fluids according to the Anglo-American system of units divided by the SI base unit second -- QUDT

GibiByte
type: Class
comment: The gibibyte is a multiple of the unit byte for digital information storage. The prefix gibi means 1024³ -- QUDT
subclass of: Restriction
  some values from: Byte
subclass of: Restriction
  has value: 1.073742e+09
subclass of: Restriction
  has value: 0e+00
qudtReference: http://qudt.org/vocab/unit/GibiBYTE
unitSymbol: GiB
EMMO 967080e5 2f42 4eb2 a3a9 c58143e835f9: The gibibyte is a multiple of the unit byte for digital information storage. The prefix gibi means 1024³ -- QUDT
wikipediaReference: https://en.wikipedia.org/wiki/Byte#Multiple-byte_units

GigaBasepair
type: Class
comment: A giga basepair (abbreviated Gb, or Gbp for giga basepairs.) is a unit of measurement used to help designate the length of DNA. One gigabase is equal to 1 billion bases. -- QUDT
subclass of: Restriction
  has value: 1e+09
subclass of: Restriction
  has value: 0e+00
alternative label: Giga basepair
alternative label: GigaBasePair
qudtReference: http://qudt.org/vocab/unit/GigaBasePair
unitSymbol: Gbp
EMMO 967080e5 2f42 4eb2 a3a9 c58143e835f9: A giga basepair (abbreviated Gb, or Gbp for giga basepairs.) is a unit of measurement used to help designate the length of DNA. One gigabase is equal to 1 billion bases. -- QUDT

GigaBecquerel
type: Class
comment: 1 000 000 000-fold of the derived SI unit becquerel -- QUDT
subclass of: Restriction
  has value: 1e+09
subclass of: Restriction
  has value: 0e+00
subclass of: Restriction
  some values from: Becquerel
qudtReference: http://qudt.org/vocab/unit/GigaBQ
ucumCode: GBq
unitSymbol: GBq
EMMO 967080e5 2f42 4eb2 a3a9 c58143e835f9: 1 000 000 000-fold of the derived SI unit becquerel -- QUDT

GigaBitPerSecond
type: Class
comment: A gigabit per second (Gbit/s or Gb/s) is a unit of data transfer rate equal to 1,000,000,000 bits per second. -- QUDT
subclass of: Restriction
  some values from: BitPerSecond
subclass of: Restriction
  has value: 6.931472e+08
subclass of: Restriction
  has value: 0e+00
alternative label: Gigabit per Second
qudtReference: http://qudt.org/vocab/unit/GigaBIT-PER-SEC
ucumCode: Gbit.s-1
unitSymbol: Gbps
EMMO 967080e5 2f42 4eb2 a3a9 c58143e835f9: A gigabit per second (Gbit/s or Gb/s) is a unit of data transfer rate equal to 1,000,000,000 bits per second. -- QUDT
wikipediaReference: http://en.wikipedia.org/wiki/Data-rate_units#Gigabit_per_second

GigaByte
type: Class
comment: The gigabyte is a multiple of the unit byte for digital information storage. The prefix giga means 10 in the International System of Units (SI), therefore 1 gigabyte is 1,000,000,000 bytes. The unit symbol for the gigabyte is GB or Gbyte, but not Gb (lower case b) which is typically used for the gigabit. Historically, the term has also been used in some fields of computer science and information technology to denote the gibibyte, or 1073741824 bytes. -- QUDT
subclass of: Restriction
  has value: 1e+09
subclass of: Restriction
  some values from: Byte
subclass of: Restriction
  has value: 0e+00
qudtReference: http://qudt.org/vocab/unit/GigaBYTE
ucumCode: GBy
unitSymbol: GB
EMMO 967080e5 2f42 4eb2 a3a9 c58143e835f9: The gigabyte is a multiple of the unit byte for digital information storage. The prefix giga means 10 in the International System of Units (SI), therefore 1 gigabyte is 1,000,000,000 bytes. The unit symbol for the gigabyte is GB or Gbyte, but not Gb (lower case b) which is typically used for the gigabit. Historically, the term has also been used in some fields of computer science and information technology to denote the gibibyte, or 1073741824 bytes. -- QUDT
wikipediaReference: http://en.wikipedia.org/wiki/Gigabyte

GigaCoulomb
type: Class
subclass of: Restriction
  has value: 0e+00
subclass of: Restriction
  has value: 1e+09
subclass of: Restriction
  some values from: Coulomb
qudtReference: http://qudt.org/vocab/unit/GigaC
ucumCode: GC
unitSymbol: GC

GigaCoulombPerCubicMetre
type: Class
comment: 1 000 000 000-fold of the SI derived unit coulomb divided by the power of the SI base unit metre with the exponent 3 -- QUDT
subclass of: Restriction
  some values from: CoulombPerCubicMetre
subclass of: Restriction
  has value: 0e+00
subclass of: Restriction
  has value: 1e+09
alternative label: Gigacoulomb Per Cubic Metre
qudtReference: http://qudt.org/vocab/unit/GigaC-PER-M3
ucumCode: GC.m-3
unitSymbol: GC/m³
EMMO 967080e5 2f42 4eb2 a3a9 c58143e835f9: 1 000 000 000-fold of the SI derived unit coulomb divided by the power of the SI base unit metre with the exponent 3 -- QUDT

GigaElectronVolt
type: Class
comment: "Giga Electron Volt" is a unit for 'Energy And Work' expressed as GeV. -- QUDT
subclass of: Restriction
  some values from: ElectronVolt
subclass of: Restriction
  has value: 1.602177e-10
subclass of: Restriction
  has value: 0e+00
alternative label: Giga Electron Volt
qudtReference: http://qudt.org/vocab/unit/GigaEV
ucumCode: GeV
unitSymbol: GeV
EMMO 967080e5 2f42 4eb2 a3a9 c58143e835f9: "Giga Electron Volt" is a unit for 'Energy And Work' expressed as GeV. -- QUDT

GigaHertz
type: Class
comment: The hertz (symbol Hz) is the SI unit of frequency defined as the number of cycles per second of a periodic phenomenon. A GigaHertz is 10⁹ hz. -- QUDT
subclass of: Restriction
  some values from: Hertz
subclass of: Restriction
  has value: 1e+09
subclass of: Restriction
  has value: 0e+00
qudtReference: http://qudt.org/vocab/unit/GigaHZ
ucumCode: GHz
unitSymbol: GHz
EMMO 967080e5 2f42 4eb2 a3a9 c58143e835f9: The hertz (symbol Hz) is the SI unit of frequency defined as the number of cycles per second of a periodic phenomenon. A GigaHertz is 10⁹ hz. -- QUDT

GigaHertzMetre
type: Class
comment: product of the 1 000 000 000-fold of the SI derived unit hertz and the SI base unit metre -- QUDT
subclass of: Restriction
  has value: 1e+09
subclass of: Restriction
  some values from: HertzMetre
subclass of: Restriction
  has value: 0e+00
alternative label: Gigahertz Metre
qudtReference: http://qudt.org/vocab/unit/GigaHZ-M
ucumCode: GHz.m
unitSymbol: GHz⋅M
EMMO 967080e5 2f42 4eb2 a3a9 c58143e835f9: product of the 1 000 000 000-fold of the SI derived unit hertz and the SI base unit metre -- QUDT

GigaJoule
type: Class
comment: 1 000 000 000-fold of the SI derived unit joule -- QUDT
subclass of: Restriction
  some values from: Joule
subclass of: Restriction
  has value: 1e+09
subclass of: Restriction
  has value: 0e+00
qudtReference: http://qudt.org/vocab/unit/GigaJ
ucumCode: GJ
unitSymbol: GJ
EMMO 967080e5 2f42 4eb2 a3a9 c58143e835f9: 1 000 000 000-fold of the SI derived unit joule -- QUDT

GigaOhm
type: Class
comment: 1 000 000 000-fold of the SI derived unit ohm -- QUDT
subclass of: Restriction
  has value: 1e+09
subclass of: Restriction
  has value: 0e+00
subclass of: Restriction
  some values from: Ohm
qudtReference: http://qudt.org/vocab/unit/GigaOHM
ucumCode: GOhm
unitSymbol: GΩ
EMMO 967080e5 2f42 4eb2 a3a9 c58143e835f9: 1 000 000 000-fold of the SI derived unit ohm -- QUDT

GigaPascal
type: Class
comment: 1 000 000 000-fold of the SI derived unit pascal -- QUDT
subclass of: Restriction
  some values from: Pascal
subclass of: Restriction
  has value: 1e+09
subclass of: Restriction
  has value: 0e+00
qudtReference: http://qudt.org/vocab/unit/GigaPA
ucumCode: GPa
unitSymbol: GPa
EMMO 967080e5 2f42 4eb2 a3a9 c58143e835f9: 1 000 000 000-fold of the SI derived unit pascal -- QUDT

GigaWatt
type: Class
comment: 1 000 000 000-fold of the SI derived unit watt -- QUDT
subclass of: Restriction
  some values from: Watt
subclass of: Restriction
  has value: 1e+09
subclass of: Restriction
  has value: 0e+00
qudtReference: http://qudt.org/vocab/unit/GigaW
ucumCode: GW
unitSymbol: GW
EMMO 967080e5 2f42 4eb2 a3a9 c58143e835f9: 1 000 000 000-fold of the SI derived unit watt -- QUDT

GigaWattHour
type: Class
comment: 1 000 000 000-fold of the product of the SI derived unit watt and the unit hour -- QUDT
subclass of: Restriction
  has value: 3.6e+12
subclass of: Restriction
  has value: 0e+00
alternative label: Gigawatt Hour
qudtReference: http://qudt.org/vocab/unit/GigaW-HR
ucumCode: GW.h
unitSymbol: GW⋅h
EMMO 967080e5 2f42 4eb2 a3a9 c58143e835f9: 1 000 000 000-fold of the product of the SI derived unit watt and the unit hour -- QUDT

Gilbert
type: Class
comment: The fundamental unit of magnetomotive force (mmf) in electromagnetic units is called a Gilbert. It is the mmf which will produce a magnetic field strength of one Gauss (Maxwell per Square Centimeter) in a path one centimeter long. -- QUDT
subclass of: Restriction
  has value: 7.957747e-01
subclass of: Restriction
  has value: 0e+00
qudtReference: http://qudt.org/vocab/unit/GI
ucumCode: Gb
unitSymbol: Gb
EMMO 967080e5 2f42 4eb2 a3a9 c58143e835f9: The fundamental unit of magnetomotive force (mmf) in electromagnetic units is called a Gilbert. It is the mmf which will produce a magnetic field strength of one Gauss (Maxwell per Square Centimeter) in a path one centimeter long. -- QUDT
wikipediaReference: http://en.wikipedia.org/wiki/Gilbert

Gon
type: Class
comment: "Gon" is a C.G.S System unit for 'Plane Angle' expressed as gon. -- QUDT
subclass of: Restriction
  has value: 1.570796e-02
subclass of: Restriction
  has value: 0e+00
qudtReference: http://qudt.org/vocab/unit/GON
ucumCode: gon
unitSymbol: gon
EMMO 967080e5 2f42 4eb2 a3a9 c58143e835f9: "Gon" is a C.G.S System unit for 'Plane Angle' expressed as gon. -- QUDT
wikipediaReference: http://en.wikipedia.org/wiki/Gon

Grad
type: Class
comment: "Grad" is a unit for 'Plane Angle' expressed as grad. -- QUDT
subclass of: Restriction
  has value: 1.570796e-02
subclass of: Restriction
  has value: 0e+00
qudtReference: http://qudt.org/vocab/unit/GRAD
unitSymbol: grad
EMMO 967080e5 2f42 4eb2 a3a9 c58143e835f9: "Grad" is a unit for 'Plane Angle' expressed as grad. -- QUDT
wikipediaReference: http://en.wikipedia.org/wiki/Grad

Grade
type: Class
comment: the tangent of an angle of inclination multiplied by 100 -- QUDT
subclass of: Restriction
  has value: 1e+00
subclass of: Restriction
  has value: 0e+00
qudtReference: http://qudt.org/vocab/unit/GR
unitSymbol: gr
EMMO 967080e5 2f42 4eb2 a3a9 c58143e835f9: the tangent of an angle of inclination multiplied by 100 -- QUDT
wikipediaReference: http://en.wikipedia.org/wiki/Grade

Grain
type: Class
comment: A grain is a unit of measurement of mass that is nominally based upon the mass of a single seed of a cereal. The grain is the only unit of mass measure common to the three traditional English mass and weight systems; the obsolete Tower grain was, by definition, exactly /64 of a troy grain. Since 1958, the grain or troy grain measure has been defined in terms of units of mass in the International System of Units as precisely 64.79891 milligrams. Thus, 1 gram ≈ 15.4323584 grains. There are precisely 7,000 grains per avoirdupois pound in the imperial and U.S. customary units, and 5,760 grains in the Troy pound. -- QUDT
subclass of: Restriction
  has value: 6.479891e-05
subclass of: Restriction
  has value: 0e+00
qudtReference: http://qudt.org/vocab/unit/GRAIN
ucumCode: [gr]
unitSymbol: gr{UK}
EMMO 967080e5 2f42 4eb2 a3a9 c58143e835f9: A grain is a unit of measurement of mass that is nominally based upon the mass of a single seed of a cereal. The grain is the only unit of mass measure common to the three traditional English mass and weight systems; the obsolete Tower grain was, by definition, exactly /64 of a troy grain. Since 1958, the grain or troy grain measure has been defined in terms of units of mass in the International System of Units as precisely 64.79891 milligrams. Thus, 1 gram ≈ 15.4323584 grains. There are precisely 7,000 grains per avoirdupois pound in the imperial and U.S. customary units, and 5,760 grains in the Troy pound. -- QUDT
wikipediaReference: http://en.wikipedia.org/wiki/Cereal

GrainPerGallon
type: Class
comment: "Grain per Gallon" is an Imperial unit for 'Density' expressed as gr/gal. -- QUDT
subclass of: Restriction
  has value: 1.711806e-02
subclass of: Restriction
  has value: 0e+00
alternative label: Grain per Gallon
qudtReference: http://qudt.org/vocab/unit/GRAIN-PER-GAL
ucumCode: [gr].[gal_br]-1
unitSymbol: grain{UK}/gal
EMMO 967080e5 2f42 4eb2 a3a9 c58143e835f9: "Grain per Gallon" is an Imperial unit for 'Density' expressed as gr/gal. -- QUDT

Grain_Per_Gal_Us
type: Class
comment: unit of the density according to the Anglo-American system of units -- QUDT
subclass of: Restriction
  has value: 0e+00
subclass of: Restriction
  has value: 1.711806e-02
alternative label: Grain Per Gallon (US)
qudtReference: http://qudt.org/vocab/unit/GRAIN-PER-GAL_US
ucumCode: [gr].[gal_us]-1
unitSymbol: grain{US}/gal
EMMO 967080e5 2f42 4eb2 a3a9 c58143e835f9: unit of the density according to the Anglo-American system of units -- QUDT

GramCarbonPerSquareMetrePerDay
type: Class
comment: A metric unit of volume over time indicating the amount generated across one square meter over a day. Used to express productivity of an ecosystem. -- QUDT
subclass of: Restriction
  has value: 1.157407e-08
subclass of: Restriction
  has value: 0e+00
alternative label: grams Carbon per square metre per day
qudtReference: http://qudt.org/vocab/unit/GM_Carbon-PER-M2-DAY
ucumCode: g.m-2.d-1{C}
unitSymbol: g{carbon}/(m²⋅day)
EMMO 967080e5 2f42 4eb2 a3a9 c58143e835f9: A metric unit of volume over time indicating the amount generated across one square meter over a day. Used to express productivity of an ecosystem. -- QUDT

GramDegreeCelsius
type: Class
comment: `Gram Degree Celsius` is a C.G.S System unit for 'Mass Temperature' expressed as g · degC. -- QUDT
alternative label: Gram Degree Celsius
qudtReference: http://qudt.org/vocab/unit/GM-PER-DEG_C
ucumCode: d.Cel-1
unitSymbol: g/°C
EMMO 967080e5 2f42 4eb2 a3a9 c58143e835f9: `Gram Degree Celsius` is a C.G.S System unit for 'Mass Temperature' expressed as g · degC. -- QUDT

GramForce
type: Class
comment: "Gram Force" is a unit for 'Force' expressed as gf. -- QUDT
subclass of: Restriction
  has value: 9.80665e-03
subclass of: Restriction
  has value: 0e+00
alternative label: Gram Force
qudtReference: http://qudt.org/vocab/unit/GM_F
ucumCode: gf
unitSymbol: gf
EMMO 967080e5 2f42 4eb2 a3a9 c58143e835f9: "Gram Force" is a unit for 'Force' expressed as gf. -- QUDT
wikipediaReference: http://en.wikipedia.org/wiki/Kilogram-force

GramForcePerSquareCentiMetre
type: Class
comment: not SI conform unit of the pressure -- QUDT
subclass of: Restriction
  has value: 9.80665e+01
subclass of: Restriction
  has value: 0e+00
alternative label: Gram Force Per Square Centimetre
qudtReference: http://qudt.org/vocab/unit/GM_F-PER-CentiM2
ucumCode: gf.cm-2
unitSymbol: gf/cm²
EMMO 967080e5 2f42 4eb2 a3a9 c58143e835f9: not SI conform unit of the pressure -- QUDT

GramMilliMetre
type: Class
comment: unit of the imbalance as product of the 0.001-fold of the SI base unit kilogram and the 0.001-fold of the SI base unit metre -- QUDT
subclass of: Restriction
  has value: 1e-06
subclass of: Restriction
  has value: 0e+00
alternative label: Gram Millimetre
qudtReference: http://qudt.org/vocab/unit/GM-MilliM
ucumCode: g.mm
unitSymbol: g·mm
EMMO 967080e5 2f42 4eb2 a3a9 c58143e835f9: unit of the imbalance as product of the 0.001-fold of the SI base unit kilogram and the 0.001-fold of the SI base unit metre -- QUDT

GramNitrogenPerSquareMetrePerDay
type: Class
comment: A metric unit of volume over time indicating the amount of Nitrogen generated across one square meter over a day. Used to express productivity of an ecosystem. -- QUDT
subclass of: Restriction
  has value: 0e+00
subclass of: Restriction
  has value: 1.157407e-08
alternative label: grams Nitrogen per square metre per day
qudtReference: http://qudt.org/vocab/unit/GM_Nitrogen-PER-M2-DAY
ucumCode: g.m-2.d-1{N}
unitSymbol: g{nitrogen}/(m²⋅day)
EMMO 967080e5 2f42 4eb2 a3a9 c58143e835f9: A metric unit of volume over time indicating the amount of Nitrogen generated across one square meter over a day. Used to express productivity of an ecosystem. -- QUDT

GramPerCubicCentiMetre
type: Class
comment: 0,001-fold of the SI base unit kilogram divided by the 0.000 001-fold of the power of the SI base unit metre with the exponent 3 -- QUDT
subclass of: Restriction
  has value: 1e+03
subclass of: Restriction
  has value: 0e+00
alternative label: Gram Per Cubic Centimetre
qudtReference: http://qudt.org/vocab/unit/GM-PER-CentiM3
ucumCode: g.cm-3
ucumCode: g/cm3
unitSymbol: g/cm³
EMMO 967080e5 2f42 4eb2 a3a9 c58143e835f9: 0,001-fold of the SI base unit kilogram divided by the 0.000 001-fold of the power of the SI base unit metre with the exponent 3 -- QUDT

GramPerCubicDeciMetre
type: Class
comment: 0,001-fold of the SI base unit kilogram divided by the 0.001-fold of the power of the SI base unit metre with the exponent 3 -- QUDT
subclass of: Restriction
  has value: 1e+00
subclass of: Restriction
  has value: 0e+00
alternative label: Gram Per Cubic Decimetre
qudtReference: http://qudt.org/vocab/unit/GM-PER-DeciM3
ucumCode: g.dm-3
unitSymbol: g/dm³
EMMO 967080e5 2f42 4eb2 a3a9 c58143e835f9: 0,001-fold of the SI base unit kilogram divided by the 0.001-fold of the power of the SI base unit metre with the exponent 3 -- QUDT

GramPerKiloMetre
type: Class
comment: 0,001-fold of the SI base unit kilogram divided by the 1000-fold of the SI base unit metre -- QUDT
subclass of: Restriction
  has value: 1e-06
subclass of: Restriction
  has value: 0e+00
alternative label: Gram Per Kilometre
qudtReference: http://qudt.org/vocab/unit/GM-PER-KiloM
ucumCode: g.km-1
unitSymbol: g/km
EMMO 967080e5 2f42 4eb2 a3a9 c58143e835f9: 0,001-fold of the SI base unit kilogram divided by the 1000-fold of the SI base unit metre -- QUDT

GramPerMilliMetre
type: Class
comment: 0,001-fold of the SI base unit kilogram divided by the 0.001-fold the SI base unit meter -- QUDT
subclass of: Restriction
  has value: 0e+00
subclass of: Restriction
  has value: 1e+00
alternative label: Gram Per Millimetre
qudtReference: http://qudt.org/vocab/unit/GM-PER-MilliM
ucumCode: g.mm-1
unitSymbol: g/mm
EMMO 967080e5 2f42 4eb2 a3a9 c58143e835f9: 0,001-fold of the SI base unit kilogram divided by the 0.001-fold the SI base unit meter -- QUDT

GramPerMole
type: Class
comment: 0,01-fold of the SI base unit kilogram divided by the SI base unit mol -- QUDT
subclass of: Restriction
  has value: 1e-03
subclass of: Restriction
  has value: 0e+00
alternative label: Gram Per Mole
qudtReference: http://qudt.org/vocab/unit/GM-PER-MOL
ucumCode: g.mol-1
unitSymbol: g/mol
EMMO 967080e5 2f42 4eb2 a3a9 c58143e835f9: 0,01-fold of the SI base unit kilogram divided by the SI base unit mol -- QUDT

GramPerSquareCentiMetrePerYear
type: Class
comment: A rate of change of 0.001 of the SI unit of mass over 0.00001 of the SI unit of area in a period of an average calendar year (365.25 days) -- QUDT
subclass of: Restriction
  has value: 3.168809e-07
subclass of: Restriction
  has value: 0e+00
alternative label: Grams per square centimetre per year
qudtReference: http://qudt.org/vocab/unit/GM-PER-CentiM2-YR
ucumCode: g.cm-2.a-1
unitSymbol: g/(cm²⋅yr)
EMMO 967080e5 2f42 4eb2 a3a9 c58143e835f9: A rate of change of 0.001 of the SI unit of mass over 0.00001 of the SI unit of area in a period of an average calendar year (365.25 days) -- QUDT

GrayPerSecond
type: Class
comment: "Gray per Second" is a unit for 'Absorbed Dose Rate' expressed as Gy/s. -- QUDT
subclass of: Restriction
  has value: 1e+00
subclass of: Restriction
  has value: 0e+00
alternative label: Gray per Second
qudtReference: http://qudt.org/vocab/unit/GRAY-PER-SEC
ucumCode: Gy.s-1
unitSymbol: Gy/s
EMMO 967080e5 2f42 4eb2 a3a9 c58143e835f9: "Gray per Second" is a unit for 'Absorbed Dose Rate' expressed as Gy/s. -- QUDT

GrossTonnage
type: Class
comment: Gross tonnage (GT, G.T. or gt) is a nonlinear measure of a ship's overall internal volume. Gross tonnage is different from gross register tonnage. Gross tonnage is used to determine things such as a ship's manning regulations, safety rules, registration fees, and port dues, whereas the older gross register tonnage is a measure of the volume of only certain enclosed spaces. -- QUDT
alternative label: Gross Tonnage
qudtReference: http://qudt.org/vocab/unit/GT
ucumCode: t{gross}
unitSymbol: G.T.
EMMO 967080e5 2f42 4eb2 a3a9 c58143e835f9: Gross tonnage (GT, G.T. or gt) is a nonlinear measure of a ship's overall internal volume. Gross tonnage is different from gross register tonnage. Gross tonnage is used to determine things such as a ship's manning regulations, safety rules, registration fees, and port dues, whereas the older gross register tonnage is a measure of the volume of only certain enclosed spaces. -- QUDT
wikipediaReference: https://en.wikipedia.org/wiki/Gross_tonnage

Hartley
type: Class
comment: The "Hartley" is a unit of information. -- QUDT
subclass of: Restriction
  has value: 2.302585e+00
subclass of: Restriction
  has value: 0e+00
qudtReference: http://qudt.org/vocab/unit/HART
unitSymbol: Hart
EMMO 967080e5 2f42 4eb2 a3a9 c58143e835f9: The "Hartley" is a unit of information. -- QUDT
wikipediaReference: http://en.wikipedia.org/wiki/Hartley_(unit)

HartleyPerSecond
type: Class
comment: The "Hartley per Second" is a unit of information rate. -- QUDT
subclass of: Restriction
  has value: 1e+00
subclass of: Restriction
  has value: 0e+00
alternative label: Hartley per Second
qudtReference: http://qudt.org/vocab/unit/HART-PER-SEC
unitSymbol: Hart/s
EMMO 967080e5 2f42 4eb2 a3a9 c58143e835f9: The "Hartley per Second" is a unit of information rate. -- QUDT
wikipediaReference: http://en.wikipedia.org/wiki/Ban_(information)

Hartree
type: Class
comment: The `Hartree` (symbol: E_h or Ha), also known as the `Hartree Energy`, is the atomic unit of energy. The hartree energy is equal to the absolute value of the electric potential energy of the hydrogen atom in its ground state. The energy of the electron in an H-atom in its ground state is -E_H, where E_H= 2 R_∞ · hc₀. The 2006 CODATA recommended value was E_H = 4.35974394(22) × 10⁻¹⁸ J = 27.21138386(68) eV. Definition: E_H = e²/(4π ε₀ a₀) where, e is the elementary charge, ε₀ is the electric constant, and a₀ is the Bohr radius.' -- QUDT
subclass of: Restriction
  has value: 4.359744e-18
subclass of: Restriction
  has value: 0e+00
qudtReference: http://qudt.org/vocab/unit/E_h
unitSymbol: Ha
EMMO 967080e5 2f42 4eb2 a3a9 c58143e835f9: The `Hartree` (symbol: E_h or Ha), also known as the `Hartree Energy`, is the atomic unit of energy. The hartree energy is equal to the absolute value of the electric potential energy of the hydrogen atom in its ground state. The energy of the electron in an H-atom in its ground state is -E_H, where E_H= 2 R_∞ · hc₀. The 2006 CODATA recommended value was E_H = 4.35974394(22) × 10⁻¹⁸ J = 27.21138386(68) eV. Definition: E_H = e²/(4π ε₀ a₀) where, e is the elementary charge, ε₀ is the electric constant, and a₀ is the Bohr radius.' -- QUDT
wikipediaReference: http://en.wikipedia.org/wiki/Hartree

HeartBeatsPerMinute
type: Class
comment: "Heart Beat per Minute" is a unit for 'Heart Rate' expressed as BPM. -- QUDT
alternative label: Heart Beats per Minute
qudtReference: http://qudt.org/vocab/unit/BEAT-PER-MIN
ucumCode: /min{H.B.}
ucumCode: min-1{H.B.}
unitSymbol: BPM
EMMO 967080e5 2f42 4eb2 a3a9 c58143e835f9: "Heart Beat per Minute" is a unit for 'Heart Rate' expressed as BPM. -- QUDT

Hectare
type: Class
comment: A non-SI metric unit of area defined as the square with 100-metre sides.
comment: The customary metric unit of land area, equal to 100 ares. One hectare is a square hectometer, that is, the area of a square 100 meters on each side: exactly 10 000 square meters or approximately 107 639.1 square feet, 11 959.9 square yards, or 2.471 054 acres. -- QUDT
subclass of: Restriction
  has value: 0e+00
subclass of: Restriction
  has value: ha
subclass of: Restriction
  has value: 1e+04
unit code: HAR
qudtReference: http://qudt.org/vocab/unit/HA
ucumCode: har
dbpediaReference: http://dbpedia.org/page/Hectare
EMMO 70fe84ff 99b6 4206 a9fc 9a8931836d84: A non-SI metric unit of area defined as the square with 100-metre sides.
EMMO 967080e5 2f42 4eb2 a3a9 c58143e835f9: The customary metric unit of land area, equal to 100 ares. One hectare is a square hectometer, that is, the area of a square 100 meters on each side: exactly 10 000 square meters or approximately 107 639.1 square feet, 11 959.9 square yards, or 2.471 054 acres. -- QUDT
wikipediaReference: https://en.wikipedia.org/wiki/Hectare

HectoBar
type: Class
comment: 100-fold of the unit bar -- QUDT
subclass of: Restriction
  some values from: Bar
subclass of: Restriction
  has value: 1e+07
subclass of: Restriction
  has value: 0e+00
qudtReference: http://qudt.org/vocab/unit/HectoBAR
ucumCode: hbar
unitSymbol: hbar
EMMO 967080e5 2f42 4eb2 a3a9 c58143e835f9: 100-fold of the unit bar -- QUDT

HectoCoulomb
type: Class
comment: "HectoCoulomb" is a unit for 'Electric Charge' expressed as hC. -- QUDT
subclass of: Restriction
  has value: 0e+00
subclass of: Restriction
  some values from: Coulomb
subclass of: Restriction
  has value: 1e+02
qudtReference: http://qudt.org/vocab/unit/HectoC
ucumCode: hC
unitSymbol: hC
EMMO 967080e5 2f42 4eb2 a3a9 c58143e835f9: "HectoCoulomb" is a unit for 'Electric Charge' expressed as hC. -- QUDT

HectoGram
type: Class
comment: 0.1-fold of the SI base unit kilogram -- QUDT
subclass of: Restriction
  has value: 0e+00
subclass of: Restriction
  some values from: Gram
subclass of: Restriction
  has value: 1e-01
qudtReference: http://qudt.org/vocab/unit/HectoGM
ucumCode: hg
unitSymbol: hg
EMMO 967080e5 2f42 4eb2 a3a9 c58143e835f9: 0.1-fold of the SI base unit kilogram -- QUDT

HectoLitre
type: Class
comment: 100-fold of the unit litre -- QUDT
subclass of: Restriction
  has value: 0e+00
subclass of: Restriction
  has value: 1e-01
subclass of: Restriction
  some values from: Litre
qudtReference: http://qudt.org/vocab/unit/HectoL
ucumCode: hL
unitSymbol: hL
EMMO 967080e5 2f42 4eb2 a3a9 c58143e835f9: 100-fold of the unit litre -- QUDT

HectoMetre
type: Class
comment: 100-fold of the SI base unit metre -- QUDT
subclass of: Restriction
  has value: 1e+02
subclass of: Restriction
  has value: 0e+00
subclass of: Restriction
  some values from: Metre
qudtReference: http://qudt.org/vocab/unit/HectoM
ucumCode: hm
unitSymbol: hm
EMMO 967080e5 2f42 4eb2 a3a9 c58143e835f9: 100-fold of the SI base unit metre -- QUDT

HectoPascal
type: Class
comment: Hectopascal is a unit of pressure. 1 Pa is approximately the pressure exerted by a 10-g mass resting on a 1-cm2 area. 1013 hPa = 1 atm. There are 100 pascals in 1 hectopascal. -- QUDT
subclass of: Restriction
  some values from: Pascal
subclass of: Restriction
  has value: 1e+02
subclass of: Restriction
  has value: 0e+00
qudtReference: http://qudt.org/vocab/unit/HectoPA
ucumCode: hPa
unitSymbol: hPa
EMMO 967080e5 2f42 4eb2 a3a9 c58143e835f9: Hectopascal is a unit of pressure. 1 Pa is approximately the pressure exerted by a 10-g mass resting on a 1-cm2 area. 1013 hPa = 1 atm. There are 100 pascals in 1 hectopascal. -- QUDT

HectoPascalCubicMetrePerSecond
type: Class
comment: product out of the 100-fold of the SI unit pascal and the power of the SI base unit metre with the exponent 3 divided by the SI base unit second -- QUDT
subclass of: Restriction
  some values from: PascalCubicMetrePerSecond
subclass of: Restriction
  has value: 1e+02
subclass of: Restriction
  has value: 0e+00
alternative label: Hectopascal Cubic Metre Per Second
qudtReference: http://qudt.org/vocab/unit/HectoPA-M3-PER-SEC
ucumCode: hPa.m3.s-1
unitSymbol: hPa⋅m³/s
EMMO 967080e5 2f42 4eb2 a3a9 c58143e835f9: product out of the 100-fold of the SI unit pascal and the power of the SI base unit metre with the exponent 3 divided by the SI base unit second -- QUDT

HectoPascalLitrePerSecond
type: Class
comment: product out of the 100-fold of the SI derived unit pascal and the unit litre divided by the SI base unit second -- QUDT
subclass of: Restriction
  some values from: PascalLitrePerSecond
subclass of: Restriction
  has value: 1e-01
subclass of: Restriction
  has value: 0e+00
alternative label: Hectopascal Litre Per Second
qudtReference: http://qudt.org/vocab/unit/HectoPA-L-PER-SEC
ucumCode: hPa.L.s-1
unitSymbol: hPa⋅L/s
EMMO 967080e5 2f42 4eb2 a3a9 c58143e835f9: product out of the 100-fold of the SI derived unit pascal and the unit litre divided by the SI base unit second -- QUDT

HectoPascalPerBar
type: Class
comment: 100-fold of the SI derived unit pascal divided by the unit bar -- QUDT
subclass of: Restriction
  some values from: PascalPerBar
subclass of: Restriction
  has value: 1e-03
subclass of: Restriction
  has value: 0e+00
alternative label: Hectopascal Per Bar
qudtReference: http://qudt.org/vocab/unit/HectoPA-PER-BAR
ucumCode: hPa.bar-1
unitSymbol: hPa/bar
EMMO 967080e5 2f42 4eb2 a3a9 c58143e835f9: 100-fold of the SI derived unit pascal divided by the unit bar -- QUDT

HectoPascalPerHour
type: Class
comment: A change in pressure of one hundred Newtons per square metre (100 Pascals) per hour. Equivalent to a change of one millibar per hour. -- QUDT
subclass of: Restriction
  some values from: PascalPerHour
subclass of: Restriction
  has value: 2.777778e-02
subclass of: Restriction
  has value: 0e+00
alternative label: Hectopascals per hour
qudtReference: http://qudt.org/vocab/unit/HectoPA-PER-HR
ucumCode: hPa.h-1
unitSymbol: hPa/h
EMMO 967080e5 2f42 4eb2 a3a9 c58143e835f9: A change in pressure of one hundred Newtons per square metre (100 Pascals) per hour. Equivalent to a change of one millibar per hour. -- QUDT

HectoPascalPerKelvin
type: Class
comment: 100-fold of the SI derived unit pascal divided by the SI base unit kelvin -- QUDT
subclass of: Restriction
  some values from: PascalPerKelvin
subclass of: Restriction
  has value: 1e+02
subclass of: Restriction
  has value: 0e+00
alternative label: Hectopascal Per Kelvin
qudtReference: http://qudt.org/vocab/unit/HectoPA-PER-K
ucumCode: hPa.K-1
unitSymbol: hPa/K
EMMO 967080e5 2f42 4eb2 a3a9 c58143e835f9: 100-fold of the SI derived unit pascal divided by the SI base unit kelvin -- QUDT

HertzPerVolt
type: Class
comment: In the Hertz per Volt standard the frequency of the note is directly related to the voltage. A pitch of a note goes up one octave when its frequency doubles, meaning that the voltage will have to double for every octave rise. Depending on the footage (octave) selected, nominally one volt gives 1000Hz, two volts 2000Hz and so on. In terms of notes, bottom C would be 0.25 volts, the next C up would be 0.5 volts, then 1V, 2V, 4V, 8V for the following octaves. This system was used mainly by Yamaha and Korg. -- QUDT
subclass of: Restriction
  has value: 1e+00
subclass of: Restriction
  has value: 0e+00
alternative label: Hertz per Volt
qudtReference: http://qudt.org/vocab/unit/HZ-PER-V
ucumCode: Hz.V-1
unitSymbol: Hz/V
EMMO 967080e5 2f42 4eb2 a3a9 c58143e835f9: In the Hertz per Volt standard the frequency of the note is directly related to the voltage. A pitch of a note goes up one octave when its frequency doubles, meaning that the voltage will have to double for every octave rise. Depending on the footage (octave) selected, nominally one volt gives 1000Hz, two volts 2000Hz and so on. In terms of notes, bottom C would be 0.25 volts, the next C up would be 0.5 volts, then 1V, 2V, 4V, 8V for the following octaves. This system was used mainly by Yamaha and Korg. -- QUDT

Horsepower
type: Class
comment: 550 foot-pound force per second -- QUDT
subclass of: Restriction
  has value: 7.456999e+02
subclass of: Restriction
  has value: 0e+00
qudtReference: http://qudt.org/vocab/unit/HP
ucumCode: [HP]
unitSymbol: HP
EMMO 967080e5 2f42 4eb2 a3a9 c58143e835f9: 550 foot-pound force per second -- QUDT
wikipediaReference: http://en.wikipedia.org/wiki/Horsepower

Hour
type: Class
comment: Measure of time defined as 3600 seconds.
comment: The hour (common symbol: h or hr) is a unit of measurement of time. In modern usage, an hour comprises 60 minutes, or 3,600 seconds. It is approximately 1/24 of a mean solar day. An hour in the Universal Coordinated Time (UTC) time standard can include a negative or positive leap second, and may therefore have a duration of 3,599 or 3,601 seconds for adjustment purposes. Although it is not a standard defined by the International System of Units, the hour is a unit accepted for use with SI, represented by the symbol h. -- QUDT
subclass of: Restriction
  has value: 3.6e+03
subclass of: Restriction
  has value: 0e+00
subclass of: Restriction
  has value: h
unit code: HUR
qudtReference: http://qudt.org/vocab/unit/HR
ucumCode: h
EMMO 70fe84ff 99b6 4206 a9fc 9a8931836d84: Measure of time defined as 3600 seconds.
EMMO 967080e5 2f42 4eb2 a3a9 c58143e835f9: The hour (common symbol: h or hr) is a unit of measurement of time. In modern usage, an hour comprises 60 minutes, or 3,600 seconds. It is approximately 1/24 of a mean solar day. An hour in the Universal Coordinated Time (UTC) time standard can include a negative or positive leap second, and may therefore have a duration of 3,599 or 3,601 seconds for adjustment purposes. Although it is not a standard defined by the International System of Units, the hour is a unit accepted for use with SI, represented by the symbol h. -- QUDT
iupacReference: https://doi.org/10.1351/goldbook.H02866

HourSquareFoot
type: Class
comment: "Hour Square Foot" is an Imperial unit for 'Area Time' expressed as hr-ft². -- QUDT
subclass of: Restriction
  has value: 3.344509e+02
subclass of: Restriction
  has value: 0e+00
alternative label: Hour Square Foot
qudtReference: http://qudt.org/vocab/unit/HR-FT2
ucumCode: h.[ft_i]2
ucumCode: h.[sft_i]
unitSymbol: hr⋅ft²
EMMO 967080e5 2f42 4eb2 a3a9 c58143e835f9: "Hour Square Foot" is an Imperial unit for 'Area Time' expressed as hr-ft². -- QUDT

Hp_Brake
type: Class
comment: unit of the power according to the Imperial system of units -- QUDT
subclass of: Restriction
  has value: 0e+00
subclass of: Restriction
  has value: 9.8095e+03
alternative label: Horsepower (brake)
qudtReference: http://qudt.org/vocab/unit/HP_Brake
unitSymbol: HP{brake}
EMMO 967080e5 2f42 4eb2 a3a9 c58143e835f9: unit of the power according to the Imperial system of units -- QUDT

Hp_Electric
type: Class
comment: unit of the power according to the Anglo-American system of units -- QUDT
subclass of: Restriction
  has value: 7.46e+02
subclass of: Restriction
  has value: 0e+00
alternative label: Horsepower (electric)
qudtReference: http://qudt.org/vocab/unit/HP_Electric
unitSymbol: HP{electric}
EMMO 967080e5 2f42 4eb2 a3a9 c58143e835f9: unit of the power according to the Anglo-American system of units -- QUDT

Hp_Metric
type: Class
comment: unit of the mechanical power according to the Anglo-American system of units -- QUDT
subclass of: Restriction
  has value: 7.354988e+02
subclass of: Restriction
  has value: 0e+00
alternative label: Horsepower (metric)
qudtReference: http://qudt.org/vocab/unit/HP_Metric
unitSymbol: HP{metric}
EMMO 967080e5 2f42 4eb2 a3a9 c58143e835f9: unit of the mechanical power according to the Anglo-American system of units -- QUDT

HundredWeight_Short
type: Class
comment: "Hundred Weight - Short" is a unit for 'Mass' expressed as cwt. -- QUDT
subclass of: Restriction
  has value: 4.535924e+01
subclass of: Restriction
  has value: 0e+00
alternative label: Hundred Weight - Short
qudtReference: http://qudt.org/vocab/unit/CWT_SHORT
ucumCode: [scwt_av]
unitSymbol: cwt{short}
EMMO 967080e5 2f42 4eb2 a3a9 c58143e835f9: "Hundred Weight - Short" is a unit for 'Mass' expressed as cwt. -- QUDT

Hundredweight_Uk
type: Class
comment: out of use unit of the mass according to the Imperial system of units -- QUDT
subclass of: Restriction
  has value: 5.080235e+01
subclass of: Restriction
  has value: 0e+00
alternative label: Hundredweight (UK)
qudtReference: http://qudt.org/vocab/unit/Hundredweight_UK
ucumCode: [lcwt_av]
unitSymbol: cwt{long}
EMMO 967080e5 2f42 4eb2 a3a9 c58143e835f9: out of use unit of the mass according to the Imperial system of units -- QUDT

Hundredweight_Us
type: Class
comment: out of use unit of the mass according to the Imperial system of units -- QUDT
subclass of: Restriction
  has value: 4.535924e+01
subclass of: Restriction
  has value: 0e+00
alternative label: Hundredweight (US)
qudtReference: http://qudt.org/vocab/unit/Hundredweight_US
ucumCode: [scwt_av]
unitSymbol: cwt{short}
EMMO 967080e5 2f42 4eb2 a3a9 c58143e835f9: out of use unit of the mass according to the Imperial system of units -- QUDT

ImperialGallon
type: Class
comment: "Imperial Gallon" is an Imperial unit for 'Liquid Volume' expressed as galIMP. -- QUDT
subclass of: Restriction
  has value: 4.54609e-03
subclass of: Restriction
  has value: 0e+00
alternative label: Imperial Gallon
qudtReference: http://qudt.org/vocab/unit/GAL_IMP
ucumCode: [gal_br]
unitSymbol: gal{Imp}
EMMO 967080e5 2f42 4eb2 a3a9 c58143e835f9: "Imperial Gallon" is an Imperial unit for 'Liquid Volume' expressed as galIMP. -- QUDT

ImperialMassOuncePerCubicInch
type: Class
comment: "Ounce per Cubic Inch" is an Imperial unit for 'Density' expressed as oz/in³. -- QUDT
subclass of: Restriction
  has value: 1.729994e+03
subclass of: Restriction
  has value: 0e+00
alternative label: Imperial Mass Ounce per Cubic Inch
qudtReference: http://qudt.org/vocab/unit/OZ-PER-IN3
ucumCode: [oz_av].[cin_i]-1
unitSymbol: oz/in³{US}
EMMO 967080e5 2f42 4eb2 a3a9 c58143e835f9: "Ounce per Cubic Inch" is an Imperial unit for 'Density' expressed as oz/in³. -- QUDT

ImperialMassOuncePerGallon
type: Class
comment: "Ounce per Gallon" is an Imperial unit for 'Density' expressed as oz/gal. -- QUDT
subclass of: Restriction
  has value: 6.236023e+00
subclass of: Restriction
  has value: 0e+00
alternative label: Imperial Mass Ounce per Gallon
qudtReference: http://qudt.org/vocab/unit/OZ-PER-GAL
ucumCode: [oz_av].[gal_br]-1
unitSymbol: oz/gal{US}
EMMO 967080e5 2f42 4eb2 a3a9 c58143e835f9: "Ounce per Gallon" is an Imperial unit for 'Density' expressed as oz/gal. -- QUDT

ImperialMassOuncePerSquareFoot
type: Class
comment: "Ounce per Square Foot" is an Imperial unit for 'Mass Per Area' expressed as oz/ft². -- QUDT
subclass of: Restriction
  has value: 3.051517e-01
subclass of: Restriction
  has value: 0e+00
alternative label: Imperial Mass Ounce per Square Foot
qudtReference: http://qudt.org/vocab/unit/OZ-PER-FT2
ucumCode: [oz_av].[sft_i]-1
unitSymbol: oz/ft²{US}
EMMO 967080e5 2f42 4eb2 a3a9 c58143e835f9: "Ounce per Square Foot" is an Imperial unit for 'Mass Per Area' expressed as oz/ft². -- QUDT

ImperialMassOuncePerSquareYard
type: Class
comment: "Ounce per Square Yard" is an Imperial unit for 'Mass Per Area' expressed as oz/yd². -- QUDT
subclass of: Restriction
  has value: 3.390575e-02
subclass of: Restriction
  has value: 0e+00
alternative label: Imperial Mass Ounce per Square Yard
qudtReference: http://qudt.org/vocab/unit/OZ-PER-YD2
ucumCode: [oz_av].[syd_i]-1
unitSymbol: oz/yd³{US}
EMMO 967080e5 2f42 4eb2 a3a9 c58143e835f9: "Ounce per Square Yard" is an Imperial unit for 'Mass Per Area' expressed as oz/yd². -- QUDT

ImperialOunceForce
type: Class
comment: "Ounce Force" is an Imperial unit for 'Force' expressed as ozf. -- QUDT
subclass of: Restriction
  has value: 0e+00
subclass of: Restriction
  has value: 2.780139e-01
alternative label: Imperial Ounce Force
qudtReference: http://qudt.org/vocab/unit/OZ_F
ucumCode: [ozf_av]
unitSymbol: ozf
EMMO 967080e5 2f42 4eb2 a3a9 c58143e835f9: "Ounce Force" is an Imperial unit for 'Force' expressed as ozf. -- QUDT

ImperialOunceForceInch
type: Class
comment: "Ounce Force Inch" is an Imperial unit for 'Torque' expressed as ozf-in. -- QUDT
subclass of: Restriction
  has value: 7.061552e-02
subclass of: Restriction
  has value: 0e+00
alternative label: Imperial Ounce Force Inch
qudtReference: http://qudt.org/vocab/unit/OZ_F-IN
ucumCode: [ozf_av].[in_i]
unitSymbol: ozf⋅in
EMMO 967080e5 2f42 4eb2 a3a9 c58143e835f9: "Ounce Force Inch" is an Imperial unit for 'Torque' expressed as ozf-in. -- QUDT

ImperialPint
type: Class
comment: "Imperial Pint" is an Imperial unit for 'Volume' expressed as pint. -- QUDT
subclass of: Restriction
  has value: 5.682613e-04
subclass of: Restriction
  has value: 0e+00
alternative label: Imperial Pint
qudtReference: http://qudt.org/vocab/unit/PINT
ucumCode: [pt_br]
unitSymbol: pt
EMMO 967080e5 2f42 4eb2 a3a9 c58143e835f9: "Imperial Pint" is an Imperial unit for 'Volume' expressed as pint. -- QUDT

InchOfMercury
type: Class
comment: Inches of mercury, (inHg) is a unit of measurement for pressure. It is still widely used for barometric pressure in weather reports, refrigeration and aviation in the United States, but is seldom used elsewhere. It is defined as the pressure exerted by a column of mercury of 1 inch in height at 32 °F at the standard acceleration of gravity. 1 inHg = 3,386.389 pascals at 0 °C. -- QUDT
subclass of: Restriction
  has value: 0e+00
subclass of: Restriction
  has value: 3.386389e+03
alternative label: Inch of Mercury
qudtReference: http://qudt.org/vocab/unit/IN_HG
ucumCode: [in_i'Hg]
unitSymbol: inHg
EMMO 967080e5 2f42 4eb2 a3a9 c58143e835f9: Inches of mercury, (inHg) is a unit of measurement for pressure. It is still widely used for barometric pressure in weather reports, refrigeration and aviation in the United States, but is seldom used elsewhere. It is defined as the pressure exerted by a column of mercury of 1 inch in height at 32 °F at the standard acceleration of gravity. 1 inHg = 3,386.389 pascals at 0 °C. -- QUDT
wikipediaReference: http://en.wikipedia.org/wiki/Inch_of_mercury

InchOfWater
type: Class
comment: Inches of water, wc, inch water column (inch WC), inAq, Aq, or inH2O is a non-SI unit for pressure. The units are by convention and due to the historical measurement of certain pressure differentials. It is used for measuring small pressure differences across an orifice, or in a pipeline or shaft. Inches of water can be converted to a pressure unit using the formula for pressure head. It is defined as the pressure exerted by a column of water of 1 inch in height at defined conditions for example 39 °F at the standard acceleration of gravity; 1 inAq is approximately equal to 249 pascals at 0 °C. -- QUDT
subclass of: Restriction
  has value: 2.4908e+02
subclass of: Restriction
  has value: 0e+00
alternative label: Inch of Water
qudtReference: http://qudt.org/vocab/unit/IN_H2O
ucumCode: [in_i'H2O]
unitSymbol: inH₂0
EMMO 967080e5 2f42 4eb2 a3a9 c58143e835f9: Inches of water, wc, inch water column (inch WC), inAq, Aq, or inH2O is a non-SI unit for pressure. The units are by convention and due to the historical measurement of certain pressure differentials. It is used for measuring small pressure differences across an orifice, or in a pipeline or shaft. Inches of water can be converted to a pressure unit using the formula for pressure head. It is defined as the pressure exerted by a column of water of 1 inch in height at defined conditions for example 39 °F at the standard acceleration of gravity; 1 inAq is approximately equal to 249 pascals at 0 °C. -- QUDT
wikipediaReference: http://en.wikipedia.org/wiki/Inch_of_water

InchPerDegreeFahrenheit
type: Class
comment: unit inch according to the Anglo-American and the Imperial system of units divided by the unit for temperature degree Fahrenheit -- QUDT
subclass of: Restriction
  has value: 4.572e-02
subclass of: Restriction
  has value: 0e+00
alternative label: Inch Per Degree Fahrenheit
qudtReference: http://qudt.org/vocab/unit/IN-PER-DEG_F
ucumCode: [in_i].[degF]-1
unitSymbol: in/°F
EMMO 967080e5 2f42 4eb2 a3a9 c58143e835f9: unit inch according to the Anglo-American and the Imperial system of units divided by the unit for temperature degree Fahrenheit -- QUDT

InchPerSecond
type: Class
comment: The inch per second is a unit of speed or velocity. It expresses the distance in inches (in) traveled or displaced, divided by time in seconds (s, or sec). The equivalent SI unit is the metre per second. Abbreviations include in/s, in/sec, ips, and less frequently in s. -- QUDT
subclass of: Restriction
  has value: 0e+00
subclass of: Restriction
  has value: 2.54e-02
alternative label: Inch per Second
qudtReference: http://qudt.org/vocab/unit/IN-PER-SEC
ucumCode: [in_i].s-1
ucumCode: [in_i]/s
unitSymbol: in/s
EMMO 967080e5 2f42 4eb2 a3a9 c58143e835f9: The inch per second is a unit of speed or velocity. It expresses the distance in inches (in) traveled or displaced, divided by time in seconds (s, or sec). The equivalent SI unit is the metre per second. Abbreviations include in/s, in/sec, ips, and less frequently in s. -- QUDT

InchPerSquareSecond
type: Class
comment: `Inch per Square second` is an Imperial unit for `Linear Acceleration` expressed as in/s². -- QUDT
subclass of: Restriction
  has value: 2.54e-02
subclass of: Restriction
  has value: 0e+00
alternative label: Inch per Square second
qudtReference: http://qudt.org/vocab/unit/IN-PER-SEC2
ucumCode: [in_i].s-2
ucumCode: [in_i]/s2
unitSymbol: in/s²
EMMO 967080e5 2f42 4eb2 a3a9 c58143e835f9: `Inch per Square second` is an Imperial unit for `Linear Acceleration` expressed as in/s². -- QUDT

InternationalMile
type: Class
comment: The exact length of the land mile varied slightly among English-speaking countries until the international yard and pound agreement in 1959 established the yard as exactly 0.9144 metres, giving a mile of exactly 1,609.344 metres. The United States adopted this international mile for most purposes, but retained the pre-1959 mile for some land-survey data, terming it the US survey mile. In the US, statute mile formally refers to the survey mile, about 3.219 mm (1/8 inch) longer than the international mile (the international mile is exactly 0.0002% less than the US survey mile). -- QUDT
subclass of: Restriction
  has value: 1.609344e+03
subclass of: Restriction
  has value: 0e+00
alternative label: International Mile
qudtReference: http://qudt.org/vocab/unit/MI
ucumCode: [mi_i]
unitSymbol: mi
EMMO 967080e5 2f42 4eb2 a3a9 c58143e835f9: The exact length of the land mile varied slightly among English-speaking countries until the international yard and pound agreement in 1959 established the yard as exactly 0.9144 metres, giving a mile of exactly 1,609.344 metres. The United States adopted this international mile for most purposes, but retained the pre-1959 mile for some land-survey data, terming it the US survey mile. In the US, statute mile formally refers to the survey mile, about 3.219 mm (1/8 inch) longer than the international mile (the international mile is exactly 0.0002% less than the US survey mile). -- QUDT
wikipediaReference: http://en.wikipedia.org/wiki/Mile

InternationalTableCalorie
type: Class
comment: International Table calorie. -- QUDT
subclass of: Restriction
  has value: 4.1868e+00
subclass of: Restriction
  has value: 0e+00
alternative label: International Table calorie
qudtReference: http://qudt.org/vocab/unit/CAL_IT
ucumCode: cal_IT
unitSymbol: cal{IT}
EMMO 967080e5 2f42 4eb2 a3a9 c58143e835f9: International Table calorie. -- QUDT

InternationalUnit
type: Class
comment: International Unit is a unit for `Amount Of Substance` expressed as IU. -- QUDT
alternative label: International Unit
qudtReference: http://qudt.org/vocab/unit/IU
ucumCode: [IU]
ucumCode: [iU]
unitSymbol: IU
EMMO 967080e5 2f42 4eb2 a3a9 c58143e835f9: International Unit is a unit for `Amount Of Substance` expressed as IU. -- QUDT
wikipediaReference: http://en.wikipedia.org/wiki/International_unit

InternationalUnitPerLitre
type: Class
comment: "International Unit per Liter" is a unit for 'Serum Or Plasma Level' expressed as IU/L. -- QUDT
alternative label: International Unit per Litre
qudtReference: http://qudt.org/vocab/unit/IU-PER-L
ucumCode: [IU].L-1
ucumCode: [IU]/L
ucumCode: [iU].L-1
ucumCode: [iU]/L
unitSymbol: IU/L
EMMO 967080e5 2f42 4eb2 a3a9 c58143e835f9: "International Unit per Liter" is a unit for 'Serum Or Plasma Level' expressed as IU/L. -- QUDT

InternationalUnitPerMilliGram
type: Class
comment: International Units per milligramme. -- QUDT
subclass of: Restriction
  has value: 1e-06
subclass of: Restriction
  has value: 0e+00
alternative label: International Unit per milligram
qudtReference: http://qudt.org/vocab/unit/IU-PER-MilliGM
unitSymbol: IU/mg
EMMO 967080e5 2f42 4eb2 a3a9 c58143e835f9: International Units per milligramme. -- QUDT

InverseSquarePlanckMass
type: Class
comment: In physics, the Planck mass, denoted by m_P, is the unit of mass in the system of natural units known as Planck units. It is defined so that ≈ 1.2209 × 10 GeV/c₀ = 2.17651(13) × 10 kg, (or 21.7651 μ g), where c₀ is the speed of light in a vacuum, G is the gravitational constant, and ℏ is the reduced Planck constant. Particle physicists and cosmologists often use the reduced Planck mass, which is ≈ 4.341 × 10 kg = 2.435 × 10 GeV/c. The added factor of 1/√(8π) simplifies a number of equations in general relativity. Quantum effects are typified by the magnitude of Planck's constant. -- QUDT
subclass of: Restriction
  has value: 2.111089e+15
subclass of: Restriction
  has value: 0e+00
alternative label: Inverse Square Planck Mass
qudtReference: http://qudt.org/vocab/unit/PER-PlanckMass2
unitSymbol: /mₚ²
EMMO 967080e5 2f42 4eb2 a3a9 c58143e835f9: In physics, the Planck mass, denoted by m_P, is the unit of mass in the system of natural units known as Planck units. It is defined so that ≈ 1.2209 × 10 GeV/c₀ = 2.17651(13) × 10 kg, (or 21.7651 μ g), where c₀ is the speed of light in a vacuum, G is the gravitational constant, and ℏ is the reduced Planck constant. Particle physicists and cosmologists often use the reduced Planck mass, which is ≈ 4.341 × 10 kg = 2.435 × 10 GeV/c. The added factor of 1/√(8π) simplifies a number of equations in general relativity. Quantum effects are typified by the magnitude of Planck's constant. -- QUDT
wikipediaReference: https://en.wikipedia.org/wiki/Planck_units

JouleMetrePerMole
type: Class
comment: `Joule Meter per Mole` is a unit for 'Length Molar Energy' expressed as J · m · mol⁻¹. -- QUDT
subclass of: Restriction
  has value: 1e+00
subclass of: Restriction
  has value: 0e+00
alternative label: Joule Metre per Mole
qudtReference: http://qudt.org/vocab/unit/J-M-PER-MOL
ucumCode: J.m.mol-1
unitSymbol: J⋅m/mol
EMMO 967080e5 2f42 4eb2 a3a9 c58143e835f9: `Joule Meter per Mole` is a unit for 'Length Molar Energy' expressed as J · m · mol⁻¹. -- QUDT

JoulePerCubicMetreKelvin
type: Class
comment: `Joule per Cubic Meter Kelvin` is a unit for 'Volumetric Heat Capacity' expressed as J/(m³ K). -- QUDT
subclass of: Restriction
  has value: 1e+00
subclass of: Restriction
  has value: 0e+00
alternative label: Joule per Cubic Metre Kelvin
qudtReference: http://qudt.org/vocab/unit/J-PER-M3-K
ucumCode: J.m-3.K-1
unitSymbol: J/(m³⋅K)
EMMO 967080e5 2f42 4eb2 a3a9 c58143e835f9: `Joule per Cubic Meter Kelvin` is a unit for 'Volumetric Heat Capacity' expressed as J/(m³ K). -- QUDT

JoulePerGram
type: Class
comment: SI derived unit joule divided by the 0.001-fold of the SI base unit kilogram -- QUDT
subclass of: Restriction
  has value: 1e+03
subclass of: Restriction
  has value: 0e+00
alternative label: Joule Per Gram
qudtReference: http://qudt.org/vocab/unit/J-PER-GM
ucumCode: J.g-1
unitSymbol: J/g
EMMO 967080e5 2f42 4eb2 a3a9 c58143e835f9: SI derived unit joule divided by the 0.001-fold of the SI base unit kilogram -- QUDT

JoulePerHour
type: Class
comment: SI derived unit joule divided by the 3600 times the SI base unit second -- QUDT
subclass of: Restriction
  has value: 3.6e+03
subclass of: Restriction
  has value: 0e+00
alternative label: Joule Per Hour
qudtReference: http://qudt.org/vocab/unit/J-PER-HR
ucumCode: J.h-1
unitSymbol: J/h
EMMO 967080e5 2f42 4eb2 a3a9 c58143e835f9: SI derived unit joule divided by the 3600 times the SI base unit second -- QUDT

JoulePerKilogramKelvinCubicMetre
type: Class
comment: Joule per kilogram and Kelvin and cubic metre.
subclass of: Restriction
  has value: 0e+00
subclass of: Restriction
  has value: 1e+00
qudtReference: http://qudt.org/vocab/unit/J-PER-KiloGM-K-M3
ucumCode: J.kg-1.K.m-3
unitSymbol: J/(kg⋅K⋅m³)
EMMO 967080e5 2f42 4eb2 a3a9 c58143e835f9: Joule per kilogram and Kelvin and cubic metre.

JoulePerKilogramKelvinPerPascal
type: Class
comment: Joule per kilogram and Kelvin and Pascal.
subclass of: Restriction
  has value: 1e+00
subclass of: Restriction
  has value: 0e+00
qudtReference: http://qudt.org/vocab/unit/J-PER-KiloGM-K-PA
ucumCode: J.kg-1.K-1.Pa-1
unitSymbol: J/(kg⋅K⋅Pa)
EMMO 967080e5 2f42 4eb2 a3a9 c58143e835f9: Joule per kilogram and Kelvin and Pascal.

JoulePerMetre
type: Class
comment: Joule per metre.
subclass of: Restriction
  has value: 1e+00
subclass of: Restriction
  has value: 0e+00
qudtReference: http://qudt.org/vocab/unit/J-PER-M
ucumCode: J.m-1
ucumCode: J/m
unitSymbol: J/m
EMMO 967080e5 2f42 4eb2 a3a9 c58143e835f9: Joule per metre.

JoulePerMoleKelvin
type: Class
comment: Energy needed to heat one mole of substance by 1 Kelvin, under standard conditions (not standard temperature and pressure STP). The standard molar entropy is usually given the symbol S, and has units of joules per mole kelvin ( J· mol⁻¹ K⁻¹). Unlike standard enthalpies of formation, the value of S is an absolute. That is, an element in its standard state has a nonzero value of S at room temperature. -- QUDT
subclass of: Restriction
  has value: 1e+00
subclass of: Restriction
  has value: 0e+00
alternative label: Joule per Mole Kelvin
qudtReference: http://qudt.org/vocab/unit/J-PER-MOL-K
ucumCode: J.mol-1.K-1
unitSymbol: J/(mol⋅K)
EMMO 967080e5 2f42 4eb2 a3a9 c58143e835f9: Energy needed to heat one mole of substance by 1 Kelvin, under standard conditions (not standard temperature and pressure STP). The standard molar entropy is usually given the symbol S, and has units of joules per mole kelvin ( J· mol⁻¹ K⁻¹). Unlike standard enthalpies of formation, the value of S is an absolute. That is, an element in its standard state has a nonzero value of S at room temperature. -- QUDT

JoulePerQuarticMetre
type: Class
comment: `Joule Per Quartic Meter` (J/m⁴) is a unit for the spectral concentration of radiant energy density (in terms of wavelength), or the spectral radiant energy density (in terms of wave length). This unit is commonly used in the SI unit system. -- QUDT
alternative label: Joule per Quartic Metre
qudtReference: http://qudt.org/vocab/unit/J-PER-M4
ucumCode: J.m-4
unitSymbol: J/m⁴
EMMO 967080e5 2f42 4eb2 a3a9 c58143e835f9: `Joule Per Quartic Meter` (J/m⁴) is a unit for the spectral concentration of radiant energy density (in terms of wavelength), or the spectral radiant energy density (in terms of wave length). This unit is commonly used in the SI unit system. -- QUDT

JoulePerSquareCentiMetre
type: Class
comment: derived SI unit joule divided by the 0.0001-fold of the power of the SI base unit metre by exponent 2 -- QUDT
subclass of: Restriction
  has value: 1e+04
subclass of: Restriction
  has value: 0e+00
alternative label: Joule Per Square Centimetre
qudtReference: http://qudt.org/vocab/unit/J-PER-CentiM2
ucumCode: J.cm-2
unitSymbol: J/cm²
EMMO 967080e5 2f42 4eb2 a3a9 c58143e835f9: derived SI unit joule divided by the 0.0001-fold of the power of the SI base unit metre by exponent 2 -- QUDT

JoulePerSquareCentiMetrePerDay
type: Class
comment: Radiant energy per 10⁻⁴ SI unit area over a period of one day. -- QUDT
subclass of: Restriction
  has value: 1.157407e-01
subclass of: Restriction
  has value: 0e+00
alternative label: Joules per square centimetre per day
qudtReference: http://qudt.org/vocab/unit/J-PER-CentiM2-DAY
ucumCode: J.cm-2.d-1
unitSymbol: J/(cm²⋅day)
EMMO 967080e5 2f42 4eb2 a3a9 c58143e835f9: Radiant energy per 10⁻⁴ SI unit area over a period of one day. -- QUDT

JoulePerSquareTesla
type: Class
comment: A measure of the diamagnetic energy, for a Bohr-radius spread around a magnetic axis, per square Tesla. -- QUDT
subclass of: Restriction
  has value: 1e+00
subclass of: Restriction
  has value: 0e+00
alternative label: Joule per Square Tesla
qudtReference: http://qudt.org/vocab/unit/J-PER-T2
ucumCode: J.T-2
unitSymbol: J/T²
EMMO 967080e5 2f42 4eb2 a3a9 c58143e835f9: A measure of the diamagnetic energy, for a Bohr-radius spread around a magnetic axis, per square Tesla. -- QUDT

JoulePerTesla
type: Class
comment: The magnetic moment of a magnet is a quantity that determines the force that the magnet can exert on electric currents and the torque that a magnetic field will exert on it. A loop of electric current, a bar magnet, an electron, a molecule, and a planet all have magnetic moments. The unit for magnetic moment is not a base unit in the International System of Units (SI) and it can be represented in more than one way. For example, in the current loop definition, the area is measured in square meters and I is measured in amperes, so the magnetic moment is measured in ampere-square meters (A m2). In the equation for torque on a moment, the torque is measured in joules and the magnetic field in tesla, so the moment is measured in Joules per Tesla (J u00b7T-1). These two representations are equivalent: 1 A u00b7m2 = 1 J u00b7T-1. -- QUDT
subclass of: Restriction
  has value: 1e+00
subclass of: Restriction
  has value: 0e+00
alternative label: Joule per Tesla
qudtReference: http://qudt.org/vocab/unit/J-PER-T
ucumCode: J.T-1
unitSymbol: J/T
EMMO 967080e5 2f42 4eb2 a3a9 c58143e835f9: The magnetic moment of a magnet is a quantity that determines the force that the magnet can exert on electric currents and the torque that a magnetic field will exert on it. A loop of electric current, a bar magnet, an electron, a molecule, and a planet all have magnetic moments. The unit for magnetic moment is not a base unit in the International System of Units (SI) and it can be represented in more than one way. For example, in the current loop definition, the area is measured in square meters and I is measured in amperes, so the magnetic moment is measured in ampere-square meters (A m2). In the equation for torque on a moment, the torque is measured in joules and the magnetic field in tesla, so the moment is measured in Joules per Tesla (J u00b7T-1). These two representations are equivalent: 1 A u00b7m2 = 1 J u00b7T-1. -- QUDT

JouleSecondPerMole
type: Class
comment: `Joule Second per Mole` is a unit for 'Molar Angular Momentum' expressed as J s mol⁻¹. -- QUDT
subclass of: Restriction
  has value: 1e+00
subclass of: Restriction
  has value: 0e+00
alternative label: Joule Second per Mole
qudtReference: http://qudt.org/vocab/unit/J-SEC-PER-MOL
ucumCode: J.s.mol-1
unitSymbol: J⋅s/mol
EMMO 967080e5 2f42 4eb2 a3a9 c58143e835f9: `Joule Second per Mole` is a unit for 'Molar Angular Momentum' expressed as J s mol⁻¹. -- QUDT

JouleSquareMetre
type: Class
comment: Joule square metre.
subclass of: Restriction
  has value: 1e+00
subclass of: Restriction
  has value: 0e+00
qudtReference: http://qudt.org/vocab/unit/J-M2
ucumCode: J.m2
unitSymbol: J⋅m²
EMMO 967080e5 2f42 4eb2 a3a9 c58143e835f9: Joule square metre.

JouleSquareMetrePerKilogram
type: Class
comment: Joule square metre per kilogram.
subclass of: Restriction
  has value: 1e+00
subclass of: Restriction
  has value: 0e+00
qudtReference: http://qudt.org/vocab/unit/J-M2-PER-KiloGM
ucumCode: J.m2.kg-1
unitSymbol: j⋅m²/kg
EMMO 967080e5 2f42 4eb2 a3a9 c58143e835f9: Joule square metre per kilogram.

Kayser
type: Class
subclass of: Restriction
  has value: 1e+02
subclass of: Restriction
  has value: 0e+00
qudtReference: http://qudt.org/vocab/unit/KY
ucumCode: Ky
unitSymbol: K
wikipediaReference: http://en.wikipedia.org/wiki/Kayser

KelvinDay
type: Class
comment: Kelvin day unit.
subclass of: Restriction
  has value: 8.64e+04
subclass of: Restriction
  has value: 0e+00
qudtReference: http://qudt.org/vocab/unit/K-DAY
ucumCode: K.d
unitSymbol: K⋅day
EMMO 967080e5 2f42 4eb2 a3a9 c58143e835f9: Kelvin day unit.

KelvinMetre
type: Class
comment: Kelvin metre.
subclass of: Restriction
  has value: 1e+00
subclass of: Restriction
  has value: 0e+00
qudtReference: http://qudt.org/vocab/unit/K-M
ucumCode: K.m
unitSymbol: K⋅m
EMMO 967080e5 2f42 4eb2 a3a9 c58143e835f9: Kelvin metre.

KelvinMetrePerSecond
type: Class
comment: Kelvin metre per second.
subclass of: Restriction
  has value: 1e+00
subclass of: Restriction
  has value: 0e+00
qudtReference: http://qudt.org/vocab/unit/K-M-PER-SEC
ucumCode: K.m.s-1
unitSymbol: K⋅m/s
EMMO 967080e5 2f42 4eb2 a3a9 c58143e835f9: Kelvin metre per second.

KelvinMetrePerWatt
type: Class
comment: product of the SI base unit kelvin and the SI base unit metre divided by the derived SI unit watt -- QUDT
subclass of: Restriction
  has value: 1e+00
subclass of: Restriction
  has value: 0e+00
alternative label: Kelvin Metre Per Watt
qudtReference: http://qudt.org/vocab/unit/K-M-PER-W
ucumCode: K.m.W-1
unitSymbol: K⋅m/W
EMMO 967080e5 2f42 4eb2 a3a9 c58143e835f9: product of the SI base unit kelvin and the SI base unit metre divided by the derived SI unit watt -- QUDT

KelvinPascalPerSecond
type: Class
comment: Kelvin Pascal per second.
subclass of: Restriction
  has value: 1e+00
subclass of: Restriction
  has value: 0e+00
qudtReference: http://qudt.org/vocab/unit/K-PA-PER-SEC
ucumCode: K.Pa.s-1
unitSymbol: K⋅Pa/s
EMMO 967080e5 2f42 4eb2 a3a9 c58143e835f9: Kelvin Pascal per second.

KelvinPerHour
type: Class
comment: `Kelvin per Hour` is a unit for 'Temperature Per Time' expressed as K / h. -- QUDT
subclass of: Restriction
  has value: 3.6e+03
subclass of: Restriction
  has value: 0e+00
alternative label: Kelvin per Hour
qudtReference: http://qudt.org/vocab/unit/K-PER-HR
ucumCode: K.h-1
unitSymbol: K/h
EMMO 967080e5 2f42 4eb2 a3a9 c58143e835f9: `Kelvin per Hour` is a unit for 'Temperature Per Time' expressed as K / h. -- QUDT

KelvinPerKelvin
type: Class
comment: SI base unit kelvin divided by the SI base unit kelvin -- QUDT
subclass of: Restriction
  has value: 1e+00
subclass of: Restriction
  has value: 0e+00
alternative label: Kelvin Per Kelvin
qudtReference: http://qudt.org/vocab/unit/K-PER-K
ucumCode: K.K-1
unitSymbol: K/K
EMMO 967080e5 2f42 4eb2 a3a9 c58143e835f9: SI base unit kelvin divided by the SI base unit kelvin -- QUDT

KelvinPerMetre
type: Class
comment: A change of temperature on the Kelvin temperature scale in one SI unit of length. -- QUDT
subclass of: Restriction
  has value: 1e+00
subclass of: Restriction
  has value: 0e+00
alternative label: KelvinPerMeter
qudtReference: http://qudt.org/vocab/unit/K-PER-M
ucumCode: K.m-1
unitSymbol: K/m
EMMO 967080e5 2f42 4eb2 a3a9 c58143e835f9: A change of temperature on the Kelvin temperature scale in one SI unit of length. -- QUDT

KelvinPerMinute
type: Class
comment: `Kelvin per Minute` is a unit for 'Temperature Per Time' expressed as K / m. -- QUDT
subclass of: Restriction
  has value: 0e+00
subclass of: Restriction
  has value: 1.666667e-02
alternative label: Kelvin per Minute
qudtReference: http://qudt.org/vocab/unit/K-PER-MIN
ucumCode: K.min-1
unitSymbol: K/min
EMMO 967080e5 2f42 4eb2 a3a9 c58143e835f9: `Kelvin per Minute` is a unit for 'Temperature Per Time' expressed as K / m. -- QUDT

KelvinPerSecond
type: Class
comment: `Kelvin per Second` is a unit for 'Temperature Per Time' expressed as K / s. -- QUDT
subclass of: Restriction
  has value: 1e+00
subclass of: Restriction
  has value: 0e+00
alternative label: Kelvin per Second
qudtReference: http://qudt.org/vocab/unit/K-PER-SEC
ucumCode: K.s-1
ucumCode: K/s
unitSymbol: K/s
EMMO 967080e5 2f42 4eb2 a3a9 c58143e835f9: `Kelvin per Second` is a unit for 'Temperature Per Time' expressed as K / s. -- QUDT

KelvinPerSquareSecond
type: Class
comment: `Kelvin per Square Second` is a unit for 'Temperature Per Time Squared' expressed as K / s². -- QUDT
subclass of: Restriction
  has value: 0e+00
subclass of: Restriction
  has value: 1e+00
alternative label: Kelvin per Square Second
qudtReference: http://qudt.org/vocab/unit/K-PER-SEC2
ucumCode: K.s-2
ucumCode: K/s^2
unitSymbol: K/s²
EMMO 967080e5 2f42 4eb2 a3a9 c58143e835f9: `Kelvin per Square Second` is a unit for 'Temperature Per Time Squared' expressed as K / s². -- QUDT

KelvinPerTesla
type: Class
comment: `Kelvin per Tesla` is a unit for 'Temperature Per Magnetic Flux Density' expressed as K T⁻¹. -- QUDT
subclass of: Restriction
  has value: 1e+00
subclass of: Restriction
  has value: 0e+00
alternative label: Kelvin per Tesla
qudtReference: http://qudt.org/vocab/unit/K-PER-T
ucumCode: K.T-1
unitSymbol: K/T
EMMO 967080e5 2f42 4eb2 a3a9 c58143e835f9: `Kelvin per Tesla` is a unit for 'Temperature Per Magnetic Flux Density' expressed as K T⁻¹. -- QUDT

KelvinPerWatt
type: Class
comment: Thermal resistance is a heat property and a measure of a temperature difference by which an object or material resists a heat flow (heat per time unit or thermal resistance). Thermal resistance is the reciprocal thermal conductance. Absolute thermal resistance is the temperature difference across a structure when a unit of heat energy flows through it in unit time. It is the reciprocal of thermal conductance. The SI units of thermal resistance are kelvins per watt or the equivalent degrees Celsius per watt (the two are the same since as intervals). -- QUDT
subclass of: Restriction
  has value: 1e+00
subclass of: Restriction
  has value: 0e+00
alternative label: Kelvin per Watt
qudtReference: http://qudt.org/vocab/unit/K-PER-W
ucumCode: K.W-1
ucumCode: K/W
unitSymbol: K/W
EMMO 967080e5 2f42 4eb2 a3a9 c58143e835f9: Thermal resistance is a heat property and a measure of a temperature difference by which an object or material resists a heat flow (heat per time unit or thermal resistance). Thermal resistance is the reciprocal thermal conductance. Absolute thermal resistance is the temperature difference across a structure when a unit of heat energy flows through it in unit time. It is the reciprocal of thermal conductance. The SI units of thermal resistance are kelvins per watt or the equivalent degrees Celsius per watt (the two are the same since as intervals). -- QUDT

KelvinSecond
type: Class
comment: Kelvin second.
subclass of: Restriction
  has value: 1e+00
subclass of: Restriction
  has value: 0e+00
qudtReference: http://qudt.org/vocab/unit/K-SEC
ucumCode: K.s
unitSymbol: K⋅s
EMMO 967080e5 2f42 4eb2 a3a9 c58143e835f9: Kelvin second.

KelvinSquareMetrePerKilogramPerSecond
type: Class
comment: Kelvin square metres per kilogram and second.
subclass of: Restriction
  has value: 1e+00
subclass of: Restriction
  has value: 0e+00
qudtReference: http://qudt.org/vocab/unit/K-M2-PER-KiloGM-SEC
ucumCode: K.m2.kg-1.s-1
unitSymbol: K⋅m²/(kg⋅s)
EMMO 967080e5 2f42 4eb2 a3a9 c58143e835f9: Kelvin square metres per kilogram and second.

KibiByte
type: Class
comment: The kibibyte is a multiple of the unit byte for digital information equivalent to 1024 bytes. -- QUDT
subclass of: Restriction
  some values from: Byte
subclass of: Restriction
  has value: 1.024e+03
subclass of: Restriction
  has value: 0e+00
qudtReference: http://qudt.org/vocab/unit/KibiBYTE
unitSymbol: KiB
EMMO 967080e5 2f42 4eb2 a3a9 c58143e835f9: The kibibyte is a multiple of the unit byte for digital information equivalent to 1024 bytes. -- QUDT
wikipediaReference: https://en.wikipedia.org/wiki/Byte#Multiple-byte_units

KiloAmpere
type: Class
comment: A kiloampere is 1000 A
subclass of: Restriction
  some values from: Ampere
subclass of: Restriction
  has value: 1e+03
subclass of: Restriction
  has value: 0e+00
alternative label: kiloampere
qudtReference: http://qudt.org/vocab/unit/KiloA
ucumCode: kA
unitSymbol: kA
EMMO 967080e5 2f42 4eb2 a3a9 c58143e835f9: A kiloampere is 1000 A

KiloAmpereHour
type: Class
comment: product of the 1 000-fold of the SI base unit ampere and the unit hour -- QUDT
subclass of: Restriction
  some values from: AmpereHour
subclass of: Restriction
  has value: 1e+03
subclass of: Restriction
  has value: 0e+00
alternative label: Kiloampere Hour
qudtReference: http://qudt.org/vocab/unit/KiloA-HR
ucumCode: kA.h
unitSymbol: kA⋅h
EMMO 967080e5 2f42 4eb2 a3a9 c58143e835f9: product of the 1 000-fold of the SI base unit ampere and the unit hour -- QUDT

KiloAmperePerMetre
type: Class
comment: 1 000-fold of the SI base unit ampere divided by the SI base unit metre -- QUDT
subclass of: Restriction
  has value: 1e+03
subclass of: Restriction
  some values from: AmperePerMetre
subclass of: Restriction
  has value: 0e+00
alternative label: Kiloampere Per Metre
qudtReference: http://qudt.org/vocab/unit/KiloA-PER-M
ucumCode: kA.m-1
unitSymbol: kA/m
EMMO 967080e5 2f42 4eb2 a3a9 c58143e835f9: 1 000-fold of the SI base unit ampere divided by the SI base unit metre -- QUDT

KiloAmperePerSquareMetre
type: Class
comment: 1 000-fold of the SI base unit ampere divided by the power of the SI base unit metre with the exponent 2 -- QUDT
subclass of: Restriction
  some values from: AmperePerSquareMetre
subclass of: Restriction
  has value: 1e+03
subclass of: Restriction
  has value: 0e+00
alternative label: Kiloampere Per Square Metre
qudtReference: http://qudt.org/vocab/unit/KiloA-PER-M2
ucumCode: kA.m-2
unitSymbol: kA/m²
EMMO 967080e5 2f42 4eb2 a3a9 c58143e835f9: 1 000-fold of the SI base unit ampere divided by the power of the SI base unit metre with the exponent 2 -- QUDT

KiloBar
type: Class
comment: The bar is a non-SI unit of pressure, defined by the IUPAC as exactly equal to 100,000 Pa. It is about equal to the atmospheric pressure on Earth at sea level, and since 1982 the IUPAC has recommended that the standard for atmospheric pressure should be harmonized to 100,000 Pa = 1 bar ≈ 750.0616827 Torr. Units derived from the bar are the megabar (symbol: Mbar), kilobar (symbol: kbar), decibar (symbol: dbar), centibar (symbol: cbar), and millibar (symbol: mbar or mb). They are not SI or cgs units, but they are accepted for use with the SI. -- QUDT
subclass of: Restriction
  some values from: Bar
subclass of: Restriction
  has value: 1e+08
subclass of: Restriction
  has value: 0e+00
qudtReference: http://qudt.org/vocab/unit/KiloBAR
ucumCode: kbar
unitSymbol: kbar
EMMO 967080e5 2f42 4eb2 a3a9 c58143e835f9: The bar is a non-SI unit of pressure, defined by the IUPAC as exactly equal to 100,000 Pa. It is about equal to the atmospheric pressure on Earth at sea level, and since 1982 the IUPAC has recommended that the standard for atmospheric pressure should be harmonized to 100,000 Pa = 1 bar ≈ 750.0616827 Torr. Units derived from the bar are the megabar (symbol: Mbar), kilobar (symbol: kbar), decibar (symbol: dbar), centibar (symbol: cbar), and millibar (symbol: mbar or mb). They are not SI or cgs units, but they are accepted for use with the SI. -- QUDT
wikipediaReference: http://en.wikipedia.org/wiki/Bar_(unit)

KiloBecquerel
type: Class
comment: 1 000-fold of the SI derived unit becquerel -- QUDT
subclass of: Restriction
  has value: 0e+00
subclass of: Restriction
  has value: 1e+03
subclass of: Restriction
  some values from: Becquerel
qudtReference: http://qudt.org/vocab/unit/KiloBQ
ucumCode: kBq
unitSymbol: kBq
EMMO 967080e5 2f42 4eb2 a3a9 c58143e835f9: 1 000-fold of the SI derived unit becquerel -- QUDT

KiloBitPerSecond
type: Class
comment: A kilobit per second (kB/s) is a unit of data transfer rate equal to 1,000 bits per second. -- QUDT
subclass of: Restriction
  has value: 6.931472e+02
subclass of: Restriction
  some values from: BitPerSecond
subclass of: Restriction
  has value: 0e+00
alternative label: Kilobit per Second
qudtReference: http://qudt.org/vocab/unit/KiloBIT-PER-SEC
ucumCode: kbit.s-1
unitSymbol: kbps
EMMO 967080e5 2f42 4eb2 a3a9 c58143e835f9: A kilobit per second (kB/s) is a unit of data transfer rate equal to 1,000 bits per second. -- QUDT
wikipediaReference: http://en.wikipedia.org/wiki/Data_rate_units#Kilobit_per_second

KiloBtu_It
type: Class
subclass of: Restriction
  some values from: Btu It
subclass of: Restriction
  has value: 1.055056e+05
subclass of: Restriction
  has value: 0e+00
alternative label: Kilo British Thermal Unit (International Definition)
qudtReference: http://qudt.org/vocab/unit/KiloBTU_IT
ucumCode: k[Btu_IT]
unitSymbol: kBtu{IT}

KiloBtu_It_Per_Hr
type: Class
subclass of: Restriction
  has value: 2.930711e+02
subclass of: Restriction
  has value: 0e+00
alternative label: Kilo British Thermal Unit (International Definition) per Hour
qudtReference: http://qudt.org/vocab/unit/KiloBTU_IT-PER-HR
ucumCode: k[Btu_IT].h-1
ucumCode: k[Btu_IT]/h
unitSymbol: kBtu{IT}/hr

KiloBtu_Th
type: Class
subclass of: Restriction
  some values from: Btu Th
subclass of: Restriction
  has value: 1.05435e+06
subclass of: Restriction
  has value: 0e+00
alternative label: Kilo British Thermal Unit (Thermochemical Definition)
qudtReference: http://qudt.org/vocab/unit/KiloBTU_TH
ucumCode: k[Btu_th]
unitSymbol: kBtu{th}

KiloBtu_Th_Per_Hr
type: Class
comment: unit of the heat energy according to the Imperial system of units divided by the unit hour -- QUDT
subclass of: Restriction
  some values from: Btu Th Per Hr
subclass of: Restriction
  has value: 2.929e+02
subclass of: Restriction
  has value: 0e+00
alternative label: Kilo British Thermal Unit (thermochemical) Per Hour
qudtReference: http://qudt.org/vocab/unit/KiloBTU_TH-PER-HR
ucumCode: k[Btu_th].h-1
ucumCode: k[Btu_th]/h
unitSymbol: kBtu{th}/hr
EMMO 967080e5 2f42 4eb2 a3a9 c58143e835f9: unit of the heat energy according to the Imperial system of units divided by the unit hour -- QUDT

KiloByte
type: Class
comment: The kilobyte is a multiple of the unit byte for digital information equivalent to 1000 bytes. Although the prefix kilo- means 1000, the term kilobyte and symbol kB have historically been used to refer to either 1024 (210) bytes or 1000 (103) bytes, dependent upon context, in the fields of computer science and information technology. This ambiguity is removed in QUDT, with KibiBYTE used to refer to 1024 bytes. -- QUDT
subclass of: Restriction
  some values from: Byte
subclass of: Restriction
  has value: 1e+03
subclass of: Restriction
  has value: 0e+00
alternative label: Kilo Byte
qudtReference: http://qudt.org/vocab/unit/KiloBYTE
ucumCode: kBy
unitSymbol: kB
EMMO 967080e5 2f42 4eb2 a3a9 c58143e835f9: The kilobyte is a multiple of the unit byte for digital information equivalent to 1000 bytes. Although the prefix kilo- means 1000, the term kilobyte and symbol kB have historically been used to refer to either 1024 (210) bytes or 1000 (103) bytes, dependent upon context, in the fields of computer science and information technology. This ambiguity is removed in QUDT, with KibiBYTE used to refer to 1024 bytes. -- QUDT
wikipediaReference: http://en.wikipedia.org/wiki/Byte

KiloBytePerSecond
type: Class
comment: A kilobyte per second (kByte/s) is a unit of data transfer rate equal to 1000 bytes per second or 8000 bits per second. -- QUDT
subclass of: Restriction
  has value: 1e+03
subclass of: Restriction
  has value: 0e+00
alternative label: Kilobyte per Second
qudtReference: http://qudt.org/vocab/unit/KiloBYTE-PER-SEC
ucumCode: kBy.s-1
unitSymbol: kBps
EMMO 967080e5 2f42 4eb2 a3a9 c58143e835f9: A kilobyte per second (kByte/s) is a unit of data transfer rate equal to 1000 bytes per second or 8000 bits per second. -- QUDT
wikipediaReference: http://en.wikipedia.org/wiki/Data_rate_units#Kilobyte_per_second

KiloCal_It
type: Class
comment: 1000-fold of the unit calorie, which is used particularly for calorific values of food -- QUDT
subclass of: Restriction
  has value: 4.1868e+03
subclass of: Restriction
  has value: 0e+00
alternative label: Kilocalorie (international Table)
qudtReference: http://qudt.org/vocab/unit/KiloCAL_IT
ucumCode: kcal_IT
unitSymbol: kcal{IT}
EMMO 967080e5 2f42 4eb2 a3a9 c58143e835f9: 1000-fold of the unit calorie, which is used particularly for calorific values of food -- QUDT

KiloCal_It_Per_Hr_M_Deg_C
type: Class
comment: 1 000-fold of the no longer approved unit international calorie for energy divided by the product of the SI base unit metre, the unit hour for time and the unit degree Celsius for temperature -- QUDT
subclass of: Restriction
  has value: 0e+00
subclass of: Restriction
  has value: 1.163e+00
alternative label: Kilocalorie (international Table) Per Hour Metre Degree Celsius
qudtReference: http://qudt.org/vocab/unit/KiloCAL_IT-PER-HR-M-DEG_C
ucumCode: kcal_IT.h-1.m-1.Cel-1
unitSymbol: kcal{IT}/(hr⋅m⋅°C)
EMMO 967080e5 2f42 4eb2 a3a9 c58143e835f9: 1 000-fold of the no longer approved unit international calorie for energy divided by the product of the SI base unit metre, the unit hour for time and the unit degree Celsius for temperature -- QUDT

KiloCal_Mean
type: Class
comment: 1000-fold of the unit calorie, which is used particularly for calorific values of food -- QUDT
subclass of: Restriction
  some values from: Cal Mean
subclass of: Restriction
  has value: 4.19e+03
subclass of: Restriction
  has value: 0e+00
alternative label: Kilocalorie (mean)
qudtReference: http://qudt.org/vocab/unit/KiloCAL_Mean
ucumCode: kcal_m
unitSymbol: kcal{mean}
EMMO 967080e5 2f42 4eb2 a3a9 c58143e835f9: 1000-fold of the unit calorie, which is used particularly for calorific values of food -- QUDT

KiloCal_Th
type: Class
comment: 1000-fold of the unit calorie, which is used particularly for calorific values of food -- QUDT
subclass of: Restriction
  has value: 4.184e+03
subclass of: Restriction
  has value: 0e+00
alternative label: Kilocalorie (thermochemical)
qudtReference: http://qudt.org/vocab/unit/KiloCAL_TH
ucumCode: [Cal]
ucumCode: kcal_th
unitSymbol: kcal{th}
EMMO 967080e5 2f42 4eb2 a3a9 c58143e835f9: 1000-fold of the unit calorie, which is used particularly for calorific values of food -- QUDT

KiloCal_Th_Per_Hr
type: Class
comment: 1 000-fold of the non-legal unit thermochemical calorie divided by the unit hour -- QUDT
subclass of: Restriction
  has value: 1.162231e+00
subclass of: Restriction
  has value: 0e+00
alternative label: Kilocalorie (thermochemical) Per Hour
qudtReference: http://qudt.org/vocab/unit/KiloCAL_TH-PER-HR
ucumCode: kcal_th.h-1
unitSymbol: kcal{th}/hr
EMMO 967080e5 2f42 4eb2 a3a9 c58143e835f9: 1 000-fold of the non-legal unit thermochemical calorie divided by the unit hour -- QUDT

KiloCal_Th_Per_Min
type: Class
comment: 1000-fold of the unit calorie divided by the unit minute -- QUDT
subclass of: Restriction
  some values from: Cal Th Per Min
subclass of: Restriction
  has value: 6.973383e+01
subclass of: Restriction
  has value: 0e+00
alternative label: Kilocalorie (thermochemical) Per Minute
qudtReference: http://qudt.org/vocab/unit/KiloCAL_TH-PER-MIN
ucumCode: kcal_th.min-1
unitSymbol: kcal{th}/min
EMMO 967080e5 2f42 4eb2 a3a9 c58143e835f9: 1000-fold of the unit calorie divided by the unit minute -- QUDT

KiloCal_Th_Per_Sec
type: Class
comment: 1000-fold of the unit calorie divided by the SI base unit second -- QUDT
subclass of: Restriction
  some values from: Cal Th Per Sec
subclass of: Restriction
  has value: 4.184e+03
subclass of: Restriction
  has value: 0e+00
alternative label: Kilocalorie (thermochemical) Per Second
qudtReference: http://qudt.org/vocab/unit/KiloCAL_TH-PER-SEC
ucumCode: kcal_th.s-1
unitSymbol: kcal{th}/s
EMMO 967080e5 2f42 4eb2 a3a9 c58143e835f9: 1000-fold of the unit calorie divided by the SI base unit second -- QUDT

KiloCalorie
type: Class
comment: `Kilocalorie` is a unit for `Energy And Work` expressed as kcal. -- QUDT
subclass of: Restriction
  has value: 0e+00
subclass of: Restriction
  has value: 4.184e+03
qudtReference: http://qudt.org/vocab/unit/KiloCAL
ucumCode: kcal
unitSymbol: kcal
EMMO 967080e5 2f42 4eb2 a3a9 c58143e835f9: `Kilocalorie` is a unit for `Energy And Work` expressed as kcal. -- QUDT
wikipediaReference: http://en.wikipedia.org/wiki/Calorie

KiloCaloriePerCentiMetreSecondDegreeCelsius
type: Class
subclass of: Restriction
  has value: 4.184e+05
subclass of: Restriction
  has value: 0e+00
alternative label: Kilocalorie per Centimetre Second Degree Celsius
qudtReference: http://qudt.org/vocab/unit/KiloCAL-PER-CentiM-SEC-DEG_C
ucumCode: kcal.cm-1.s-1.Cel-1
unitSymbol: kcal/(cm⋅s⋅°C)

KiloCaloriePerGram
type: Class
comment: "Kilocalorie per Gram" is a unit for 'Specific Energy' expressed as kcal/gm. -- QUDT
subclass of: Restriction
  has value: 4.184e+06
subclass of: Restriction
  has value: 0e+00
alternative label: Kilocalorie per Gram
qudtReference: http://qudt.org/vocab/unit/KiloCAL-PER-GM
ucumCode: kcal.g-1
unitSymbol: kcal/g
EMMO 967080e5 2f42 4eb2 a3a9 c58143e835f9: "Kilocalorie per Gram" is a unit for 'Specific Energy' expressed as kcal/gm. -- QUDT

KiloCaloriePerMinute
type: Class
comment: `Kilocalorie per Minute` is a unit for `Heat Flow Rate` and `Power` expressed as kcal/min. -- QUDT
subclass of: Restriction
  has value: 6.973333e+01
subclass of: Restriction
  has value: 0e+00
alternative label: Kilocalorie Per Minute
qudtReference: http://qudt.org/vocab/unit/KiloCAL-PER-MIN
ucumCode: kcal.min-1
unitSymbol: kcal/min
EMMO 967080e5 2f42 4eb2 a3a9 c58143e835f9: `Kilocalorie per Minute` is a unit for `Heat Flow Rate` and `Power` expressed as kcal/min. -- QUDT

KiloCaloriePerMole
type: Class
comment: The kilocalorie per mole is a derived unit of energy per Avogadro's number of particles. It is the quotient of a kilocalorie (1000 thermochemical gram calories) and a mole, mainly used in the United States. In SI units, it is equal to 4.184 kJ/mol, or 6.9477 × 10 J per molecule. At room temperature it is equal to 1.688 . Physical quantities measured in kcal· mol are usually thermodynamical quantities; mostly free energies such as: Heat of vaporization Heat of fusion. -- QUDT
subclass of: Restriction
  has value: 0e+00
subclass of: Restriction
  has value: 4.184e+03
alternative label: Kilocalorie per Mole
qudtReference: http://qudt.org/vocab/unit/KiloCAL-PER-MOL
ucumCode: kcal.mol-1
unitSymbol: kcal/mol
EMMO 967080e5 2f42 4eb2 a3a9 c58143e835f9: The kilocalorie per mole is a derived unit of energy per Avogadro's number of particles. It is the quotient of a kilocalorie (1000 thermochemical gram calories) and a mole, mainly used in the United States. In SI units, it is equal to 4.184 kJ/mol, or 6.9477 × 10 J per molecule. At room temperature it is equal to 1.688 . Physical quantities measured in kcal· mol are usually thermodynamical quantities; mostly free energies such as: Heat of vaporization Heat of fusion. -- QUDT

KiloCaloriePerMoleDegreeCelsius
type: Class
comment: `Kilocalorie per Mole Degree Celsius` is a unit for 'Molar Heat Capacity' expressed as kcal/(mol-degC). -- QUDT
alternative label: Kilocalorie per Mole Degree Celsius
qudtReference: http://qudt.org/vocab/unit/KiloCAL-PER-MOL-DEG_C
ucumCode: kcal.mol-1.Cel-1
unitSymbol: kcal/(mol⋅°C)
EMMO 967080e5 2f42 4eb2 a3a9 c58143e835f9: `Kilocalorie per Mole Degree Celsius` is a unit for 'Molar Heat Capacity' expressed as kcal/(mol-degC). -- QUDT

KiloCaloriePerSecond
type: Class
comment: `Kilocalorie per Second` is a unit for `Heat Flow Rate` and `Power` expressed as kcal/s. -- QUDT
subclass of: Restriction
  has value: 4.184e+03
subclass of: Restriction
  has value: 0e+00
alternative label: Kilocalorie Per Second
qudtReference: http://qudt.org/vocab/unit/KiloCAL-PER-SEC
ucumCode: kcal.s-1
unitSymbol: kcal/s
EMMO 967080e5 2f42 4eb2 a3a9 c58143e835f9: `Kilocalorie per Second` is a unit for `Heat Flow Rate` and `Power` expressed as kcal/s. -- QUDT

KiloCaloriePerSquareCentiMetre
type: Class
comment: "Kilocalorie per Square Centimeter" is a unit for 'Energy Per Area' expressed as kcal/cm². -- QUDT
subclass of: Restriction
  has value: 0e+00
subclass of: Restriction
  has value: 4.184e-07
alternative label: Kilocalorie per Square Centimetre
qudtReference: http://qudt.org/vocab/unit/KiloCAL-PER-CentiM2
ucumCode: kcal.cm-2
unitSymbol: kcal/cm²
EMMO 967080e5 2f42 4eb2 a3a9 c58143e835f9: "Kilocalorie per Square Centimeter" is a unit for 'Energy Per Area' expressed as kcal/cm². -- QUDT

KiloCaloriePerSquareCentiMetreMinute
type: Class
comment: "Kilocalorie per Square Centimeter Minute" is a unit for 'Power Per Area' expressed as kcal/(cm²-min). -- QUDT
subclass of: Restriction
  has value: 6.973333e-05
subclass of: Restriction
  has value: 0e+00
alternative label: Kilocalorie per Square Centimetre Minute
qudtReference: http://qudt.org/vocab/unit/KiloCAL-PER-CentiM2-MIN
ucumCode: kcal.cm-2.min-1
unitSymbol: kcal/(cm²⋅min)
EMMO 967080e5 2f42 4eb2 a3a9 c58143e835f9: "Kilocalorie per Square Centimeter Minute" is a unit for 'Power Per Area' expressed as kcal/(cm²-min). -- QUDT

KiloCaloriePerSquareCentiMetreSecond
type: Class
comment: "Kilocalorie per Square Centimeter Second" is a unit for 'Power Per Area' expressed as kcal/(cm²-s). -- QUDT
subclass of: Restriction
  has value: 4.184e-07
subclass of: Restriction
  has value: 0e+00
alternative label: Kilocalorie per Square Centimetre Second
qudtReference: http://qudt.org/vocab/unit/KiloCAL-PER-CentiM2-SEC
ucumCode: kcal.cm-2.s-1
unitSymbol: kcal/(cm²⋅s)
EMMO 967080e5 2f42 4eb2 a3a9 c58143e835f9: "Kilocalorie per Square Centimeter Second" is a unit for 'Power Per Area' expressed as kcal/(cm²-s). -- QUDT

KiloCoulomb
type: Class
subclass of: Restriction
  some values from: Coulomb
subclass of: Restriction
  has value: 1e+03
subclass of: Restriction
  has value: 0e+00
qudtReference: http://qudt.org/vocab/unit/KiloC
ucumCode: kC
unitSymbol: kC

KiloCoulombPerCubicMetre
type: Class
comment: 1 000-fold of the SI derived unit coulomb divided by the power of the SI base unit metre with the exponent 3 -- QUDT
subclass of: Restriction
  some values from: CoulombPerCubicMetre
subclass of: Restriction
  has value: 1e+03
subclass of: Restriction
  has value: 0e+00
alternative label: Kilocoulomb Per Cubic Metre
qudtReference: http://qudt.org/vocab/unit/KiloC-PER-M3
ucumCode: kC.m-3
unitSymbol: kC/m³
EMMO 967080e5 2f42 4eb2 a3a9 c58143e835f9: 1 000-fold of the SI derived unit coulomb divided by the power of the SI base unit metre with the exponent 3 -- QUDT

KiloCoulombPerSquareMetre
type: Class
comment: 1 000-fold of the SI derived unit coulomb divided by the power of the SI base unit metre with the exponent 2 -- QUDT
subclass of: Restriction
  has value: 0e+00
subclass of: Restriction
  some values from: CoulombPerSquareMetre
subclass of: Restriction
  has value: 1e+03
alternative label: Kilocoulomb Per Square Metre
qudtReference: http://qudt.org/vocab/unit/KiloC-PER-M2
ucumCode: kC.m-2
unitSymbol: kC/m²
EMMO 967080e5 2f42 4eb2 a3a9 c58143e835f9: 1 000-fold of the SI derived unit coulomb divided by the power of the SI base unit metre with the exponent 2 -- QUDT

KiloCurie
type: Class
comment: 1 000-fold of the unit curie -- QUDT
subclass of: Restriction
  has value: 0e+00
subclass of: Restriction
  some values from: Curie
subclass of: Restriction
  has value: 3.7e+13
qudtReference: http://qudt.org/vocab/unit/KiloCi
ucumCode: kCi
unitSymbol: kCi
EMMO 967080e5 2f42 4eb2 a3a9 c58143e835f9: 1 000-fold of the unit curie -- QUDT

KiloElectronVolt
type: Class
comment: "Kilo Electron Volt" is a unit for 'Energy And Work' expressed as keV. -- QUDT
subclass of: Restriction
  some values from: ElectronVolt
subclass of: Restriction
  has value: 1.602177e-16
subclass of: Restriction
  has value: 0e+00
alternative label: Kilo Electron Volt
qudtReference: http://qudt.org/vocab/unit/KiloEV
ucumCode: keV
unitSymbol: keV
EMMO 967080e5 2f42 4eb2 a3a9 c58143e835f9: "Kilo Electron Volt" is a unit for 'Energy And Work' expressed as keV. -- QUDT

KiloElectronVoltPerMicroMetre
type: Class
comment: "Kilo Electron Volt per Micrometer" is a unit for 'Linear Energy Transfer' expressed as keV/microM. -- QUDT
subclass of: Restriction
  has value: 1.602177e-10
subclass of: Restriction
  has value: 0e+00
alternative label: Kilo Electron Volt per Micrometre
qudtReference: http://qudt.org/vocab/unit/KiloEV-PER-MicroM
ucumCode: keV.um-1
unitSymbol: keV/µM
EMMO 967080e5 2f42 4eb2 a3a9 c58143e835f9: "Kilo Electron Volt per Micrometer" is a unit for 'Linear Energy Transfer' expressed as keV/microM. -- QUDT

KiloGauss
type: Class
comment: 1 000-fold of the CGS unit of the magnetic flux density B -- QUDT
subclass of: Restriction
  has value: 1e-01
subclass of: Restriction
  some values from: Gauss
subclass of: Restriction
  has value: 0e+00
qudtReference: http://qudt.org/vocab/unit/KiloGAUSS
ucumCode: kG
unitSymbol: kGs
EMMO 967080e5 2f42 4eb2 a3a9 c58143e835f9: 1 000-fold of the CGS unit of the magnetic flux density B -- QUDT

KiloHertz
type: Class
comment: "Kilohertz" is a C.G.S System unit for 'Frequency' expressed as KHz. -- QUDT
subclass of: Restriction
  some values from: Hertz
subclass of: Restriction
  has value: 1e+03
subclass of: Restriction
  has value: 0e+00
qudtReference: http://qudt.org/vocab/unit/KiloHZ
ucumCode: kHz
unitSymbol: kHz
EMMO 967080e5 2f42 4eb2 a3a9 c58143e835f9: "Kilohertz" is a C.G.S System unit for 'Frequency' expressed as KHz. -- QUDT

KiloHertzMetre
type: Class
comment: product of the 1 000-fold of the SI derived unit hertz and the SI base unit metre -- QUDT
subclass of: Restriction
  some values from: HertzMetre
subclass of: Restriction
  has value: 0e+00
subclass of: Restriction
  has value: 1e+03
alternative label: Kilohertz Metre
qudtReference: http://qudt.org/vocab/unit/KiloHZ-M
ucumCode: kHz.m
unitSymbol: kHz⋅m
EMMO 967080e5 2f42 4eb2 a3a9 c58143e835f9: product of the 1 000-fold of the SI derived unit hertz and the SI base unit metre -- QUDT

KiloJoule
type: Class
comment: 1 000-fold of the SI derived unit joule -- QUDT
subclass of: Restriction
  some values from: Joule
subclass of: Restriction
  has value: 1e+03
subclass of: Restriction
  has value: 0e+00
qudtReference: http://qudt.org/vocab/unit/KiloJ
ucumCode: kJ
unitSymbol: kJ
EMMO 967080e5 2f42 4eb2 a3a9 c58143e835f9: 1 000-fold of the SI derived unit joule -- QUDT

KiloJoulePerKelvin
type: Class
comment: 1 000-fold of the SI derived unit joule divided by the SI base unit kelvin -- QUDT
subclass of: Restriction
  some values from: JoulePerKelvin
subclass of: Restriction
  has value: 1e+03
subclass of: Restriction
  has value: 0e+00
alternative label: Kilojoule Per Kelvin
qudtReference: http://qudt.org/vocab/unit/KiloJ-PER-K
ucumCode: kJ.K-1
ucumCode: kJ/K
unitSymbol: kJ/K
EMMO 967080e5 2f42 4eb2 a3a9 c58143e835f9: 1 000-fold of the SI derived unit joule divided by the SI base unit kelvin -- QUDT

KiloJoulePerKilogram
type: Class
comment: 1 000-fold of the SI derived unit joule divided by the SI base unit kilogram -- QUDT
subclass of: Restriction
  some values from: JoulePerKilogram
subclass of: Restriction
  has value: 1e+03
subclass of: Restriction
  has value: 0e+00
alternative label: Kilojoule Per Kilogram
qudtReference: http://qudt.org/vocab/unit/KiloJ-PER-KiloGM
ucumCode: kJ.kg-1
ucumCode: kJ/kg
unitSymbol: kJ/kg
EMMO 967080e5 2f42 4eb2 a3a9 c58143e835f9: 1 000-fold of the SI derived unit joule divided by the SI base unit kilogram -- QUDT

KiloJoulePerKilogramKelvin
type: Class
comment: 1 000-fold of the SI derived unit joule divided by the product of the SI base unit kilogram and the SI base unit kelvin -- QUDT
subclass of: Restriction
  some values from: JoulePerKilogramKelvin
subclass of: Restriction
  has value: 1e+03
subclass of: Restriction
  has value: 0e+00
alternative label: Kilojoule Per Kilogram Kelvin
qudtReference: http://qudt.org/vocab/unit/KiloJ-PER-KiloGM-K
ucumCode: kJ.(kg.K)-1
ucumCode: kJ.kg-1.K-1
ucumCode: kJ/(kg.K)
unitSymbol: kJ/(kg⋅K)
EMMO 967080e5 2f42 4eb2 a3a9 c58143e835f9: 1 000-fold of the SI derived unit joule divided by the product of the SI base unit kilogram and the SI base unit kelvin -- QUDT

KiloJoulePerMole
type: Class
comment: 1 000-fold of the SI derived unit joule divided by the SI base unit mol -- QUDT
subclass of: Restriction
  has value: 1e+03
subclass of: Restriction
  some values from: JoulePerMole
subclass of: Restriction
  has value: 0e+00
alternative label: Kilojoule Per Mole
qudtReference: http://qudt.org/vocab/unit/KiloJ-PER-MOL
ucumCode: kJ.mol-1
unitSymbol: kJ/mol
EMMO 967080e5 2f42 4eb2 a3a9 c58143e835f9: 1 000-fold of the SI derived unit joule divided by the SI base unit mol -- QUDT

KiloLitre
type: Class
comment: 1 000-fold of the unit litre -- QUDT
subclass of: Restriction
  has value: 0e+00
subclass of: Restriction
  some values from: Litre
subclass of: Restriction
  has value: 1e+00
qudtReference: http://qudt.org/vocab/unit/KiloL
ucumCode: kL
unitSymbol: kL
EMMO 967080e5 2f42 4eb2 a3a9 c58143e835f9: 1 000-fold of the unit litre -- QUDT

KiloLitrePerHour
type: Class
comment: unit of the volume kilolitres divided by the unit hour -- QUDT
subclass of: Restriction
  has value: 0e+00
subclass of: Restriction
  has value: 2.777778e-03
subclass of: Restriction
  some values from: LitrePerHour
alternative label: Kilolitre Per Hour
qudtReference: http://qudt.org/vocab/unit/KiloL-PER-HR
ucumCode: kL.h-1
unitSymbol: kL/h
EMMO 967080e5 2f42 4eb2 a3a9 c58143e835f9: unit of the volume kilolitres divided by the unit hour -- QUDT

KiloMetre
type: Class
comment: A common metric unit of length or distance. One kilometer equals exactly 1000 meters, about 0.621 371 19 mile, 1093.6133 yards, or 3280.8399 feet. Oddly, higher multiples of the meter are rarely used; even the distances to the farthest galaxies are usually measured in kilometers. -- QUDT
subclass of: Restriction
  some values from: Metre
subclass of: Restriction
  has value: 1e+03
subclass of: Restriction
  has value: 0e+00
qudtReference: http://qudt.org/vocab/unit/KiloM
ucumCode: km
unitSymbol: km
EMMO 967080e5 2f42 4eb2 a3a9 c58143e835f9: A common metric unit of length or distance. One kilometer equals exactly 1000 meters, about 0.621 371 19 mile, 1093.6133 yards, or 3280.8399 feet. Oddly, higher multiples of the meter are rarely used; even the distances to the farthest galaxies are usually measured in kilometers. -- QUDT
wikipediaReference: http://en.wikipedia.org/wiki/Kilometre

KiloMetrePerDay
type: Class
comment: A change in location of a distance of one thousand metres in an elapsed time of one day (86400 seconds). -- QUDT
subclass of: Restriction
  has value: 1.157407e-02
subclass of: Restriction
  has value: 0e+00
alternative label: Kilometres per day
qudtReference: http://qudt.org/vocab/unit/KiloM-PER-DAY
ucumCode: km.d-1
unitSymbol: kg/day
EMMO 967080e5 2f42 4eb2 a3a9 c58143e835f9: A change in location of a distance of one thousand metres in an elapsed time of one day (86400 seconds). -- QUDT

KiloMetrePerHour
type: Class
comment: "Kilometer per Hour" is a C.G.S System unit for 'Linear Velocity' expressed as km/h. -- QUDT
subclass of: Restriction
  some values from: MetrePerHour
subclass of: Restriction
  has value: 2.777778e-01
subclass of: Restriction
  has value: 0e+00
alternative label: Kilometre per Hour
qudtReference: http://qudt.org/vocab/unit/KiloM-PER-HR
ucumCode: km.h-1
ucumCode: km/h
unitSymbol: km/h
EMMO 967080e5 2f42 4eb2 a3a9 c58143e835f9: "Kilometer per Hour" is a C.G.S System unit for 'Linear Velocity' expressed as km/h. -- QUDT
wikipediaReference: http://en.wikipedia.org/wiki/Kilometres_per_hour

KiloMetrePerSecond
type: Class
comment: "Kilometer per Second" is a C.G.S System unit for 'Linear Velocity' expressed as km/s. -- QUDT
subclass of: Restriction
  has value: 0e+00
subclass of: Restriction
  some values from: MetrePerSecond
subclass of: Restriction
  has value: 1e+03
alternative label: Kilometre per Second
qudtReference: http://qudt.org/vocab/unit/KiloM-PER-SEC
ucumCode: km.s-1
ucumCode: km/s
unitSymbol: km/s
EMMO 967080e5 2f42 4eb2 a3a9 c58143e835f9: "Kilometer per Second" is a C.G.S System unit for 'Linear Velocity' expressed as km/s. -- QUDT

KiloMolePerKilogram
type: Class
comment: Kilomole Per Kilogram (kmol/kg) is a unit of Molality -- QUDT
subclass of: Restriction
  some values from: MolPerKilogram
subclass of: Restriction
  has value: 1e+03
subclass of: Restriction
  has value: 0e+00
alternative label: Kilomole per Kilogram
qudtReference: http://qudt.org/vocab/unit/KiloMOL-PER-KiloGM
ucumCode: kmol.kg-1
ucumCode: kmol/kg
unitSymbol: kmol/kg
EMMO 967080e5 2f42 4eb2 a3a9 c58143e835f9: Kilomole Per Kilogram (kmol/kg) is a unit of Molality -- QUDT

KiloMole
type: Class
comment: 1 000-fold of the SI base unit mol -- QUDT
subclass of: Restriction
  has value: 0e+00
subclass of: Restriction
  some values from: Mole
subclass of: Restriction
  has value: 1e+03
qudtReference: http://qudt.org/vocab/unit/KiloMOL
ucumCode: kmol
unitSymbol: kmol
EMMO 967080e5 2f42 4eb2 a3a9 c58143e835f9: 1 000-fold of the SI base unit mol -- QUDT

KiloMolePerCubicMetre
type: Class
comment: 1 000-fold of the SI base unit mol divided by the power of the SI base unit metre with the exponent 3 -- QUDT
subclass of: Restriction
  some values from: MolePerCubicMetre
subclass of: Restriction
  has value: 1e+03
subclass of: Restriction
  has value: 0e+00
alternative label: Kilomole Per Cubic Metre
qudtReference: http://qudt.org/vocab/unit/KiloMOL-PER-M3
ucumCode: kmol.m-3
unitSymbol: kmol/m³
EMMO 967080e5 2f42 4eb2 a3a9 c58143e835f9: 1 000-fold of the SI base unit mol divided by the power of the SI base unit metre with the exponent 3 -- QUDT

KiloMolePerHour
type: Class
comment: 1 000-fold of the SI base unit mole divided by the unit for time hour -- QUDT
subclass of: Restriction
  some values from: MolePerHour
subclass of: Restriction
  has value: 2.777778e-01
subclass of: Restriction
  has value: 0e+00
alternative label: Kilomole Per Hour
qudtReference: http://qudt.org/vocab/unit/KiloMOL-PER-HR
ucumCode: kmol.h-1
unitSymbol: kmol/h
EMMO 967080e5 2f42 4eb2 a3a9 c58143e835f9: 1 000-fold of the SI base unit mole divided by the unit for time hour -- QUDT

KiloMolePerMinute
type: Class
comment: 1 000-fold of the SI base unit mole divided by the unit for time minute -- QUDT
subclass of: Restriction
  has value: 1.694444e+01
subclass of: Restriction
  some values from: MolePerMinute
subclass of: Restriction
  has value: 0e+00
alternative label: Kilomole Per Minute
qudtReference: http://qudt.org/vocab/unit/KiloMOL-PER-MIN
ucumCode: kmol.min-1
unitSymbol: kmol/min
EMMO 967080e5 2f42 4eb2 a3a9 c58143e835f9: 1 000-fold of the SI base unit mole divided by the unit for time minute -- QUDT

KiloMolePerSecond
type: Class
comment: 1 000-fold of the SI base unit mol divided by the SI base unit second -- QUDT
subclass of: Restriction
  some values from: MolePerSecond
subclass of: Restriction
  has value: 1e+03
subclass of: Restriction
  has value: 0e+00
alternative label: Kilomole Per Second
qudtReference: http://qudt.org/vocab/unit/KiloMOL-PER-SEC
ucumCode: kmol.s-1
unitSymbol: kmol/s
EMMO 967080e5 2f42 4eb2 a3a9 c58143e835f9: 1 000-fold of the SI base unit mol divided by the SI base unit second -- QUDT

KiloNewton
type: Class
comment: 1 000-fold of the SI derived unit newton -- QUDT
subclass of: Restriction
  some values from: Newton
subclass of: Restriction
  has value: 1e+03
subclass of: Restriction
  has value: 0e+00
qudtReference: http://qudt.org/vocab/unit/KiloN
ucumCode: kN
unitSymbol: kN
EMMO 967080e5 2f42 4eb2 a3a9 c58143e835f9: 1 000-fold of the SI derived unit newton -- QUDT

KiloNewtonMetre
type: Class
comment: 1 000-fold of the product of the SI derived unit newton and the SI base unit metre -- QUDT
subclass of: Restriction
  some values from: NewtonMetre
subclass of: Restriction
  has value: 1e+03
subclass of: Restriction
  has value: 0e+00
alternative label: Kilonewton Metre
qudtReference: http://qudt.org/vocab/unit/KiloN-M
ucumCode: kN.m
unitSymbol: kN⋅m
EMMO 967080e5 2f42 4eb2 a3a9 c58143e835f9: 1 000-fold of the product of the SI derived unit newton and the SI base unit metre -- QUDT

KiloNewtonSquareMetre
type: Class
subclass of: Restriction
  some values from: NewtonSquareMetre
subclass of: Restriction
  has value: 1e+03
subclass of: Restriction
  has value: 0e+00
alternative label: Kilo Newton Square Metre
qudtReference: http://qudt.org/vocab/unit/KiloN-M2
unitSymbol: kN⋅m²

KiloOhm
type: Class
comment: 1 000-fold of the SI derived unit ohm -- QUDT
subclass of: Restriction
  has value: 0e+00
subclass of: Restriction
  has value: 1e+03
subclass of: Restriction
  some values from: Ohm
qudtReference: http://qudt.org/vocab/unit/KiloOHM
ucumCode: kOhm
unitSymbol: kΩ
EMMO 967080e5 2f42 4eb2 a3a9 c58143e835f9: 1 000-fold of the SI derived unit ohm -- QUDT

KiloPascal
type: Class
comment: Kilopascal is a unit of pressure. 1 kPa is approximately the pressure exerted by a 10-g mass resting on a 1-cm2 area. 101.3 kPa = 1 atm. There are 1,000 pascals in 1 kilopascal. -- QUDT
subclass of: Restriction
  has value: 0e+00
subclass of: Restriction
  some values from: Pascal
subclass of: Restriction
  has value: 1e+03
qudtReference: http://qudt.org/vocab/unit/KiloPA
ucumCode: kPa
unitSymbol: kPa
EMMO 967080e5 2f42 4eb2 a3a9 c58143e835f9: Kilopascal is a unit of pressure. 1 kPa is approximately the pressure exerted by a 10-g mass resting on a 1-cm2 area. 101.3 kPa = 1 atm. There are 1,000 pascals in 1 kilopascal. -- QUDT

KiloPascalAbsolute
type: Class
comment: `Kilopascal Absolute` is a SI System unit for 'Force Per Area' expressed as KPaA. -- QUDT
subclass of: Restriction
  has value: 1e+03
subclass of: Restriction
  has value: 0e+00
alternative label: Kilopascal Absolute
qudtReference: http://qudt.org/vocab/unit/KiloPA_A
ucumCode: kPa{absolute}
unitSymbol: KPaA
EMMO 967080e5 2f42 4eb2 a3a9 c58143e835f9: `Kilopascal Absolute` is a SI System unit for 'Force Per Area' expressed as KPaA. -- QUDT

KiloPascalPerBar
type: Class
comment: 1 000-fold of the SI derived unit pascal divided by the unit bar -- QUDT
subclass of: Restriction
  some values from: PascalPerBar
subclass of: Restriction
  has value: 1e+08
subclass of: Restriction
  has value: 0e+00
alternative label: Kilopascal Per Bar
qudtReference: http://qudt.org/vocab/unit/KiloPA-PER-BAR
ucumCode: kPa.bar-1
unitSymbol: kPa/bar
EMMO 967080e5 2f42 4eb2 a3a9 c58143e835f9: 1 000-fold of the SI derived unit pascal divided by the unit bar -- QUDT

KiloPascalPerKelvin
type: Class
comment: 1 000-fold of the SI derived unit pascal divided by the SI base unit kelvin -- QUDT
subclass of: Restriction
  some values from: PascalPerKelvin
subclass of: Restriction
  has value: 1e+03
subclass of: Restriction
  has value: 0e+00
alternative label: Kilopascal Per Kelvin
qudtReference: http://qudt.org/vocab/unit/KiloPA-PER-K
ucumCode: kPa.K-1
unitSymbol: kPa/K
EMMO 967080e5 2f42 4eb2 a3a9 c58143e835f9: 1 000-fold of the SI derived unit pascal divided by the SI base unit kelvin -- QUDT

KiloPascalPerMilliMetre
type: Class
comment: 1 000-fold of the derived SI unit pascal divided by the 0.001-fold of the SI base unit metre -- QUDT
subclass of: Restriction
  has value: 1e+05
subclass of: Restriction
  has value: 0e+00
alternative label: Kilopascal Per Millimetre
qudtReference: http://qudt.org/vocab/unit/KiloPA-PER-MilliM
ucumCode: kPa.mm-1
unitSymbol: kPa/mm
EMMO 967080e5 2f42 4eb2 a3a9 c58143e835f9: 1 000-fold of the derived SI unit pascal divided by the 0.001-fold of the SI base unit metre -- QUDT

KiloPascalSquareMetrePerGram
type: Class
comment: sector-specific unit of the burst index as 1 000-fold of the derived unit for pressure pascal related to the substance, represented as a quotient from the 0.001-fold of the SI base unit kilogram divided by the power of the SI base unit metre by exponent 2 -- QUDT
subclass of: Restriction
  has value: 1e+06
subclass of: Restriction
  has value: 0e+00
alternative label: Kilopascal Square Metre per Gram
qudtReference: http://qudt.org/vocab/unit/KiloPA-M2-PER-GM
ucumCode: kPa.m2.g-1
unitSymbol: kPa⋅m²/g
EMMO 967080e5 2f42 4eb2 a3a9 c58143e835f9: sector-specific unit of the burst index as 1 000-fold of the derived unit for pressure pascal related to the substance, represented as a quotient from the 0.001-fold of the SI base unit kilogram divided by the power of the SI base unit metre by exponent 2 -- QUDT

KiloPond
type: Class
comment: illegal unit of the weight, defined as mass of 1 kg which receives a weight of 1 kp through gravitation at sea level, which equates to a force of 9,806 65 newton -- QUDT
subclass of: Restriction
  has value: 9.80665e+00
subclass of: Restriction
  has value: 0e+00
qudtReference: http://qudt.org/vocab/unit/KiloP
ucumCode: kgf
unitSymbol: kP
EMMO 967080e5 2f42 4eb2 a3a9 c58143e835f9: illegal unit of the weight, defined as mass of 1 kg which receives a weight of 1 kp through gravitation at sea level, which equates to a force of 9,806 65 newton -- QUDT
EMMO c7b62dd7 063a 4c2a 8504 42f7264ba83f: Same as kilogramForce

KiloPoundForce
type: Class
subclass of: Restriction
  has value: 4.448222e+03
subclass of: Restriction
  has value: 0e+00
subclass of: Restriction
  some values from: PoundForce
alternative label: KiloPound Force
qudtReference: http://qudt.org/vocab/unit/KiloLB_F
unitSymbol: klbf

KiloPoundForcePerSquareInch
type: Class
comment: 1 000-fold of the unit for pressure psi as a compounded unit pound-force according to the Anglo-American system of units divided by the power of the unit Inch according to the Anglo-American and Imperial system of units by exponent 2 -- QUDT
subclass of: Restriction
  some values from: PoundForcePerSquareInch
subclass of: Restriction
  has value: 6.894758e+06
subclass of: Restriction
  has value: 0e+00
alternative label: Kilopound Force Per Square Inch
qudtReference: http://qudt.org/vocab/unit/KiloLB_F-PER-IN2
ucumCode: k[lbf_av].[sin_i]-1
unitSymbol: kpsi
EMMO 967080e5 2f42 4eb2 a3a9 c58143e835f9: 1 000-fold of the unit for pressure psi as a compounded unit pound-force according to the Anglo-American system of units divided by the power of the unit Inch according to the Anglo-American and Imperial system of units by exponent 2 -- QUDT

KiloRoentgen
type: Class
comment: 1 000-fold of the unit roentgen -- QUDT
subclass of: Restriction
  some values from: Roentgen
subclass of: Restriction
  has value: 2.58e-01
subclass of: Restriction
  has value: 0e+00
qudtReference: http://qudt.org/vocab/unit/KiloR
ucumCode: kR
unitSymbol: kR
EMMO 967080e5 2f42 4eb2 a3a9 c58143e835f9: 1 000-fold of the unit roentgen -- QUDT

KiloSiemensPerMetre
type: Class
comment: 1 000-fold of the SI derived unit siemens divided by the SI base unit metre -- QUDT
subclass of: Restriction
  some values from: SiemensPerMetre
subclass of: Restriction
  has value: 1e+03
subclass of: Restriction
  has value: 0e+00
alternative label: Kilosiemens Per Metre
qudtReference: http://qudt.org/vocab/unit/KiloS-PER-M
ucumCode: kS.m-1
unitSymbol: kS/m
EMMO 967080e5 2f42 4eb2 a3a9 c58143e835f9: 1 000-fold of the SI derived unit siemens divided by the SI base unit metre -- QUDT

KiloTonne
type: Class
subclass of: Restriction
  some values from: Tonne
subclass of: Restriction
  has value: 1e+06
subclass of: Restriction
  has value: 0e+00
qudtReference: http://qudt.org/vocab/unit/KiloTONNE
unitSymbol: kt

KiloVolt
type: Class
comment: 1 000-fold of the SI derived unit volt -- QUDT
subclass of: Restriction
  some values from: Volt
subclass of: Restriction
  has value: 1e+03
subclass of: Restriction
  has value: 0e+00
qudtReference: http://qudt.org/vocab/unit/KiloV
ucumCode: kV
unitSymbol: kV
EMMO 967080e5 2f42 4eb2 a3a9 c58143e835f9: 1 000-fold of the SI derived unit volt -- QUDT

KiloVoltAmpere
type: Class
comment: 1 000-fold of the product of the SI derived unit volt and the SI base unit ampere -- QUDT
subclass of: Restriction
  some values from: VoltAmpere
subclass of: Restriction
  has value: 1e+03
subclass of: Restriction
  has value: 0e+00
alternative label: Kilovolt Ampere
qudtReference: http://qudt.org/vocab/unit/KiloV-A
ucumCode: kV.A
unitSymbol: kV⋅A
EMMO 967080e5 2f42 4eb2 a3a9 c58143e835f9: 1 000-fold of the product of the SI derived unit volt and the SI base unit ampere -- QUDT

KiloVoltAmpereHour
type: Class
comment: product of the 1 000-fold of the unit for apparent by ampere and the unit hour -- QUDT
subclass of: Restriction
  some values from: VoltAmpereHour
subclass of: Restriction
  has value: 3.6e+06
subclass of: Restriction
  has value: 0e+00
alternative label: Kilovolt Ampere Hour
qudtReference: http://qudt.org/vocab/unit/KiloV-A-HR
ucumCode: kV.A.h
unitSymbol: kV⋅A/h
EMMO 967080e5 2f42 4eb2 a3a9 c58143e835f9: product of the 1 000-fold of the unit for apparent by ampere and the unit hour -- QUDT

KiloVoltAmpereReactive
type: Class
comment: 1 000-fold of the unit var -- QUDT
subclass of: Restriction
  some values from: VoltAmpereReactive
subclass of: Restriction
  has value: 1e+03
subclass of: Restriction
  has value: 0e+00
alternative label: Kilovolt Ampere Reactive
qudtReference: http://qudt.org/vocab/unit/KiloV-A_Reactive
ucumCode: kV.A{reactive}
unitSymbol: kV⋅A{Reactive}
EMMO 967080e5 2f42 4eb2 a3a9 c58143e835f9: 1 000-fold of the unit var -- QUDT

KiloVoltAmpereReactiveHour
type: Class
comment: product of the 1 000-fold of the unit volt ampere reactive and the unit hour -- QUDT
subclass of: Restriction
  some values from: VoltAmpereReactiveHour
subclass of: Restriction
  has value: 3.6e+06
subclass of: Restriction
  has value: 0e+00
alternative label: Kilovolt Ampere Reactive Hour
qudtReference: http://qudt.org/vocab/unit/KiloV-A_Reactive-HR
ucumCode: kV.A.h{reactive}
unitSymbol: kV⋅A{Reactive}⋅hr
EMMO 967080e5 2f42 4eb2 a3a9 c58143e835f9: product of the 1 000-fold of the unit volt ampere reactive and the unit hour -- QUDT

KiloVoltPerMetre
type: Class
comment: 1 000-fold of the SI derived unit volt divided by the SI base unit metre -- QUDT
subclass of: Restriction
  has value: 1e+03
subclass of: Restriction
  some values from: VoltPerMetre
subclass of: Restriction
  has value: 0e+00
alternative label: Kilovolt Per Metre
qudtReference: http://qudt.org/vocab/unit/KiloV-PER-M
ucumCode: kV.m-1
unitSymbol: kV/m
EMMO 967080e5 2f42 4eb2 a3a9 c58143e835f9: 1 000-fold of the SI derived unit volt divided by the SI base unit metre -- QUDT

KiloWatt
type: Class
comment: The kilowatt is a derived unit of power in the International System of Units (SI), The unit, defined as 1,000 joule per second, measures the rate of energy conversion or transfer. -- QUDT
subclass of: Restriction
  some values from: Watt
subclass of: Restriction
  has value: 1e+03
subclass of: Restriction
  has value: 0e+00
qudtReference: http://qudt.org/vocab/unit/KiloW
ucumCode: kW
unitSymbol: kW
EMMO 967080e5 2f42 4eb2 a3a9 c58143e835f9: The kilowatt is a derived unit of power in the International System of Units (SI), The unit, defined as 1,000 joule per second, measures the rate of energy conversion or transfer. -- QUDT
wikipediaReference: http://en.wikipedia.org/wiki/Watt

KiloWattHourPerSquareMetre
type: Class
comment: A unit of energy per unit area, equivalent to 3 600 000 joules per square metre. -- QUDT
subclass of: Restriction
  has value: 3.6e+06
subclass of: Restriction
  has value: 0e+00
alternative label: Kilowatt hour per square metre
qudtReference: http://qudt.org/vocab/unit/KiloW-HR-PER-M2
unitSymbol: kW⋅h/m²
EMMO 967080e5 2f42 4eb2 a3a9 c58143e835f9: A unit of energy per unit area, equivalent to 3 600 000 joules per square metre. -- QUDT

KiloWattHour
type: Class
comment: The kilowatt hour, or kilowatt-hour, (symbol kW · h, kW h or kWh) is a unit of energy equal to 1000 watt hours or 3.6 megajoules. For constant power, energy in watt hours is the product of power in watts and time in hours. The kilowatt hour is most commonly known as a billing unit for energy delivered to consumers by electric utilities. -- QUDT
subclass of: Restriction
  some values from: Watthour
subclass of: Restriction
  has value: 3.6e+06
subclass of: Restriction
  has value: 0e+00
qudtReference: http://qudt.org/vocab/unit/KiloW-HR
ucumCode: kW.h
unitSymbol: kW⋅h
EMMO 967080e5 2f42 4eb2 a3a9 c58143e835f9: The kilowatt hour, or kilowatt-hour, (symbol kW · h, kW h or kWh) is a unit of energy equal to 1000 watt hours or 3.6 megajoules. For constant power, energy in watt hours is the product of power in watts and time in hours. The kilowatt hour is most commonly known as a billing unit for energy delivered to consumers by electric utilities. -- QUDT
wikipediaReference: http://en.wikipedia.org/wiki/Kilowatt_hour

KiloWeber
type: Class
subclass of: Restriction
  some values from: Weber
subclass of: Restriction
  has value: 1e+03
subclass of: Restriction
  has value: 0e+00
qudtReference: http://qudt.org/vocab/unit/KiloWB
unitSymbol: kWb

KiloWeberPerMetre
type: Class
comment: 1 000-fold of the SI derived unit weber divided by the SI base unit metre -- QUDT
subclass of: Restriction
  has value: 1e+03
subclass of: Restriction
  some values from: WeberPerMetre
subclass of: Restriction
  has value: 0e+00
alternative label: Kiloweber Per Metre
qudtReference: http://qudt.org/vocab/unit/KiloWB-PER-M
ucumCode: kWb.m-1
unitSymbol: kWb/m
EMMO 967080e5 2f42 4eb2 a3a9 c58143e835f9: 1 000-fold of the SI derived unit weber divided by the SI base unit metre -- QUDT

KiloYear
type: Class
subclass of: Restriction
  has value: 1e+03
subclass of: Restriction
  has value: 0e+00
qudtReference: http://qudt.org/vocab/unit/KiloYR
unitSymbol: 1000 yr

KilogramForce
type: Class
comment: "Kilogram Force" is a unit for 'Force' expressed as kgf. -- QUDT
subclass of: Restriction
  has value: 9.80665e+00
subclass of: Restriction
  has value: 0e+00
alternative label: Kilogram Force
qudtReference: http://qudt.org/vocab/unit/KiloGM_F
ucumCode: kgf
unitSymbol: kgf
EMMO 967080e5 2f42 4eb2 a3a9 c58143e835f9: "Kilogram Force" is a unit for 'Force' expressed as kgf. -- QUDT
wikipediaReference: http://en.wikipedia.org/wiki/Kilogram-force

KilogramForceMetre
type: Class
comment: product of the unit kilogram-force and the SI base unit metre -- QUDT
subclass of: Restriction
  has value: 9.80665e+00
subclass of: Restriction
  has value: 0e+00
alternative label: Kilogram?force Metre
qudtReference: http://qudt.org/vocab/unit/KiloGM_F-M
ucumCode: kgf.m
unitSymbol: kgf⋅m
EMMO 967080e5 2f42 4eb2 a3a9 c58143e835f9: product of the unit kilogram-force and the SI base unit metre -- QUDT

KilogramForceMetrePerSecond
type: Class
comment: product of the SI base unit metre and the unit kilogram-force according to the Anglo-American and Imperial system of units divided by the SI base unit second -- QUDT
subclass of: Restriction
  has value: 9.80665e+00
subclass of: Restriction
  has value: 0e+00
alternative label: Kilogram?force Metre Per Second
qudtReference: http://qudt.org/vocab/unit/KiloGM_F-M-PER-SEC
ucumCode: kgf.m.s-1
unitSymbol: kgf⋅m/s
EMMO 967080e5 2f42 4eb2 a3a9 c58143e835f9: product of the SI base unit metre and the unit kilogram-force according to the Anglo-American and Imperial system of units divided by the SI base unit second -- QUDT

KilogramForceMetrePerSquareCentiMetre
type: Class
comment: product of the unit kilogram-force and the SI base unit metre divided by the 0.0001-fold of the power of the SI base unit metre by exponent 2 -- QUDT
subclass of: Restriction
  has value: 0e+00
subclass of: Restriction
  has value: 9.80665e+04
alternative label: Kilogram?force Metre Per Square Centimetre
qudtReference: http://qudt.org/vocab/unit/KiloGM_F-M-PER-CentiM2
ucumCode: kgf.m.cm-2
unitSymbol: kgf⋅m/cm²
EMMO 967080e5 2f42 4eb2 a3a9 c58143e835f9: product of the unit kilogram-force and the SI base unit metre divided by the 0.0001-fold of the power of the SI base unit metre by exponent 2 -- QUDT

KilogramForcePerSquareCentiMetre
type: Class
comment: "Kilogram Force per Square Centimeter" is a unit for 'Force Per Area' expressed as kgf/cm². -- QUDT
subclass of: Restriction
  has value: 9.80665e+04
subclass of: Restriction
  has value: 0e+00
alternative label: Kilogram Force per Square Centimetre
qudtReference: http://qudt.org/vocab/unit/KiloGM_F-PER-CentiM2
ucumCode: kgf.cm-2
unitSymbol: kgf/cm²
EMMO 967080e5 2f42 4eb2 a3a9 c58143e835f9: "Kilogram Force per Square Centimeter" is a unit for 'Force Per Area' expressed as kgf/cm². -- QUDT

KilogramForcePerSquareMetre
type: Class
comment: not SI conform unit of the pressure -- QUDT
subclass of: Restriction
  has value: 9.80665e+00
subclass of: Restriction
  has value: 0e+00
alternative label: Kilogram Force Per Square Metre
qudtReference: http://qudt.org/vocab/unit/KiloGM_F-PER-M2
ucumCode: kgf.m-2
unitSymbol: kgf/m²
EMMO 967080e5 2f42 4eb2 a3a9 c58143e835f9: not SI conform unit of the pressure -- QUDT

KilogramForcePerSquareMilliMetre
type: Class
comment: not SI conform unit of the pressure -- QUDT
subclass of: Restriction
  has value: 9.80665e+06
subclass of: Restriction
  has value: 0e+00
alternative label: Kilogram Force Per Square Millimetre
qudtReference: http://qudt.org/vocab/unit/KiloGM_F-PER-MilliM2
ucumCode: kgf.mm-2
unitSymbol: kgf/mm²
EMMO 967080e5 2f42 4eb2 a3a9 c58143e835f9: not SI conform unit of the pressure -- QUDT

KilogramKelvin
type: Class
comment: `Kilogram Kelvin` is a unit for 'Mass Temperature' expressed as kg-K. -- QUDT
subclass of: Restriction
  has value: 1e+00
subclass of: Restriction
  has value: 0e+00
alternative label: Kilogram Kelvin
qudtReference: http://qudt.org/vocab/unit/KiloGM-K
ucumCode: kg.K
unitSymbol: kg⋅K
EMMO 967080e5 2f42 4eb2 a3a9 c58143e835f9: `Kilogram Kelvin` is a unit for 'Mass Temperature' expressed as kg-K. -- QUDT

KilogramMetrePerSecond
type: Class
comment: "Kilogram Meter Per Second" is a unit for 'Linear Momentum' expressed as kg-m/s. -- QUDT
subclass of: Restriction
  has value: 1e+00
subclass of: Restriction
  has value: 0e+00
alternative label: Kilogram Metre Per Second
qudtReference: http://qudt.org/vocab/unit/KiloGM-M-PER-SEC
ucumCode: kg.m.s-1
ucumCode: kg.m/s
unitSymbol: kg⋅m/s
EMMO 967080e5 2f42 4eb2 a3a9 c58143e835f9: "Kilogram Meter Per Second" is a unit for 'Linear Momentum' expressed as kg-m/s. -- QUDT

KilogramPerCubicCentiMetre
type: Class
comment: SI base unit kilogram divided by the 0.000 001-fold of the power of the SI base unit metre with the exponent 3 -- QUDT
subclass of: Restriction
  has value: 0e+00
subclass of: Restriction
  has value: 1e+06
alternative label: Kilogram Per Cubic Centimetre
qudtReference: http://qudt.org/vocab/unit/KiloGM-PER-CentiM3
ucumCode: kg.cm-3
unitSymbol: kg/cm³
EMMO 967080e5 2f42 4eb2 a3a9 c58143e835f9: SI base unit kilogram divided by the 0.000 001-fold of the power of the SI base unit metre with the exponent 3 -- QUDT

KilogramPerCubicDeciMetre
type: Class
comment: SI base unit kilogram divided by the 0.001-fold of the power of the SI base unit metre with the exponent 3 -- QUDT
subclass of: Restriction
  has value: 1e+03
subclass of: Restriction
  has value: 0e+00
alternative label: Kilogram Per Cubic Decimetre
qudtReference: http://qudt.org/vocab/unit/KiloGM-PER-DeciM3
ucumCode: kg.dm-3
unitSymbol: kg/dm³
EMMO 967080e5 2f42 4eb2 a3a9 c58143e835f9: SI base unit kilogram divided by the 0.001-fold of the power of the SI base unit metre with the exponent 3 -- QUDT

KilogramPerCubicMetre
type: Class
comment: Kilogram per cubic metre is an SI derived unit of density, defined by mass in kilograms divided by volume in cubic metres. The official SI symbolic abbreviation is kg . m⁻³, or equivalently either kg/m³. -- QUDT
subclass of: Restriction
  has value: 0e+00
subclass of: Restriction
  has value: 1e+00
alternative label: Kilogram per Cubic Metre
qudtReference: http://qudt.org/vocab/unit/KiloGM-PER-M3
ucumCode: kg.m-3
ucumCode: kg/m3
unitSymbol: kg/m³
EMMO 967080e5 2f42 4eb2 a3a9 c58143e835f9: Kilogram per cubic metre is an SI derived unit of density, defined by mass in kilograms divided by volume in cubic metres. The official SI symbolic abbreviation is kg . m⁻³, or equivalently either kg/m³. -- QUDT

KilogramPerCubicMetrePerSecond
type: Class
subclass of: Restriction
  has value: 1e+00
subclass of: Restriction
  has value: 0e+00
alternative label: Kilograms per cubic metre per second
qudtReference: http://qudt.org/vocab/unit/KiloGM-PER-M3-SEC
ucumCode: kg.m-3.s-1
unitSymbol: kg/(m³⋅s)

KilogramPerDay
type: Class
comment: SI base unit kilogram divided by the unit day -- QUDT
subclass of: Restriction
  has value: 1.157407e-05
subclass of: Restriction
  has value: 0e+00
alternative label: Kilogram Per Day
qudtReference: http://qudt.org/vocab/unit/KiloGM-PER-DAY
ucumCode: kg.d-1
unitSymbol: kg/day
EMMO 967080e5 2f42 4eb2 a3a9 c58143e835f9: SI base unit kilogram divided by the unit day -- QUDT

KilogramPerHectare
type: Class
comment: Kilogram Per Hectare is a unit of mass per area. Kilogram Per Hectare (kg/ha) has a dimension of ML-2 where M is mass, and L is length. It can be converted to the corresponding standard SI unit kg/m2 by multiplying its value by a factor of 0.0001. -- QUDT
subclass of: Restriction
  has value: 1e-04
subclass of: Restriction
  has value: 0e+00
alternative label: Kilogram per Hectare
qudtReference: http://qudt.org/vocab/unit/KiloGM-PER-HA
ucumCode: kg.har-1
ucumCode: kg/har
unitSymbol: kg/ha
EMMO 967080e5 2f42 4eb2 a3a9 c58143e835f9: Kilogram Per Hectare is a unit of mass per area. Kilogram Per Hectare (kg/ha) has a dimension of ML-2 where M is mass, and L is length. It can be converted to the corresponding standard SI unit kg/m2 by multiplying its value by a factor of 0.0001. -- QUDT

KilogramPerHour
type: Class
comment: Kilogram Per Hour (kg/h) is a unit in the category of Mass flow rate. It is also known as kilogram/hour. Kilogram Per Hour (kg/h) has a dimension of MT-1 where M is mass, and T is time. It can be converted to the corresponding standard SI unit kg/s by multiplying its value by a factor of 0.000277777777778. -- QUDT
subclass of: Restriction
  has value: 2.777778e-04
subclass of: Restriction
  has value: 0e+00
alternative label: Kilogram per Hour
qudtReference: http://qudt.org/vocab/unit/KiloGM-PER-HR
ucumCode: kg.h-1
ucumCode: kg/h
unitSymbol: kg/h
EMMO 967080e5 2f42 4eb2 a3a9 c58143e835f9: Kilogram Per Hour (kg/h) is a unit in the category of Mass flow rate. It is also known as kilogram/hour. Kilogram Per Hour (kg/h) has a dimension of MT-1 where M is mass, and T is time. It can be converted to the corresponding standard SI unit kg/s by multiplying its value by a factor of 0.000277777777778. -- QUDT

KilogramPerKiloMole
type: Class
comment: SI base unit kilogram divided by the 1 000-fold of the SI base unit mol -- QUDT
subclass of: Restriction
  has value: 0e+00
subclass of: Restriction
  has value: 1e-03
alternative label: Kilogram Per Kilomole
qudtReference: http://qudt.org/vocab/unit/KiloGM-PER-KiloMOL
ucumCode: kg.kmol-1
unitSymbol: kg/kmol
EMMO 967080e5 2f42 4eb2 a3a9 c58143e835f9: SI base unit kilogram divided by the 1 000-fold of the SI base unit mol -- QUDT

KilogramPerKilogram
type: Class
comment: SI base unit kilogram divided by the SI base unit kilogram -- QUDT
subclass of: Restriction
  has value: 1e+00
subclass of: Restriction
  has value: 0e+00
alternative label: Kilogram Per Kilogram
qudtReference: http://qudt.org/vocab/unit/KiloGM-PER-KiloGM
ucumCode: kg.kg-1
unitSymbol: kg/kg
EMMO 967080e5 2f42 4eb2 a3a9 c58143e835f9: SI base unit kilogram divided by the SI base unit kilogram -- QUDT

KilogramPerLitre
type: Class
comment: SI base unit kilogram divided by the unit litre -- QUDT
subclass of: Restriction
  has value: 1e+03
subclass of: Restriction
  has value: 0e+00
alternative label: Kilogram Per Litre
qudtReference: http://qudt.org/vocab/unit/KiloGM-PER-L
ucumCode: kg.L-1
ucumCode: kg/L
unitSymbol: kg/L
EMMO 967080e5 2f42 4eb2 a3a9 c58143e835f9: SI base unit kilogram divided by the unit litre -- QUDT

KilogramPerMetre
type: Class
comment: Kilogram Per Meter (kg/m) is a unit in the category of Linear mass density. It is also known as kilogram/meter, kilogram/metre, kilograms per meter, kilogram per metre, kilograms per metre. This unit is commonly used in the SI unit system. Kilogram Per Meter (kg/m) has a dimension of ML-1 where M is mass, and L is length. This unit is the standard SI unit in this category. -- QUDT
subclass of: Restriction
  has value: 1e+00
subclass of: Restriction
  has value: 0e+00
alternative label: Kilogram per Metre
qudtReference: http://qudt.org/vocab/unit/KiloGM-PER-M
ucumCode: kg.m-1
ucumCode: kg/m
unitSymbol: kg/m
EMMO 967080e5 2f42 4eb2 a3a9 c58143e835f9: Kilogram Per Meter (kg/m) is a unit in the category of Linear mass density. It is also known as kilogram/meter, kilogram/metre, kilograms per meter, kilogram per metre, kilograms per metre. This unit is commonly used in the SI unit system. Kilogram Per Meter (kg/m) has a dimension of ML-1 where M is mass, and L is length. This unit is the standard SI unit in this category. -- QUDT

KilogramPerMetrePerHour
type: Class
comment: One SI standard unit of mass over one SI standard unit of length over 3600 times one SI standard unit of time. -- QUDT
subclass of: Restriction
  has value: 2.777778e-04
subclass of: Restriction
  has value: 0e+00
alternative label: Kilograms per metre per hour
qudtReference: http://qudt.org/vocab/unit/KiloGM-PER-M-HR
ucumCode: kg.m-1.h-1
unitSymbol: kg/(m⋅h)
EMMO 967080e5 2f42 4eb2 a3a9 c58143e835f9: One SI standard unit of mass over one SI standard unit of length over 3600 times one SI standard unit of time. -- QUDT

KilogramPerMetrePerSecond
type: Class
subclass of: Restriction
  has value: 1e+00
subclass of: Restriction
  has value: 0e+00
alternative label: Kilograms per metre per second
qudtReference: http://qudt.org/vocab/unit/KiloGM-PER-M-SEC
ucumCode: kg.m-1.s-1
unitSymbol: kg/(m⋅s)

KilogramPerMetrePerSquareSecond
type: Class
comment: The SI unit of pressure. The pascal is the standard pressure unit in the MKS metric system, equal to one newton per square meter or one "kilogram per meter per second per second." The unit is named for Blaise Pascal (1623-1662), French philosopher and mathematician, who was the first person to use a barometer to measure differences in altitude. -- QUDT
subclass of: Restriction
  has value: 1e+00
subclass of: Restriction
  has value: 0e+00
alternative label: Kilograms per metre per square second
qudtReference: http://qudt.org/vocab/unit/KiloGM-PER-M-SEC2
ucumCode: kg.m-1.s-2
unitSymbol: kg/(m⋅s²)
EMMO 967080e5 2f42 4eb2 a3a9 c58143e835f9: The SI unit of pressure. The pascal is the standard pressure unit in the MKS metric system, equal to one newton per square meter or one "kilogram per meter per second per second." The unit is named for Blaise Pascal (1623-1662), French philosopher and mathematician, who was the first person to use a barometer to measure differences in altitude. -- QUDT

KilogramPerMilliMetre
type: Class
comment: SI base unit kilogram divided by the 0.001-fold of the SI base unit metre -- QUDT
subclass of: Restriction
  has value: 1e+03
subclass of: Restriction
  has value: 0e+00
alternative label: Kilogram Per Millimetre
qudtReference: http://qudt.org/vocab/unit/KiloGM-PER-MilliM
ucumCode: kg.mm-1
unitSymbol: kg/mm
EMMO 967080e5 2f42 4eb2 a3a9 c58143e835f9: SI base unit kilogram divided by the 0.001-fold of the SI base unit metre -- QUDT

KilogramPerMinute
type: Class
comment: SI base unit kilogram divided by the unit minute -- QUDT
subclass of: Restriction
  has value: 0e+00
subclass of: Restriction
  has value: 1.666667e-02
alternative label: Kilogram Per Minute
qudtReference: http://qudt.org/vocab/unit/KiloGM-PER-MIN
ucumCode: kg.min-1
ucumCode: kg/min
unitSymbol: kg/min
EMMO 967080e5 2f42 4eb2 a3a9 c58143e835f9: SI base unit kilogram divided by the unit minute -- QUDT

KilogramPerMole
type: Class
comment: In chemistry, the molar mass M is defined as the mass of a given substance (chemical element or chemical compound) divided by its amount of substance. It is a physical property of a given substance. The base SI unit for molar mass is kg/mol. However, for historical reasons, molar masses are almost always expressed in g/mol. As an example, the molar mass of water is approximately: 18.01528(33) g/mol. -- QUDT
subclass of: Restriction
  has value: 1e+00
subclass of: Restriction
  has value: 0e+00
alternative label: Kilogram per Mole
qudtReference: http://qudt.org/vocab/unit/KiloGM-PER-MOL
ucumCode: kg.mol-1
ucumCode: kg/mol
unitSymbol: kg/mol
EMMO 967080e5 2f42 4eb2 a3a9 c58143e835f9: In chemistry, the molar mass M is defined as the mass of a given substance (chemical element or chemical compound) divided by its amount of substance. It is a physical property of a given substance. The base SI unit for molar mass is kg/mol. However, for historical reasons, molar masses are almost always expressed in g/mol. As an example, the molar mass of water is approximately: 18.01528(33) g/mol. -- QUDT

KilogramPerSecond
type: Class
comment: Kilogram Per Second (kg/s) is a unit in the category of Mass flow rate. It is also known as kilogram/second, kilograms per second. This unit is commonly used in the SI unit system. Kilogram Per Second (kg/s) has a dimension of MT⁻¹ where M is mass, and T is time. This unit is the standard SI unit in this category. -- QUDT
subclass of: Restriction
  has value: 1e+00
subclass of: Restriction
  has value: 0e+00
alternative label: Kilogram per Second
qudtReference: http://qudt.org/vocab/unit/KiloGM-PER-SEC
ucumCode: kg.s-1
ucumCode: kg/s
unitSymbol: kg/s
EMMO 967080e5 2f42 4eb2 a3a9 c58143e835f9: Kilogram Per Second (kg/s) is a unit in the category of Mass flow rate. It is also known as kilogram/second, kilograms per second. This unit is commonly used in the SI unit system. Kilogram Per Second (kg/s) has a dimension of MT⁻¹ where M is mass, and T is time. This unit is the standard SI unit in this category. -- QUDT

KilogramPerSecondPerSquareMetre
type: Class
comment: SI base unit kilogram divided by the product of the power of the SI base unit metre with the exponent 2 and the SI base unit second -- QUDT
subclass of: Restriction
  has value: 1e+00
subclass of: Restriction
  has value: 0e+00
alternative label: Kilogram Per Second Per Square Metre
qudtReference: http://qudt.org/vocab/unit/KiloGM-PER-SEC-M2
ucumCode: kg.(s.m2)-1
ucumCode: kg.s-1.m-2
ucumCode: kg/(s.m2)
unitSymbol: kg/(s⋅m²)
EMMO 967080e5 2f42 4eb2 a3a9 c58143e835f9: SI base unit kilogram divided by the product of the power of the SI base unit metre with the exponent 2 and the SI base unit second -- QUDT

KilogramPerSquareCentiMetre
type: Class
comment: SI base unit kilogram divided by the 0.0001-fold of the power of the SI base unit metre by exponent 2 -- QUDT
subclass of: Restriction
  has value: 1e+04
subclass of: Restriction
  has value: 0e+00
alternative label: Kilogram Per Square Centimetre
qudtReference: http://qudt.org/vocab/unit/KiloGM-PER-CentiM2
ucumCode: kg.cm-2
unitSymbol: kg/cm²
EMMO 967080e5 2f42 4eb2 a3a9 c58143e835f9: SI base unit kilogram divided by the 0.0001-fold of the power of the SI base unit metre by exponent 2 -- QUDT

KilogramPerSquareKiloMetre
type: Class
comment: One SI standard unit of mass over the square of one thousand standard unit of length. -- QUDT
subclass of: Restriction
  has value: 1e-06
subclass of: Restriction
  has value: 0e+00
alternative label: Kilograms per square kilometre
qudtReference: http://qudt.org/vocab/unit/KiloGM-PER-KiloM2
ucumCode: kg.km-2
unitSymbol: kg/km²
EMMO 967080e5 2f42 4eb2 a3a9 c58143e835f9: One SI standard unit of mass over the square of one thousand standard unit of length. -- QUDT

KilogramPerSquareMetre
type: Class
comment: Kilogram Per Square Meter (kg/m2) is a unit in the category of Surface density. It is also known as kilograms per square meter, kilogram per square metre, kilograms per square metre, kilogram/square meter, kilogram/square metre. This unit is commonly used in the SI unit system. Kilogram Per Square Meter (kg/m2) has a dimension of ML-2 where M is mass, and L is length. This unit is the standard SI unit in this category. -- QUDT
subclass of: Restriction
  has value: 1e+00
subclass of: Restriction
  has value: 0e+00
alternative label: Kilogram per Square Metre
qudtReference: http://qudt.org/vocab/unit/KiloGM-PER-M2
ucumCode: kg.m-2
ucumCode: kg/m2
unitSymbol: kg/m²
EMMO 967080e5 2f42 4eb2 a3a9 c58143e835f9: Kilogram Per Square Meter (kg/m2) is a unit in the category of Surface density. It is also known as kilograms per square meter, kilogram per square metre, kilograms per square metre, kilogram/square meter, kilogram/square metre. This unit is commonly used in the SI unit system. Kilogram Per Square Meter (kg/m2) has a dimension of ML-2 where M is mass, and L is length. This unit is the standard SI unit in this category. -- QUDT

KilogramPerSquareMetrePerPascalPerSecond
type: Class
subclass of: Restriction
  has value: 1e+00
subclass of: Restriction
  has value: 0e+00
alternative label: Kilograms per square metre per Pascal per second
qudtReference: http://qudt.org/vocab/unit/KiloGM-PER-M2-PA-SEC
unitSymbol: kg/(m²⋅s⋅Pa)
wikipediaReference: https://en.wikipedia.org/wiki/Perm_(unit)

KilogramPerSquareMetrePerSecond
type: Class
subclass of: Restriction
  has value: 1e+00
subclass of: Restriction
  has value: 0e+00
alternative label: Kilograms per square metre per second
qudtReference: http://qudt.org/vocab/unit/KiloGM-PER-M2-SEC
ucumCode: kg.m-2.s-1
unitSymbol: kg/(m²⋅s)

KilogramPerSquareMetreSquareSecond
type: Class
subclass of: Restriction
  has value: 1e+00
subclass of: Restriction
  has value: 0e+00
alternative label: Kilogram per Square Metre Square Second
qudtReference: http://qudt.org/vocab/unit/KiloGM-PER-M2-SEC2
unitSymbol: kg/(m²⋅s²)

KilogramPerSquareSecond
type: Class
subclass of: Restriction
  has value: 1e+00
subclass of: Restriction
  has value: 0e+00
alternative label: Kilogram per Square Second
qudtReference: http://qudt.org/vocab/unit/KiloGM-PER-SEC2
ucumCode: kg.s-2
ucumCode: kg/s2
unitSymbol: kg/s²

KilogramSquareCentiMetre
type: Class
comment: product of the SI base unit kilogram and the 0 0001fold of the power of the SI base unit metre with the exponent 2 -- QUDT
subclass of: Restriction
  has value: 1e-04
subclass of: Restriction
  has value: 0e+00
alternative label: Kilogram Square Centimetre
qudtReference: http://qudt.org/vocab/unit/KiloGM-CentiM2
ucumCode: kg.cm2
unitSymbol: kg⋅cm²
EMMO 967080e5 2f42 4eb2 a3a9 c58143e835f9: product of the SI base unit kilogram and the 0 0001fold of the power of the SI base unit metre with the exponent 2 -- QUDT

KilogramSquareMetre
type: Class
comment: "Kilogram Square Meter" is a unit for 'Moment Of Inertia' expressed as kg-m². -- QUDT
subclass of: Restriction
  has value: 1e+00
subclass of: Restriction
  has value: 0e+00
alternative label: Kilogram Square Metre
qudtReference: http://qudt.org/vocab/unit/KiloGM-M2
ucumCode: kg.m2
unitSymbol: kg⋅m²
EMMO 967080e5 2f42 4eb2 a3a9 c58143e835f9: "Kilogram Square Meter" is a unit for 'Moment Of Inertia' expressed as kg-m². -- QUDT

KilogramSquareMetrePerSecond
type: Class
comment: "Kilogram Square Meter Per Second" is a unit for 'Angular Momentum' expressed as kg-m²-s⁻¹. -- QUDT
subclass of: Restriction
  has value: 1e+00
subclass of: Restriction
  has value: 0e+00
alternative label: Kilogram Square Metre Per Second
qudtReference: http://qudt.org/vocab/unit/KiloGM-M2-PER-SEC
ucumCode: kg.m2.s-1
unitSymbol: kg⋅m²/s
EMMO 967080e5 2f42 4eb2 a3a9 c58143e835f9: "Kilogram Square Meter Per Second" is a unit for 'Angular Momentum' expressed as kg-m²-s⁻¹. -- QUDT

KilogramSquareMilliMetre
type: Class
comment: product of the SI base kilogram and the 0.001-fold of the power of the SI base metre with the exponent 2 -- QUDT
subclass of: Restriction
  has value: 1e-06
subclass of: Restriction
  has value: 0e+00
alternative label: Kilogram Square Millimetre
qudtReference: http://qudt.org/vocab/unit/KiloGM-MilliM2
ucumCode: kg.mm2
unitSymbol: kg⋅mm²
EMMO 967080e5 2f42 4eb2 a3a9 c58143e835f9: product of the SI base kilogram and the 0.001-fold of the power of the SI base metre with the exponent 2 -- QUDT

KilogramSquareSecond
type: Class
subclass of: Restriction
  has value: 0e+00
subclass of: Restriction
  has value: 1e+00
alternative label: Kilogram Square Second
qudtReference: http://qudt.org/vocab/unit/KiloGM-SEC2
ucumCode: kg.s2
unitSymbol: kg⋅s²

Kip
type: Class
comment: 1000 pound-force -- QUDT
subclass of: Restriction
  has value: 4.448222e+03
subclass of: Restriction
  has value: 0e+00
qudtReference: http://qudt.org/vocab/unit/KIP_F
ucumCode: k[lbf_av]
unitSymbol: kip
EMMO 967080e5 2f42 4eb2 a3a9 c58143e835f9: 1000 pound-force -- QUDT
wikipediaReference: http://en.wikipedia.org/wiki/Kip

KipPerSquareInch
type: Class
comment: "Kip per Square Inch" is a unit for 'Force Per Area' expressed as kip/in². -- QUDT
subclass of: Restriction
  has value: 6.894758e+06
subclass of: Restriction
  has value: 0e+00
alternative label: Kip per Square Inch
qudtReference: http://qudt.org/vocab/unit/KIP_F-PER-IN2
ucumCode: k[lbf_av].[in_i]-2
unitSymbol: kip/in²
EMMO 967080e5 2f42 4eb2 a3a9 c58143e835f9: "Kip per Square Inch" is a unit for 'Force Per Area' expressed as kip/in². -- QUDT

Knot
type: Class
comment: The knot (pronounced 'not') is a unit of speed equal to one nautical mile (1.852 km) per hour, approximately 1.151 mph. The abbreviation kn is preferred by the International Hydrographic Organization (IHO), which includes every major sea-faring nation; however, the abbreviations kt (singular) and kts (plural) are also widely used. However, use of the abbreviation kt for knot conflicts with the SI symbol for kilotonne. The knot is a non-SI unit accepted for use with the International System of Units (SI). Worldwide, the knot is used in meteorology, and in maritime and air navigation - for example, a vessel travelling at 1 knot along a meridian travels one minute of geographic latitude in one hour. Etymologically, the term knot derives from counting the number of knots in the line that unspooled from the reel of a chip log in a specific time. -- QUDT
subclass of: Restriction
  has value: 0e+00
subclass of: Restriction
  has value: 5.144444e-01
qudtReference: http://qudt.org/vocab/unit/KN
ucumCode: [kn_i]
unitSymbol: kn
EMMO 967080e5 2f42 4eb2 a3a9 c58143e835f9: The knot (pronounced 'not') is a unit of speed equal to one nautical mile (1.852 km) per hour, approximately 1.151 mph. The abbreviation kn is preferred by the International Hydrographic Organization (IHO), which includes every major sea-faring nation; however, the abbreviations kt (singular) and kts (plural) are also widely used. However, use of the abbreviation kt for knot conflicts with the SI symbol for kilotonne. The knot is a non-SI unit accepted for use with the International System of Units (SI). Worldwide, the knot is used in meteorology, and in maritime and air navigation - for example, a vessel travelling at 1 knot along a meridian travels one minute of geographic latitude in one hour. Etymologically, the term knot derives from counting the number of knots in the line that unspooled from the reel of a chip log in a specific time. -- QUDT
wikipediaReference: http://en.wikipedia.org/wiki/Knot

KnotPerSecond
type: Class
comment: `Knot per Second` is a unit for 'Linear Acceleration' expressed as kt/s. -- QUDT
subclass of: Restriction
  has value: 5.144444e-01
subclass of: Restriction
  has value: 0e+00
alternative label: Knot per Second
qudtReference: http://qudt.org/vocab/unit/KN-PER-SEC
ucumCode: [kn_i].s-1
ucumCode: [kn_i]/s
unitSymbol: kn/s
EMMO 967080e5 2f42 4eb2 a3a9 c58143e835f9: `Knot per Second` is a unit for 'Linear Acceleration' expressed as kt/s. -- QUDT

Lambert
type: Class
comment: The lambert (symbol L, la or Lb) is a non-SI unit of luminance. A related unit of luminance, the foot-lambert, is used in the lighting, cinema and flight simulation industries. The SI unit is the candela per square metre (cd/m²). -- QUDT
subclass of: Restriction
  has value: 3.183099e+03
subclass of: Restriction
  has value: 0e+00
qudtReference: http://qudt.org/vocab/unit/LA
ucumCode: Lmb
unitSymbol: L
EMMO 967080e5 2f42 4eb2 a3a9 c58143e835f9: The lambert (symbol L, la or Lb) is a non-SI unit of luminance. A related unit of luminance, the foot-lambert, is used in the lighting, cinema and flight simulation industries. The SI unit is the candela per square metre (cd/m²). -- QUDT
wikipediaReference: http://en.wikipedia.org/wiki/Lambert

Lb_Ft2
type: Class
comment: product of the unit pound according to the avoirdupois system of units and the power of the unit foot according to the Anglo-American and the Imperial system of units with the exponent 2 -- QUDT
subclass of: Restriction
  has value: 4.214011e-02
subclass of: Restriction
  has value: 0e+00
alternative label: Pound Mass (avoirdupois) Square Foot
qudtReference: http://qudt.org/vocab/unit/LB-FT2
ucumCode: [lb_av].[sft_i]
unitSymbol: lb⋅ft²
EMMO 967080e5 2f42 4eb2 a3a9 c58143e835f9: product of the unit pound according to the avoirdupois system of units and the power of the unit foot according to the Anglo-American and the Imperial system of units with the exponent 2 -- QUDT

Lb_In
type: Class
comment: unit of the unbalance (product of avoirdupois pound according to the avoirdupois system of units and inch according to the Anglo-American and Imperial system of units) -- QUDT
subclass of: Restriction
  has value: 0e+00
subclass of: Restriction
  has value: 1.152125e-02
alternative label: Pound Mass (avoirdupois) Inch
qudtReference: http://qudt.org/vocab/unit/LB-IN
ucumCode: [lb_av].[in_i]
unitSymbol: lb⋅in
EMMO 967080e5 2f42 4eb2 a3a9 c58143e835f9: unit of the unbalance (product of avoirdupois pound according to the avoirdupois system of units and inch according to the Anglo-American and Imperial system of units) -- QUDT

Lb_In2
type: Class
comment: product of the unit pound according to the avoirdupois system of units and the power of the unit inch according to the Anglo-American and the Imperial system of units with the exponent 2 -- QUDT
subclass of: Restriction
  has value: 2.926397e-04
subclass of: Restriction
  has value: 0e+00
alternative label: Pound Mass (avoirdupois) Square Inch
qudtReference: http://qudt.org/vocab/unit/LB-IN2
ucumCode: [lb_av].[sin_i]
unitSymbol: lb⋅in²
EMMO 967080e5 2f42 4eb2 a3a9 c58143e835f9: product of the unit pound according to the avoirdupois system of units and the power of the unit inch according to the Anglo-American and the Imperial system of units with the exponent 2 -- QUDT

Lb_Per_Day
type: Class
comment: unit of the mass avoirdupois pound according to the avoirdupois system of units divided by the unit for time day -- QUDT
subclass of: Restriction
  has value: 0e+00
subclass of: Restriction
  has value: 5.249912e-06
alternative label: Pound (avoirdupois) Per Day
qudtReference: http://qudt.org/vocab/unit/LB-PER-DAY
ucumCode: [lb_av].d-1
unitSymbol: lb/day
EMMO 967080e5 2f42 4eb2 a3a9 c58143e835f9: unit of the mass avoirdupois pound according to the avoirdupois system of units divided by the unit for time day -- QUDT

Lb_Per_Ft2
type: Class
comment: unit for areal-related mass as a unit pound according to the avoirdupois system of units divided by the power of the unit foot according to the Anglo-American and Imperial system of units by exponent 2 -- QUDT
subclass of: Restriction
  has value: 4.882428e+00
subclass of: Restriction
  has value: 0e+00
alternative label: Pound Mass (avoirdupois) Per Square Foot
qudtReference: http://qudt.org/vocab/unit/LB-PER-FT2
ucumCode: [lb_av].[ft_i]-2
unitSymbol: lb/ft²
EMMO 967080e5 2f42 4eb2 a3a9 c58143e835f9: unit for areal-related mass as a unit pound according to the avoirdupois system of units divided by the power of the unit foot according to the Anglo-American and Imperial system of units by exponent 2 -- QUDT

Lb_Per_Gal_Uk
type: Class
comment: unit of the mass avoirdupois pound according to the avoirdupois system of units divided by the unit gallon (UK) according to the Imperial system of units -- QUDT
subclass of: Restriction
  has value: 9.977637e+01
subclass of: Restriction
  has value: 0e+00
alternative label: Pound (avoirdupois) Per Gallon (UK)
qudtReference: http://qudt.org/vocab/unit/LB-PER-GAL_UK
ucumCode: [lb_av].[gal_br]-1
unitSymbol: lb/gal{UK}
EMMO 967080e5 2f42 4eb2 a3a9 c58143e835f9: unit of the mass avoirdupois pound according to the avoirdupois system of units divided by the unit gallon (UK) according to the Imperial system of units -- QUDT

Lb_Per_Gal_Us
type: Class
comment: unit of the mass avoirdupois pound according to the avoirdupois system divided by the unit gallon (US, liq.) according to the Anglo-American system of units -- QUDT
subclass of: Restriction
  has value: 8.308122e+01
subclass of: Restriction
  has value: 0e+00
alternative label: Pound (avoirdupois) Per Gallon (US)
qudtReference: http://qudt.org/vocab/unit/LB-PER-GAL_US
ucumCode: [lb_av].[gal_us]-1
unitSymbol: lb/gal{US}
EMMO 967080e5 2f42 4eb2 a3a9 c58143e835f9: unit of the mass avoirdupois pound according to the avoirdupois system divided by the unit gallon (US, liq.) according to the Anglo-American system of units -- QUDT

Lb_Per_In2
type: Class
comment: unit of the areal-related mass as avoirdupois pound according to the avoirdupois system of units related to the area square inch according to the Anglo-American and Imperial system of units -- QUDT
subclass of: Restriction
  has value: 7.030696e+02
subclass of: Restriction
  has value: 0e+00
alternative label: Pound (avoirdupois) Per Square Inch
qudtReference: http://qudt.org/vocab/unit/LB-PER-IN2
ucumCode: [lb_av].[sin_i]-1
unitSymbol: lb/in²
EMMO 967080e5 2f42 4eb2 a3a9 c58143e835f9: unit of the areal-related mass as avoirdupois pound according to the avoirdupois system of units related to the area square inch according to the Anglo-American and Imperial system of units -- QUDT

Lb_Per_Sec
type: Class
comment: unit of the mass avoirdupois pound according to the avoirdupois system of units divided by the SI base unit for time second -- QUDT
subclass of: Restriction
  has value: 4.535924e-01
subclass of: Restriction
  has value: 0e+00
alternative label: Pound (avoirdupois) Per Second
qudtReference: http://qudt.org/vocab/unit/LB-PER-SEC
ucumCode: [lb_av].s-1
unitSymbol: lb/s
EMMO 967080e5 2f42 4eb2 a3a9 c58143e835f9: unit of the mass avoirdupois pound according to the avoirdupois system of units divided by the SI base unit for time second -- QUDT

LightYear
type: Class
comment: A unit of length defining the distance, in meters, that light travels in a vacuum in one year. -- QUDT
subclass of: Restriction
  has value: 9.46073e+15
subclass of: Restriction
  has value: 0e+00
alternative label: Light Year
qudtReference: http://qudt.org/vocab/unit/LY
ucumCode: [ly]
unitSymbol: ly
EMMO 967080e5 2f42 4eb2 a3a9 c58143e835f9: A unit of length defining the distance, in meters, that light travels in a vacuum in one year. -- QUDT
wikipediaReference: http://en.wikipedia.org/wiki/Light-year

LitrePerMicroMole
type: Class
comment: The inverse of a molar concentration - the untits of per molarity. -- QUDT
subclass of: Restriction
  has value: 1e+03
subclass of: Restriction
  has value: 0e+00
alternative label: Litres per micromole
qudtReference: http://qudt.org/vocab/unit/L-PER-MicroMOL
ucumCode: L.umol-1
unitSymbol: L/µmol
EMMO 967080e5 2f42 4eb2 a3a9 c58143e835f9: The inverse of a molar concentration - the untits of per molarity. -- QUDT

LitrePerMole
type: Class
comment: unit litre divided by the SI base unit mol -- QUDT
subclass of: Restriction
  has value: 0e+00
subclass of: Restriction
  has value: 1e-03
alternative label: Litre Per Mole
qudtReference: http://qudt.org/vocab/unit/L-PER-MOL
ucumCode: L.mol-1
ucumCode: L/mol
unitSymbol: L/mol
EMMO 967080e5 2f42 4eb2 a3a9 c58143e835f9: unit litre divided by the SI base unit mol -- QUDT

LitrePerSecondPerSquareMetre
type: Class
comment: Ventilation rate in Litres per second divided by the floor area -- QUDT
subclass of: Restriction
  has value: 1e-03
subclass of: Restriction
  has value: 0e+00
alternative label: Litre Per Second Per Square Metre
qudtReference: http://qudt.org/vocab/unit/L-PER-SEC-M2
unitSymbol: L/(m²⋅s)
EMMO 967080e5 2f42 4eb2 a3a9 c58143e835f9: Ventilation rate in Litres per second divided by the floor area -- QUDT

LongHundredWeight
type: Class
comment: "Hundred Weight - Long" is a unit for 'Mass' expressed as cwt. -- QUDT
subclass of: Restriction
  has value: 5.080235e+01
subclass of: Restriction
  has value: 0e+00
alternative label: Long Hundred Weight
qudtReference: http://qudt.org/vocab/unit/CWT_LONG
ucumCode: [lcwt_av]
unitSymbol: cwt{long}
EMMO 967080e5 2f42 4eb2 a3a9 c58143e835f9: "Hundred Weight - Long" is a unit for 'Mass' expressed as cwt. -- QUDT

LongTon
type: Class
comment: Long ton (weight ton or imperial ton) is the name for the unit called the "ton" in the avoirdupois or Imperial system of measurements, as used in the United Kingdom and several other Commonwealth countries. One long ton is equal to 2,240 pounds (1,016 kg), 1.12 times as much as a short ton, or 35 cubic feet (0.9911 m3) of salt water with a density of 64 lb/ft3 (1.025 g/ml). It has some limited use in the United States, most commonly in measuring the displacement of ships, and was the unit prescribed for warships by the Washington Naval Treaty 1922-for example battleships were limited to a mass of 35,000 long tons (36,000 t; 39,000 short tons). -- QUDT
subclass of: Restriction
  has value: 1.016047e+03
subclass of: Restriction
  has value: 0e+00
alternative label: Long Ton
qudtReference: http://qudt.org/vocab/unit/TON_LONG
ucumCode: [lton_av]
unitSymbol: t{long}
EMMO 967080e5 2f42 4eb2 a3a9 c58143e835f9: Long ton (weight ton or imperial ton) is the name for the unit called the "ton" in the avoirdupois or Imperial system of measurements, as used in the United Kingdom and several other Commonwealth countries. One long ton is equal to 2,240 pounds (1,016 kg), 1.12 times as much as a short ton, or 35 cubic feet (0.9911 m3) of salt water with a density of 64 lb/ft3 (1.025 g/ml). It has some limited use in the United States, most commonly in measuring the displacement of ships, and was the unit prescribed for warships by the Washington Naval Treaty 1922-for example battleships were limited to a mass of 35,000 long tons (36,000 t; 39,000 short tons). -- QUDT
wikipediaReference: http://en.wikipedia.org/wiki/Long_ton

LongTonPerCubicYard
type: Class
comment: The long ton per cubic yard density measurement unit is used to measure volume in cubic yards in order to estimate weight or mass in long tons. -- QUDT
subclass of: Restriction
  has value: 0e+00
subclass of: Restriction
  has value: 1.328939e+03
alternative label: Long Ton per Cubic Yard
qudtReference: http://qudt.org/vocab/unit/TON_LONG-PER-YD3
ucumCode: [lton_av]/[cyd_i]
unitSymbol: t{long}/yd³
EMMO 967080e5 2f42 4eb2 a3a9 c58143e835f9: The long ton per cubic yard density measurement unit is used to measure volume in cubic yards in order to estimate weight or mass in long tons. -- QUDT

LumenPerWatt
type: Class
comment: A measurement of luminous efficacy, which is the light output in lumens using one watt of electricity. -- QUDT
subclass of: Restriction
  has value: 1e+00
subclass of: Restriction
  has value: 0e+00
alternative label: Lumen per Watt
qudtReference: http://qudt.org/vocab/unit/LM-PER-W
ucumCode: lm.W-1
unitSymbol: lm/W
EMMO 967080e5 2f42 4eb2 a3a9 c58143e835f9: A measurement of luminous efficacy, which is the light output in lumens using one watt of electricity. -- QUDT

LumenSecond
type: Class
comment: In photometry, the lumen second is the SI derived unit of luminous energy. It is based on the lumen, the SI unit of luminous flux, and the second, the SI base unit of time. The lumen second is sometimes called the talbot (symbol T). An older name for the lumen second was the lumberg. -- QUDT
subclass of: Restriction
  has value: 1e+00
subclass of: Restriction
  has value: 0e+00
alternative label: lumen second
qudtReference: http://qudt.org/vocab/unit/LM-SEC
ucumCode: lm.s
unitSymbol: lm⋅s
EMMO 967080e5 2f42 4eb2 a3a9 c58143e835f9: In photometry, the lumen second is the SI derived unit of luminous energy. It is based on the lumen, the SI unit of luminous flux, and the second, the SI base unit of time. The lumen second is sometimes called the talbot (symbol T). An older name for the lumen second was the lumberg. -- QUDT

LunarMass
type: Class
subclass of: Restriction
  has value: 7.346e+22
subclass of: Restriction
  has value: 0e+00
alternative label: Lunar mass
qudtReference: http://qudt.org/vocab/unit/LunarMass
unitSymbol: M☾
wikipediaReference: http://en.wikipedia.org/wiki/Moon

LuxHour
type: Class
comment: The SI unit for measuring the illumination (illuminance) of a surface. One lux is defined as an illumination of one lumen per square meter or 0.0001 phot. In considering the various light units, it's useful to think about light originating at a point and shining upon a surface. The intensity of the light source is measured in candelas; the total light flux in transit is measured in lumens (1 lumen = 1 candelau00b7steradian); and the amount of light received per unit of surface area is measured in lux (1 lux = 1 lumen/square meter). One lux is equal to approximately 0.09290 foot candle. -- QUDT
subclass of: Restriction
  has value: 3.6e+03
subclass of: Restriction
  has value: 0e+00
alternative label: Lux Hour
qudtReference: http://qudt.org/vocab/unit/LUX-HR
ucumCode: lx.h
unitSymbol: lx⋅h
EMMO 967080e5 2f42 4eb2 a3a9 c58143e835f9: The SI unit for measuring the illumination (illuminance) of a surface. One lux is defined as an illumination of one lumen per square meter or 0.0001 phot. In considering the various light units, it's useful to think about light originating at a point and shining upon a surface. The intensity of the light source is measured in candelas; the total light flux in transit is measured in lumens (1 lumen = 1 candelau00b7steradian); and the amount of light received per unit of surface area is measured in lux (1 lux = 1 lumen/square meter). One lux is equal to approximately 0.09290 foot candle. -- QUDT
wikipediaReference: http://en.wikipedia.org/wiki/Lux

M2_Hr_Deg_C_Per_KiloCal_It
type: Class
comment: product of the power of the SI base unit metre with the exponent 2, of the unit hour for time and the unit degree Celsius for temperature divided by the 1000-fold of the out of use unit for energy international calorie -- QUDT
subclass of: Restriction
  has value: 8.59845e-01
subclass of: Restriction
  has value: 0e+00
alternative label: Square Metre Hour Degree Celsius Per Kilocalorie (international Table)
qudtReference: http://qudt.org/vocab/unit/M2-HR-DEG_C-PER-KiloCAL_IT
ucumCode: m2.h.Cel/kcal_IT
unitSymbol: m²⋅hr⋅°C/kcal{IT}
EMMO 967080e5 2f42 4eb2 a3a9 c58143e835f9: product of the power of the SI base unit metre with the exponent 2, of the unit hour for time and the unit degree Celsius for temperature divided by the 1000-fold of the out of use unit for energy international calorie -- QUDT

Maxwell
type: Class
comment: "Maxwell" is a C.G.S System unit for 'Magnetic Flux' expressed as Mx. -- QUDT
subclass of: Restriction
  has value: 1e-08
subclass of: Restriction
  has value: 0e+00
qudtReference: http://qudt.org/vocab/unit/MX
ucumCode: Mx
unitSymbol: Mx
EMMO 967080e5 2f42 4eb2 a3a9 c58143e835f9: "Maxwell" is a C.G.S System unit for 'Magnetic Flux' expressed as Mx. -- QUDT
wikipediaReference: http://en.wikipedia.org/wiki/Maxwell

MeanGregorianMonth
type: Class
subclass of: Restriction
  has value: 2.629746e+06
subclass of: Restriction
  has value: 0e+00
alternative label: Mean Gregorian Month
qudtReference: http://qudt.org/vocab/unit/MO_MeanGREGORIAN
ucumCode: mo_g

MeanJulianMonth
type: Class
alternative label: Mean Julian Month
qudtReference: http://qudt.org/vocab/unit/MO_MeanJulian
ucumCode: mo_j

MebiByte
type: Class
comment: The mebibyte is a multiple of the unit byte for digital information equivalent to 1024² bytes or 2²⁰ bytes. -- QUDT
subclass of: Restriction
  has value: 1.048576e+06
subclass of: Restriction
  some values from: Byte
subclass of: Restriction
  has value: 0e+00
qudtReference: http://qudt.org/vocab/unit/MebiBYTE
unitSymbol: MiB
EMMO 967080e5 2f42 4eb2 a3a9 c58143e835f9: The mebibyte is a multiple of the unit byte for digital information equivalent to 1024² bytes or 2²⁰ bytes. -- QUDT
wikipediaReference: https://en.wikipedia.org/wiki/Byte#Multiple-byte_units

MegaAmpere
type: Class
comment: 1 000 000-fold of the SI base unit ampere -- QUDT
subclass of: Restriction
  some values from: Ampere
subclass of: Restriction
  has value: 1e+06
subclass of: Restriction
  has value: 0e+00
qudtReference: http://qudt.org/vocab/unit/MegaA
ucumCode: MA
unitSymbol: MA
EMMO 967080e5 2f42 4eb2 a3a9 c58143e835f9: 1 000 000-fold of the SI base unit ampere -- QUDT

MegaAmperePerSquareMetre
type: Class
comment: 1 000 000-fold of the SI base unit ampere divided by the power of the SI base unit metre with the exponent 2 -- QUDT
subclass of: Restriction
  has value: 1e+06
subclass of: Restriction
  has value: 0e+00
alternative label: Megaampere Per Square Metre
qudtReference: http://qudt.org/vocab/unit/MegaA-PER-M2
ucumCode: MA.m-2
unitSymbol: MA/m²
EMMO 967080e5 2f42 4eb2 a3a9 c58143e835f9: 1 000 000-fold of the SI base unit ampere divided by the power of the SI base unit metre with the exponent 2 -- QUDT

MegaBar
type: Class
comment: The bar is a non-SI unit of pressure, defined by the IUPAC as exactly equal to 100,000 Pa. It is about equal to the atmospheric pressure on Earth at sea level, and since 1982 the IUPAC has recommended that the standard for atmospheric pressure should be harmonized to 100,000 Pa = 1 bar ≈ 750.0616827 Torr. Units derived from the bar are the megabar (symbol: Mbar), kilobar (symbol: kbar), decibar (symbol: dbar), centibar (symbol: cbar), and millibar (symbol: mbar or mb). They are not SI or cgs units, but they are accepted for use with the SI. -- QUDT
subclass of: Restriction
  some values from: Bar
subclass of: Restriction
  has value: 1e+11
subclass of: Restriction
  has value: 0e+00
qudtReference: http://qudt.org/vocab/unit/MegaBAR
ucumCode: Mbar
unitSymbol: Mbar
EMMO 967080e5 2f42 4eb2 a3a9 c58143e835f9: The bar is a non-SI unit of pressure, defined by the IUPAC as exactly equal to 100,000 Pa. It is about equal to the atmospheric pressure on Earth at sea level, and since 1982 the IUPAC has recommended that the standard for atmospheric pressure should be harmonized to 100,000 Pa = 1 bar ≈ 750.0616827 Torr. Units derived from the bar are the megabar (symbol: Mbar), kilobar (symbol: kbar), decibar (symbol: dbar), centibar (symbol: cbar), and millibar (symbol: mbar or mb). They are not SI or cgs units, but they are accepted for use with the SI. -- QUDT
wikipediaReference: http://en.wikipedia.org/wiki/Bar_(unit)

MegaBecquerel
type: Class
comment: 1 000 000-fold of the derived unit becquerel -- QUDT
subclass of: Restriction
  some values from: Becquerel
subclass of: Restriction
  has value: 1e+06
subclass of: Restriction
  has value: 0e+00
qudtReference: http://qudt.org/vocab/unit/MegaBQ
ucumCode: MBq
unitSymbol: MBq
EMMO 967080e5 2f42 4eb2 a3a9 c58143e835f9: 1 000 000-fold of the derived unit becquerel -- QUDT

MegaBitPerSecond
type: Class
comment: A megabit per second (Mbit/s or Mb/s; not to be confused with mbit/s which means millibit per second, or with Mbitps which means megabit picosecond) is a unit of data transfer rate equal to 1,000,000 bits per second or 1,000 kilobits per second or 125,000 bytes per second or 125 kilobytes per second. -- QUDT
subclass of: Restriction
  some values from: BitPerSecond
subclass of: Restriction
  has value: 6.931472e+05
subclass of: Restriction
  has value: 0e+00
alternative label: Megabit per Second
qudtReference: http://qudt.org/vocab/unit/MegaBIT-PER-SEC
ucumCode: MBd
ucumCode: Mbit/s
unitSymbol: mbps
EMMO 967080e5 2f42 4eb2 a3a9 c58143e835f9: A megabit per second (Mbit/s or Mb/s; not to be confused with mbit/s which means millibit per second, or with Mbitps which means megabit picosecond) is a unit of data transfer rate equal to 1,000,000 bits per second or 1,000 kilobits per second or 125,000 bytes per second or 125 kilobytes per second. -- QUDT
wikipediaReference: http://en.wikipedia.org/wiki/Data_rate_units

MegaBtu_It_Per_Hr
type: Class
subclass of: Restriction
  has value: 2.930711e+05
subclass of: Restriction
  has value: 0e+00
alternative label: Mega British Thermal Unit (International Definition) per Hour
qudtReference: http://qudt.org/vocab/unit/MegaBTU_IT-PER-HR
ucumCode: M[Btu_IT].h-1
ucumCode: M[Btu_IT]/h
unitSymbol: MBtu{IT}/hr

MegaByte
type: Class
comment: The megabyte is defined here as one million Bytes. Also, see unit:MebiBYTE. -- QUDT
subclass of: Restriction
  some values from: Byte
subclass of: Restriction
  has value: 1e+06
subclass of: Restriction
  has value: 0e+00
alternative label: Mega byte
qudtReference: http://qudt.org/vocab/unit/MegaBYTE
ucumCode: MBy
unitSymbol: MB
EMMO 967080e5 2f42 4eb2 a3a9 c58143e835f9: The megabyte is defined here as one million Bytes. Also, see unit:MebiBYTE. -- QUDT
wikipediaReference: http://en.wikipedia.org/wiki/Megabyte

MegaCoulomb
type: Class
comment: A MegaCoulomb is 10⁶ C. -- QUDT
subclass of: Restriction
  some values from: Coulomb
subclass of: Restriction
  has value: 1e+06
subclass of: Restriction
  has value: 0e+00
qudtReference: http://qudt.org/vocab/unit/MegaC
ucumCode: MC
unitSymbol: MC
EMMO 967080e5 2f42 4eb2 a3a9 c58143e835f9: A MegaCoulomb is 10⁶ C. -- QUDT

MegaCoulombPerCubicMetre
type: Class
comment: 1 000 000-fold of the SI derived unit coulomb divided by the power of the SI base unit metre with the exponent 3 -- QUDT
subclass of: Restriction
  has value: 1e+06
subclass of: Restriction
  some values from: CoulombPerCubicMetre
subclass of: Restriction
  has value: 0e+00
alternative label: Megacoulomb Per Cubic Metre
qudtReference: http://qudt.org/vocab/unit/MegaC-PER-M3
ucumCode: MC.m-3
unitSymbol: MC/m³
EMMO 967080e5 2f42 4eb2 a3a9 c58143e835f9: 1 000 000-fold of the SI derived unit coulomb divided by the power of the SI base unit metre with the exponent 3 -- QUDT

MegaCoulombPerSquareMetre
type: Class
comment: 1 000 000-fold of the SI derived unit coulomb divided by the power of the SI base unit metre with the exponent 2 -- QUDT
subclass of: Restriction
  some values from: CoulombPerSquareMetre
subclass of: Restriction
  has value: 1e+06
subclass of: Restriction
  has value: 0e+00
alternative label: Megacoulomb Per Square Metre
qudtReference: http://qudt.org/vocab/unit/MegaC-PER-M2
ucumCode: MC.m-2
unitSymbol: MC/m²
EMMO 967080e5 2f42 4eb2 a3a9 c58143e835f9: 1 000 000-fold of the SI derived unit coulomb divided by the power of the SI base unit metre with the exponent 2 -- QUDT

MegaElectronVolt
type: Class
comment: `Mega Electron Volt` is a unit for 'Energy And Work' expressed as MeV. -- QUDT
subclass of: Restriction
  has value: 0e+00
subclass of: Restriction
  some values from: ElectronVolt
subclass of: Restriction
  has value: 1.602177e-13
alternative label: Mega Electron Volt
qudtReference: http://qudt.org/vocab/unit/MegaEV
ucumCode: MeV
unitSymbol: MeV
EMMO 967080e5 2f42 4eb2 a3a9 c58143e835f9: `Mega Electron Volt` is a unit for 'Energy And Work' expressed as MeV. -- QUDT

MegaElectronVoltFemtoMetre
type: Class
comment: `Mega Electron Volt Femtometer` is a unit for 'Length Energy' expressed as MeV fm. -- QUDT
subclass of: Restriction
  has value: 1.602177e-28
subclass of: Restriction
  has value: 0e+00
alternative label: Mega Electron Volt Femtometre
qudtReference: http://qudt.org/vocab/unit/MegaEV-FemtoM
ucumCode: MeV.fm
unitSymbol: MeV⋅fm
EMMO 967080e5 2f42 4eb2 a3a9 c58143e835f9: `Mega Electron Volt Femtometer` is a unit for 'Length Energy' expressed as MeV fm. -- QUDT

MegaElectronVoltPerCentiMetre
type: Class
comment: "Mega Electron Volt per Centimeter" is a unit for 'Linear Energy Transfer' expressed as MeV/cm. -- QUDT
subclass of: Restriction
  has value: 1.602177e-11
subclass of: Restriction
  has value: 0e+00
alternative label: Mega Electron Volt per Centimetre
qudtReference: http://qudt.org/vocab/unit/MegaEV-PER-CentiM
ucumCode: MeV.cm-1
unitSymbol: MeV/cm
EMMO 967080e5 2f42 4eb2 a3a9 c58143e835f9: "Mega Electron Volt per Centimeter" is a unit for 'Linear Energy Transfer' expressed as MeV/cm. -- QUDT

MegaElectronVoltPerSpeedOfLight
type: Class
comment: "Mega Electron Volt per Speed of Light" is a unit for 'Linear Momentum' expressed as MeV/c. -- QUDT
alternative label: Mega Electron Volt per Speed of Light
qudtReference: http://qudt.org/vocab/unit/MegaEV-PER-SpeedOfLight
ucumCode: MeV.[c]-1
unitSymbol: MeV/c
EMMO 967080e5 2f42 4eb2 a3a9 c58143e835f9: "Mega Electron Volt per Speed of Light" is a unit for 'Linear Momentum' expressed as MeV/c. -- QUDT

MegaGram
type: Class
comment: 1 000-fold of the SI base unit kilogram -- QUDT
subclass of: Restriction
  some values from: Gram
subclass of: Restriction
  has value: 0e+00
subclass of: Restriction
  has value: 1e+03
qudtReference: http://qudt.org/vocab/unit/MegaGM
ucumCode: Mg
unitSymbol: Mg
EMMO 967080e5 2f42 4eb2 a3a9 c58143e835f9: 1 000-fold of the SI base unit kilogram -- QUDT

MegaGramPerCubicMetre
type: Class
comment: 1 000-fold of the SI base unit kilogram divided by the power of the SI base unit metre with the exponent 3 -- QUDT
subclass of: Restriction
  some values from: GramPerCubicMetre
subclass of: Restriction
  has value: 1e+03
subclass of: Restriction
  has value: 0e+00
alternative label: Megagram Per Cubic Metre
qudtReference: http://qudt.org/vocab/unit/MegaGM-PER-M3
ucumCode: Mg.m-3
unitSymbol: Mg/m³
EMMO 967080e5 2f42 4eb2 a3a9 c58143e835f9: 1 000-fold of the SI base unit kilogram divided by the power of the SI base unit metre with the exponent 3 -- QUDT

MegaGramPerHectare
type: Class
comment: 1 000-fold of the SI base unit kilogram divided by the 10,0000-fold of the power of the SI base unit metre with the exponent 2 -- QUDT
subclass of: Restriction
  has value: 1e-01
subclass of: Restriction
  has value: 0e+00
alternative label: Megagram Per Hectare
qudtReference: http://qudt.org/vocab/unit/MegaGM-PER-HA
ucumCode: Mg.har-1
unitSymbol: Mg/ha
EMMO 967080e5 2f42 4eb2 a3a9 c58143e835f9: 1 000-fold of the SI base unit kilogram divided by the 10,0000-fold of the power of the SI base unit metre with the exponent 2 -- QUDT

MegaHertz
type: Class
comment: "Megahertz" is a C.G.S System unit for 'Frequency' expressed as MHz. -- QUDT
subclass of: Restriction
  has value: 1e+06
subclass of: Restriction
  some values from: Hertz
subclass of: Restriction
  has value: 0e+00
qudtReference: http://qudt.org/vocab/unit/MegaHZ
ucumCode: MHz
unitSymbol: MHz
EMMO 967080e5 2f42 4eb2 a3a9 c58143e835f9: "Megahertz" is a C.G.S System unit for 'Frequency' expressed as MHz. -- QUDT

MegaHertzMetre
type: Class
comment: product of the 1 000 000-fold of the SI derived unit hertz and the 1 000-fold of the SI base unit metre -- QUDT
subclass of: Restriction
  some values from: HertzMetre
subclass of: Restriction
  has value: 1e+06
subclass of: Restriction
  has value: 0e+00
alternative label: Megahertz Metre
qudtReference: http://qudt.org/vocab/unit/MegaHZ-M
ucumCode: MHz.m
unitSymbol: MHz⋅m
EMMO 967080e5 2f42 4eb2 a3a9 c58143e835f9: product of the 1 000 000-fold of the SI derived unit hertz and the 1 000-fold of the SI base unit metre -- QUDT

MegaHertzPerKelvin
type: Class
comment: `Mega Hertz per Kelvin` is a unit for 'Inverse Time Temperature' expressed as MHz K⁻¹. -- QUDT
subclass of: Restriction
  some values from: HertzPerKelvin
subclass of: Restriction
  has value: 1e+06
subclass of: Restriction
  has value: 0e+00
alternative label: Mega Hertz per Kelvin
qudtReference: http://qudt.org/vocab/unit/MegaHZ-PER-K
ucumCode: MHz.K-1
unitSymbol: MHz/K
EMMO 967080e5 2f42 4eb2 a3a9 c58143e835f9: `Mega Hertz per Kelvin` is a unit for 'Inverse Time Temperature' expressed as MHz K⁻¹. -- QUDT

MegaHertzPerTesla
type: Class
comment: "Mega Hertz per Tesla" is a unit for 'Electric Charge Per Mass' expressed as MHz T⁻¹. -- QUDT
subclass of: Restriction
  some values from: HertzPerTesla
subclass of: Restriction
  has value: 1e+06
subclass of: Restriction
  has value: 0e+00
alternative label: Mega Hertz per Tesla
qudtReference: http://qudt.org/vocab/unit/MegaHZ-PER-T
ucumCode: MHz.T-1
unitSymbol: MHz/T
EMMO 967080e5 2f42 4eb2 a3a9 c58143e835f9: "Mega Hertz per Tesla" is a unit for 'Electric Charge Per Mass' expressed as MHz T⁻¹. -- QUDT

MegaJoule
type: Class
comment: 1,000,000-fold of the derived unit joule -- QUDT
subclass of: Restriction
  some values from: Joule
subclass of: Restriction
  has value: 1e+06
subclass of: Restriction
  has value: 0e+00
qudtReference: http://qudt.org/vocab/unit/MegaJ
ucumCode: MJ
unitSymbol: MJ
EMMO 967080e5 2f42 4eb2 a3a9 c58143e835f9: 1,000,000-fold of the derived unit joule -- QUDT

MegaJoulePerCubicMetre
type: Class
comment: 1,000,000-fold of the SI derived unit joule divided by the power of the SI base unit metre with the exponent 3 -- QUDT
subclass of: Restriction
  some values from: JoulePerCubicMetre
subclass of: Restriction
  has value: 1e+06
subclass of: Restriction
  has value: 0e+00
alternative label: Megajoule Per Cubic Metre
qudtReference: http://qudt.org/vocab/unit/MegaJ-PER-M3
ucumCode: MJ.m-3
unitSymbol: MJ/m³
EMMO 967080e5 2f42 4eb2 a3a9 c58143e835f9: 1,000,000-fold of the SI derived unit joule divided by the power of the SI base unit metre with the exponent 3 -- QUDT

MegaJoulePerKelvin
type: Class
comment: MegaJoule Per Kelvin (MegaJ/K) is a unit in the category of Entropy. -- QUDT
subclass of: Restriction
  some values from: JoulePerKelvin
subclass of: Restriction
  has value: 1e+06
subclass of: Restriction
  has value: 0e+00
alternative label: MegaJoule per Kelvin
qudtReference: http://qudt.org/vocab/unit/MegaJ-PER-K
ucumCode: MJ.K-1
unitSymbol: MJ/K
EMMO 967080e5 2f42 4eb2 a3a9 c58143e835f9: MegaJoule Per Kelvin (MegaJ/K) is a unit in the category of Entropy. -- QUDT

MegaJoulePerKilogram
type: Class
comment: 1,000,000-fold of the derived SI unit joule divided by the SI base unit kilogram -- QUDT
subclass of: Restriction
  has value: 0e+00
subclass of: Restriction
  some values from: JoulePerKilogram
subclass of: Restriction
  has value: 1e+06
alternative label: Megajoule Per Kilogram
qudtReference: http://qudt.org/vocab/unit/MegaJ-PER-KiloGM
ucumCode: MJ.kg-1
unitSymbol: MJ/kg
EMMO 967080e5 2f42 4eb2 a3a9 c58143e835f9: 1,000,000-fold of the derived SI unit joule divided by the SI base unit kilogram -- QUDT

MegaJoulePerSecond
type: Class
comment: quotient of the 1,000,000-fold of the derived SI unit joule divided by the SI base unit second -- QUDT
subclass of: Restriction
  some values from: JoulePerSecond
subclass of: Restriction
  has value: 1e+06
subclass of: Restriction
  has value: 0e+00
alternative label: Megajoule Per Second
qudtReference: http://qudt.org/vocab/unit/MegaJ-PER-SEC
ucumCode: MJ.s-1
unitSymbol: MJ/s
EMMO 967080e5 2f42 4eb2 a3a9 c58143e835f9: quotient of the 1,000,000-fold of the derived SI unit joule divided by the SI base unit second -- QUDT

MegaJoulePerSquareMetre
type: Class
comment: 1,000,000-fold of the SI derived unit joule divided by the power of the SI base unit metre with the exponent 2 -- QUDT
subclass of: Restriction
  some values from: JoulePerSquareMetre
subclass of: Restriction
  has value: 1e+06
subclass of: Restriction
  has value: 0e+00
alternative label: Megajoule Per Square Metre
qudtReference: http://qudt.org/vocab/unit/MegaJ-PER-M2
ucumCode: MJ.m-2
unitSymbol: MJ/m²
EMMO 967080e5 2f42 4eb2 a3a9 c58143e835f9: 1,000,000-fold of the SI derived unit joule divided by the power of the SI base unit metre with the exponent 2 -- QUDT

MegaLitre
type: Class
comment: 1 000 000-fold of the unit litre -- QUDT
subclass of: Restriction
  has value: 1e+03
subclass of: Restriction
  has value: 0e+00
subclass of: Restriction
  some values from: Litre
qudtReference: http://qudt.org/vocab/unit/MegaL
ucumCode: ML
unitSymbol: ML
EMMO 967080e5 2f42 4eb2 a3a9 c58143e835f9: 1 000 000-fold of the unit litre -- QUDT

MegaNewton
type: Class
comment: 1,000,000-fold of the SI derived unit newton -- QUDT
subclass of: Restriction
  some values from: Newton
subclass of: Restriction
  has value: 1e+06
subclass of: Restriction
  has value: 0e+00
qudtReference: http://qudt.org/vocab/unit/MegaN
ucumCode: MN
unitSymbol: MN
EMMO 967080e5 2f42 4eb2 a3a9 c58143e835f9: 1,000,000-fold of the SI derived unit newton -- QUDT

MegaNewtonMetre
type: Class
comment: 1,000,000-fold of the product of the SI derived unit newton and the SI base unit metre -- QUDT
subclass of: Restriction
  some values from: NewtonMetre
subclass of: Restriction
  has value: 1e+06
subclass of: Restriction
  has value: 0e+00
alternative label: Meganewton Metre
qudtReference: http://qudt.org/vocab/unit/MegaN-M
ucumCode: MN.m
unitSymbol: MN⋅m
EMMO 967080e5 2f42 4eb2 a3a9 c58143e835f9: 1,000,000-fold of the product of the SI derived unit newton and the SI base unit metre -- QUDT

MegaOhm
type: Class
comment: 1,000,000-fold of the derived unit ohm -- QUDT
subclass of: Restriction
  some values from: Ohm
subclass of: Restriction
  has value: 1e+06
subclass of: Restriction
  has value: 0e+00
qudtReference: http://qudt.org/vocab/unit/MegaOHM
ucumCode: MOhm
unitSymbol: MΩ
EMMO 967080e5 2f42 4eb2 a3a9 c58143e835f9: 1,000,000-fold of the derived unit ohm -- QUDT

MegaPascal
type: Class
comment: 1,000,000-fold of the derived unit pascal -- QUDT
subclass of: Restriction
  has value: 1e+06
subclass of: Restriction
  some values from: Pascal
subclass of: Restriction
  has value: 0e+00
qudtReference: http://qudt.org/vocab/unit/MegaPA
ucumCode: MPa
unitSymbol: MPa
EMMO 967080e5 2f42 4eb2 a3a9 c58143e835f9: 1,000,000-fold of the derived unit pascal -- QUDT

MegaPascalCubicMetrePerSecond
type: Class
comment: product out of the 1,000,000-fold of the SI derived unit pascal and the power of the SI base unit metre with the exponent 3 divided by the SI base unit second -- QUDT
subclass of: Restriction
  some values from: PascalCubicMetrePerSecond
subclass of: Restriction
  has value: 1e+06
subclass of: Restriction
  has value: 0e+00
alternative label: Megapascal Cubic Metre Per Second
qudtReference: http://qudt.org/vocab/unit/MegaPA-M3-PER-SEC
ucumCode: MPa.m3.s-1
unitSymbol: MPa⋅m³/s
EMMO 967080e5 2f42 4eb2 a3a9 c58143e835f9: product out of the 1,000,000-fold of the SI derived unit pascal and the power of the SI base unit metre with the exponent 3 divided by the SI base unit second -- QUDT

MegaPascalLitrePerSecond
type: Class
comment: product out of the 1,000,000-fold of the SI derived unit pascal and the unit litre divided by the SI base unit second -- QUDT
subclass of: Restriction
  some values from: PascalLitrePerSecond
subclass of: Restriction
  has value: 1e+03
subclass of: Restriction
  has value: 0e+00
alternative label: Megapascal Litre Per Second
qudtReference: http://qudt.org/vocab/unit/MegaPA-L-PER-SEC
ucumCode: MPa.L.s-1
unitSymbol: MPa⋅L/s
EMMO 967080e5 2f42 4eb2 a3a9 c58143e835f9: product out of the 1,000,000-fold of the SI derived unit pascal and the unit litre divided by the SI base unit second -- QUDT

MegaPascalPerBar
type: Class
comment: 1,000,000-fold of the SI derived unit pascal divided by the unit bar -- QUDT
subclass of: Restriction
  has value: 1e+01
subclass of: Restriction
  some values from: PascalPerBar
subclass of: Restriction
  has value: 0e+00
alternative label: Megapascal Per Bar
qudtReference: http://qudt.org/vocab/unit/MegaPA-PER-BAR
ucumCode: MPa.bar-1
unitSymbol: MPa/bar
EMMO 967080e5 2f42 4eb2 a3a9 c58143e835f9: 1,000,000-fold of the SI derived unit pascal divided by the unit bar -- QUDT

MegaPascalPerKelvin
type: Class
comment: 1,000,000-fold of the SI derived unit pascal divided by the SI base unit kelvin -- QUDT
subclass of: Restriction
  some values from: PascalPerKelvin
subclass of: Restriction
  has value: 1e+06
subclass of: Restriction
  has value: 0e+00
alternative label: Megapascal Per Kelvin
qudtReference: http://qudt.org/vocab/unit/MegaPA-PER-K
ucumCode: MPa.K-1
unitSymbol: MPa/K
EMMO 967080e5 2f42 4eb2 a3a9 c58143e835f9: 1,000,000-fold of the SI derived unit pascal divided by the SI base unit kelvin -- QUDT

MegaPascalSquareRootMeter
type: Class
comment: 1,000,000-fold of the derived unit Pascal Square Root Meter -- QUDT
subclass of: Restriction
  some values from: PascalSquareRootMeter
subclass of: Restriction
  has value: 1e+06
subclass of: Restriction
  has value: 0e+00
alternative label: Megapascal Square Root Meter
qudtReference: http://qudt.org/vocab/unit/MegaPA-M0pt5
unitSymbol: MPa√m
EMMO 967080e5 2f42 4eb2 a3a9 c58143e835f9: 1,000,000-fold of the derived unit Pascal Square Root Meter -- QUDT

MegaPoundForce
type: Class
subclass of: Restriction
  some values from: PoundForce
subclass of: Restriction
  has value: 4.448222e+03
subclass of: Restriction
  has value: 0e+00
alternative label: Mega Pound Force
qudtReference: http://qudt.org/vocab/unit/MegaLB_F
ucumCode: M[lbf_av]
unitSymbol: Mlbf
wikipediaReference: http://en.wikipedia.org/wiki/Pound-force

MegaSiemens
type: Class
subclass of: Restriction
  some values from: Siemens
subclass of: Restriction
  has value: 1e+06
subclass of: Restriction
  has value: 0e+00
qudtReference: http://qudt.org/vocab/unit/MegaS
unitSymbol: MS

MegaSiemensPerMetre
type: Class
comment: 1,000,000-fold of the SI derived unit siemens divided by the SI base unit metre -- QUDT
subclass of: Restriction
  has value: 0e+00
subclass of: Restriction
  some values from: SiemensPerMetre
subclass of: Restriction
  has value: 1e+06
alternative label: Megasiemens Per Metre
qudtReference: http://qudt.org/vocab/unit/MegaS-PER-M
ucumCode: MS.m-1
unitSymbol: MS/m
EMMO 967080e5 2f42 4eb2 a3a9 c58143e835f9: 1,000,000-fold of the SI derived unit siemens divided by the SI base unit metre -- QUDT

MegaTonOfOilEquivalent
type: Class
comment: The tonne of oil equivalent (toe) is a unit of energy: the amount of energy released by burning one tonne of crude oil, approximately 42 GJ (as different crude oils have different calorific values, the exact value of the toe is defined by convention; unfortunately there are several slightly different definitions as discussed below). The toe is sometimes used for large amounts of energy, as it can be more intuitive to visualise, say, the energy released by burning 1000 tonnes of oil than 42,000 billion joules (the SI unit of energy). Multiples of the toe are used, in particular the megatoe (Mtoe, one million toe) and the gigatoe (Gtoe, one billion toe). -- QUDT
subclass of: Restriction
  has value: 4.1868e+16
subclass of: Restriction
  has value: 0e+00
alternative label: Megaton of Oil Equivalent
qudtReference: http://qudt.org/vocab/unit/MegaTOE
unitSymbol: megatoe
EMMO 967080e5 2f42 4eb2 a3a9 c58143e835f9: The tonne of oil equivalent (toe) is a unit of energy: the amount of energy released by burning one tonne of crude oil, approximately 42 GJ (as different crude oils have different calorific values, the exact value of the toe is defined by convention; unfortunately there are several slightly different definitions as discussed below). The toe is sometimes used for large amounts of energy, as it can be more intuitive to visualise, say, the energy released by burning 1000 tonnes of oil than 42,000 billion joules (the SI unit of energy). Multiples of the toe are used, in particular the megatoe (Mtoe, one million toe) and the gigatoe (Gtoe, one billion toe). -- QUDT
wikipediaReference: http://en.wikipedia.org/wiki/Tonne_of_oil_equivalent

MegaVolt
type: Class
comment: 1,000,000-fold of the derived unit volt -- QUDT
subclass of: Restriction
  has value: 1e+06
subclass of: Restriction
  has value: 0e+00
qudtReference: http://qudt.org/vocab/unit/MegaV
ucumCode: MV
unitSymbol: MV
EMMO 967080e5 2f42 4eb2 a3a9 c58143e835f9: 1,000,000-fold of the derived unit volt -- QUDT

MegaVoltAmpere
type: Class
comment: 1,000,000-fold of the product of the SI derived unit volt and the SI base unit ampere -- QUDT
subclass of: Restriction
  some values from: VoltAmpere
subclass of: Restriction
  has value: 1e+06
subclass of: Restriction
  has value: 0e+00
alternative label: Megavolt Ampere
qudtReference: http://qudt.org/vocab/unit/MegaV-A
ucumCode: MV.A
unitSymbol: MV⋅A
EMMO 967080e5 2f42 4eb2 a3a9 c58143e835f9: 1,000,000-fold of the product of the SI derived unit volt and the SI base unit ampere -- QUDT

MegaVoltAmpereHour
type: Class
comment: product of the 1,000,000-fold of the unit for apparent by ampere and the unit hour -- QUDT
subclass of: Restriction
  some values from: VoltAmpereHour
subclass of: Restriction
  has value: 3.6e+09
subclass of: Restriction
  has value: 0e+00
alternative label: Megavolt Ampere Hour
qudtReference: http://qudt.org/vocab/unit/MegaV-A-HR
ucumCode: MV.A.h
unitSymbol: MV⋅A⋅h
EMMO 967080e5 2f42 4eb2 a3a9 c58143e835f9: product of the 1,000,000-fold of the unit for apparent by ampere and the unit hour -- QUDT

MegaVoltAmpereReactive
type: Class
comment: 1 000 000-fold of the unit volt ampere reactive -- QUDT
subclass of: Restriction
  some values from: VoltAmpereReactive
subclass of: Restriction
  has value: 1e+06
subclass of: Restriction
  has value: 0e+00
alternative label: Megavolt Ampere Reactive
qudtReference: http://qudt.org/vocab/unit/MegaV-A_Reactive
ucumCode: MV.A{reactive}
unitSymbol: MV⋅A{Reactive}
EMMO 967080e5 2f42 4eb2 a3a9 c58143e835f9: 1 000 000-fold of the unit volt ampere reactive -- QUDT

MegaVoltAmpereReactiveHour
type: Class
comment: product of the 1,000,000-fold of the unit volt ampere reactive and the unit hour -- QUDT
subclass of: Restriction
  has value: 0e+00
subclass of: Restriction
  some values from: VoltAmpereReactiveHour
subclass of: Restriction
  has value: 3.6e+09
alternative label: Megavolt Ampere Reactive Hour
qudtReference: http://qudt.org/vocab/unit/MegaV-A_Reactive-HR
ucumCode: MV.A{reactive}.h
unitSymbol: MV⋅A{Reactive}⋅hr
EMMO 967080e5 2f42 4eb2 a3a9 c58143e835f9: product of the 1,000,000-fold of the unit volt ampere reactive and the unit hour -- QUDT

MegaVoltPerMetre
type: Class
comment: 1,000,000-fold of the SI derived unit volt divided by the SI base unit metre -- QUDT
subclass of: Restriction
  some values from: VoltPerMetre
subclass of: Restriction
  has value: 1e+06
subclass of: Restriction
  has value: 0e+00
alternative label: Megavolt Per Metre
qudtReference: http://qudt.org/vocab/unit/MegaV-PER-M
ucumCode: MV.m-1
unitSymbol: MV/m
EMMO 967080e5 2f42 4eb2 a3a9 c58143e835f9: 1,000,000-fold of the SI derived unit volt divided by the SI base unit metre -- QUDT

MegaWatt
type: Class
comment: Unit for power; 1 000 000 watt.
subclass of: Restriction
  some values from: Watt
subclass of: Restriction
  has value: 1e+06
subclass of: Restriction
  has value: 0e+00
qudtReference: http://qudt.org/vocab/unit/MegaW
ucumCode: MW
unitSymbol: MW
EMMO 967080e5 2f42 4eb2 a3a9 c58143e835f9: Unit for power; 1 000 000 watt.

MegaWattHour
type: Class
comment: 1 000 000-fold of the product of the SI derived unit watt and the unit hour -- QUDT
subclass of: Restriction
  has value: 3.6e+09
subclass of: Restriction
  has value: 0e+00
alternative label: Megawatt Hour
qudtReference: http://qudt.org/vocab/unit/MegaW-HR
ucumCode: MW.h
unitSymbol: MW⋅h
EMMO 967080e5 2f42 4eb2 a3a9 c58143e835f9: 1 000 000-fold of the product of the SI derived unit watt and the unit hour -- QUDT

Mesh
type: Class
comment: "Mesh" is a measure of particle size or fineness of a woven product. -- QUDT
subclass of: Restriction
  has value: 1e+00
subclass of: Restriction
  has value: 0e+00
qudtReference: http://qudt.org/vocab/unit/MESH
ucumCode: [mesh_i]
unitSymbol: mesh
EMMO 967080e5 2f42 4eb2 a3a9 c58143e835f9: "Mesh" is a measure of particle size or fineness of a woven product. -- QUDT
wikipediaReference: https://en.wikipedia.org/wiki/Mesh_(scale)

MetreKelvin
type: Class
comment: `Meter Kelvin` is a unit for 'Length Temperature' expressed as m K. -- QUDT
subclass of: Restriction
  has value: 1e+00
subclass of: Restriction
  has value: 0e+00
alternative label: Metre Kelvin
qudtReference: http://qudt.org/vocab/unit/M-K
ucumCode: m.K
unitSymbol: m⋅K
EMMO 967080e5 2f42 4eb2 a3a9 c58143e835f9: `Meter Kelvin` is a unit for 'Length Temperature' expressed as m K. -- QUDT

MetreKilogram
type: Class
comment: Kilogram metre.
subclass of: Restriction
  has value: 1e+00
subclass of: Restriction
  has value: 0e+00
qudtReference: http://qudt.org/vocab/unit/M-KiloGM
ucumCode: m.kg
unitSymbol: m⋅kg
EMMO 967080e5 2f42 4eb2 a3a9 c58143e835f9: Kilogram metre.

MetrePerFarad
type: Class
comment: Metre per Farad.
subclass of: Restriction
  has value: 0e+00
subclass of: Restriction
  has value: 1e+00
qudtReference: http://qudt.org/vocab/unit/M-PER-FARAD
ucumCode: m.F-1
unitSymbol: m/f
EMMO 967080e5 2f42 4eb2 a3a9 c58143e835f9: Metre per Farad.

MetricDeciTon
type: Class
comment: 100-fold of the SI base unit kilogram -- QUDT
subclass of: Restriction
  has value: 1e+02
subclass of: Restriction
  has value: 0e+00
alternative label: Metric DeciTON
qudtReference: http://qudt.org/vocab/unit/DeciTON_Metric
ucumCode: dt
unitSymbol: dt
EMMO 967080e5 2f42 4eb2 a3a9 c58143e835f9: 100-fold of the SI base unit kilogram -- QUDT

MetricKiloTon
type: Class
comment: 1 000 000-fold of the SI base unit kilogram -- QUDT
subclass of: Restriction
  has value: 1e+06
subclass of: Restriction
  has value: 0e+00
alternative label: Metric KiloTON
qudtReference: http://qudt.org/vocab/unit/KiloTON_Metric
ucumCode: kt
unitSymbol: kton{short}
EMMO 967080e5 2f42 4eb2 a3a9 c58143e835f9: 1 000 000-fold of the SI base unit kilogram -- QUDT

MetricPerm
type: Class
comment: A perm is a unit of permeance or "water vapor transmission" given a certain differential in partial pressures on either side of a material or membrane. The metric perm (not an SI unit) is defined as 1 gram of water vapor per day, per square meter, per millimeter of mercury. -- QUDT
subclass of: Restriction
  has value: 0e+00
subclass of: Restriction
  has value: 8.68127e-11
alternative label: Metric Perm
qudtReference: http://qudt.org/vocab/unit/PERM_Metric
unitSymbol: perm{Metric}
EMMO 967080e5 2f42 4eb2 a3a9 c58143e835f9: A perm is a unit of permeance or "water vapor transmission" given a certain differential in partial pressures on either side of a material or membrane. The metric perm (not an SI unit) is defined as 1 gram of water vapor per day, per square meter, per millimeter of mercury. -- QUDT
wikipediaReference: https://en.wikipedia.org/wiki/Perm_(unit)

MetricTon
type: Class
comment: 1,000-fold of the SI base unit kilogram -- QUDT
subclass of: Restriction
  has value: 1e+03
subclass of: Restriction
  has value: 0e+00
alternative label: Metric Ton
qudtReference: http://qudt.org/vocab/unit/TON_Metric
ucumCode: t
unitSymbol: t
EMMO 967080e5 2f42 4eb2 a3a9 c58143e835f9: 1,000-fold of the SI base unit kilogram -- QUDT
wikipediaReference: http://en.wikipedia.org/wiki/Tonne

Mho
type: Class
comment: A unit of conductance, equal to the reciprocal of the ohm.
comment: The name is simply Ohm spelled backwards.
comment: The preferred unit is now Siemens.
subclass of: Restriction
  has value: 1e+00
subclass of: Restriction
  has value: 0e+00
qudtReference: http://qudt.org/vocab/unit/MHO
ucumCode: mho
unitSymbol: ℧
EMMO c7b62dd7 063a 4c2a 8504 42f7264ba83f: "Mho" is a C.G.S System unit for 'ElectricConductance' expressed as mho. -- QUDT

MicroAmpere
type: Class
subclass of: Restriction
  some values from: Ampere
subclass of: Restriction
  has value: 1e-06
subclass of: Restriction
  has value: 0e+00
alternative label: microampere
qudtReference: http://qudt.org/vocab/unit/MicroA
ucumCode: uA
unitSymbol: µA

MicroAtmospheres
type: Class
subclass of: Restriction
  has value: 1.01325e-01
subclass of: Restriction
  has value: 0e+00
qudtReference: http://qudt.org/vocab/unit/MicroATM
ucumCode: uatm
unitSymbol: µatm

MicroBar
type: Class
comment: 0.000001-fold of the unit bar -- QUDT
subclass of: Restriction
  has value: 1e-01
subclass of: Restriction
  has value: 0e+00
qudtReference: http://qudt.org/vocab/unit/MicroBAR
ucumCode: ubar
unitSymbol: μbar
EMMO 967080e5 2f42 4eb2 a3a9 c58143e835f9: 0.000001-fold of the unit bar -- QUDT

MicroBecquerel
type: Class
comment: 0.000001-fold of the SI derived unit becquerel -- QUDT
subclass of: Restriction
  has value: 0e+00
subclass of: Restriction
  has value: 1e-06
qudtReference: http://qudt.org/vocab/unit/MicroBQ
ucumCode: uBq
unitSymbol: μBq
EMMO 967080e5 2f42 4eb2 a3a9 c58143e835f9: 0.000001-fold of the SI derived unit becquerel -- QUDT

MicroBecquerelPerKilogram
type: Class
comment: One radioactive disintegration per hundred thousand seconds from an SI standard unit of mass of sample. -- QUDT
subclass of: Restriction
  has value: 0e+00
subclass of: Restriction
  some values from: BecquerelPerKilogram
subclass of: Restriction
  has value: 1e-06
alternative label: Microbecquerels per kilogram
qudtReference: http://qudt.org/vocab/unit/MicroBQ-PER-KiloGM
ucumCode: uBq.kg-1
unitSymbol: µBq/kg
EMMO 967080e5 2f42 4eb2 a3a9 c58143e835f9: One radioactive disintegration per hundred thousand seconds from an SI standard unit of mass of sample. -- QUDT

MicroBecquerelPerLitre
type: Class
subclass of: Restriction
  some values from: BecquerelPerLitre
subclass of: Restriction
  has value: 0e+00
subclass of: Restriction
  has value: 1e-03
alternative label: Microbecquerels per litre
qudtReference: http://qudt.org/vocab/unit/MicroBQ-PER-L
ucumCode: uBq.L-1
unitSymbol: µBq/L

MicroCoulomb
type: Class
comment: A MicroCoulomb is 10⁻⁶ C. -- QUDT
subclass of: Restriction
  has value: 1e-06
subclass of: Restriction
  some values from: Coulomb
subclass of: Restriction
  has value: 0e+00
qudtReference: http://qudt.org/vocab/unit/MicroC
ucumCode: uC
unitSymbol: µC
EMMO 967080e5 2f42 4eb2 a3a9 c58143e835f9: A MicroCoulomb is 10⁻⁶ C. -- QUDT

MicroCoulombPerCubicMetre
type: Class
comment: 0.000001-fold of the SI derived unit coulomb divided by the power of the SI base unit metre with the exponent 3 -- QUDT
subclass of: Restriction
  has value: 1e-06
subclass of: Restriction
  has value: 0e+00
alternative label: Microcoulomb Per Cubic Metre
qudtReference: http://qudt.org/vocab/unit/MicroC-PER-M3
ucumCode: uC.m-3
unitSymbol: μC/m³
EMMO 967080e5 2f42 4eb2 a3a9 c58143e835f9: 0.000001-fold of the SI derived unit coulomb divided by the power of the SI base unit metre with the exponent 3 -- QUDT

MicroCoulombPerSquareMetre
type: Class
comment: 0.000001-fold of the SI derived unit coulomb divided by the power of the SI base unit metre with the exponent 2 -- QUDT
subclass of: Restriction
  has value: 0e+00
subclass of: Restriction
  has value: 1e-06
alternative label: Microcoulomb Per Square Metre
qudtReference: http://qudt.org/vocab/unit/MicroC-PER-M2
ucumCode: uC.m-2
unitSymbol: μC/m²
EMMO 967080e5 2f42 4eb2 a3a9 c58143e835f9: 0.000001-fold of the SI derived unit coulomb divided by the power of the SI base unit metre with the exponent 2 -- QUDT

MicroCurie
type: Class
comment: Another commonly used measure of radioactivity, the microcurie: 1 μCi = 3.7 × 10 disintegrations per second = 2.22 × 10 disintegrations per minute. A radiotherapy machine may have roughly 1000 Ci of a radioisotope such as caesium-137 or cobalt-60. This quantity of radioactivity can produce serious health effects with only a few minutes of close-range, un-shielded exposure. The typical human body contains roughly 0.1 μCi of naturally occurring potassium-40. -- QUDT
subclass of: Restriction
  has value: 3.7e+04
subclass of: Restriction
  has value: 0e+00
qudtReference: http://qudt.org/vocab/unit/MicroCi
ucumCode: uCi
unitSymbol: μCi
EMMO 967080e5 2f42 4eb2 a3a9 c58143e835f9: Another commonly used measure of radioactivity, the microcurie: 1 μCi = 3.7 × 10 disintegrations per second = 2.22 × 10 disintegrations per minute. A radiotherapy machine may have roughly 1000 Ci of a radioisotope such as caesium-137 or cobalt-60. This quantity of radioactivity can produce serious health effects with only a few minutes of close-range, un-shielded exposure. The typical human body contains roughly 0.1 μCi of naturally occurring potassium-40. -- QUDT
wikipediaReference: http://en.wikipedia.org/wiki/Curie

MicroFarad
type: Class
comment: The "microfarad" (symbolized μ F) is a unit of capacitance, equivalent to 0.000001 (10 to the -6th power) farad. The microfarad is a moderate unit of capacitance. In utility alternating-current (AC) and audio-frequency (AF) circuits, capacitors with values on the order of 1 μ F or more are common. At radio frequencies (RF), a smaller unit, the picofarad (pF), is often used. -- QUDT
subclass of: Restriction
  some values from: Farad
subclass of: Restriction
  has value: 1e-06
subclass of: Restriction
  has value: 0e+00
alternative label: microfarad
qudtReference: http://qudt.org/vocab/unit/MicroFARAD
ucumCode: uF
unitSymbol: µF
EMMO 967080e5 2f42 4eb2 a3a9 c58143e835f9: The "microfarad" (symbolized μ F) is a unit of capacitance, equivalent to 0.000001 (10 to the -6th power) farad. The microfarad is a moderate unit of capacitance. In utility alternating-current (AC) and audio-frequency (AF) circuits, capacitors with values on the order of 1 μ F or more are common. At radio frequencies (RF), a smaller unit, the picofarad (pF), is often used. -- QUDT

MicroFaradPerKiloMetre
type: Class
comment: 0.000001-fold of the SI derived unit farad divided by the 1,000-fold of the SI base unit metre -- QUDT
subclass of: Restriction
  has value: 1e-09
subclass of: Restriction
  has value: 0e+00
alternative label: Microfarad Per Kilometre
qudtReference: http://qudt.org/vocab/unit/MicroFARAD-PER-KiloM
ucumCode: uF.km-1
unitSymbol: μF/km
EMMO 967080e5 2f42 4eb2 a3a9 c58143e835f9: 0.000001-fold of the SI derived unit farad divided by the 1,000-fold of the SI base unit metre -- QUDT

MicroFaradPerMetre
type: Class
comment: 0.000001-fold of the SI derived unit farad divided by the SI base unit metre. -- QUDT
subclass of: Restriction
  has value: 1e-06
subclass of: Restriction
  has value: 0e+00
alternative label: Microfarad Per Metre
qudtReference: http://qudt.org/vocab/unit/MicroFARAD-PER-M
ucumCode: uF.m-1
unitSymbol: μF/m
EMMO 967080e5 2f42 4eb2 a3a9 c58143e835f9: 0.000001-fold of the SI derived unit farad divided by the SI base unit metre. -- QUDT

MicroGalsPerMetre
type: Class
comment: A rate of change of one millionth part of a unit of gravitational acceleration equal to one centimetre per second per second over a distance of one metre. -- QUDT
subclass of: Restriction
  has value: 1e-08
subclass of: Restriction
  has value: 0e+00
alternative label: MicroGals per metre
qudtReference: http://qudt.org/vocab/unit/MicroGAL-PER-M
ucumCode: uGal.m-1
unitSymbol: µGal/m
EMMO 967080e5 2f42 4eb2 a3a9 c58143e835f9: A rate of change of one millionth part of a unit of gravitational acceleration equal to one centimetre per second per second over a distance of one metre. -- QUDT

MicroGram
type: Class
comment: 0.000000001-fold of the SI base unit kilogram -- QUDT
subclass of: Restriction
  has value: 1e-09
subclass of: Restriction
  has value: 0e+00
qudtReference: http://qudt.org/vocab/unit/MicroGM
ucumCode: ug
unitSymbol: μg
EMMO 967080e5 2f42 4eb2 a3a9 c58143e835f9: 0.000000001-fold of the SI base unit kilogram -- QUDT

MicroGramPerCubicMetre
type: Class
comment: 0.000000001-fold of the SI base unit kilogram divided by the power of the SI base unit metre with the exponent 3 -- QUDT
subclass of: Restriction
  has value: 1e-09
subclass of: Restriction
  has value: 0e+00
alternative label: Microgram Per Cubic Metre
qudtReference: http://qudt.org/vocab/unit/MicroGM-PER-M3
ucumCode: ug.m-3
ucumCode: ug/m3
unitSymbol: μg/m³
EMMO 967080e5 2f42 4eb2 a3a9 c58143e835f9: 0.000000001-fold of the SI base unit kilogram divided by the power of the SI base unit metre with the exponent 3 -- QUDT

MicroGramPerCubicMetrePerHour
type: Class
subclass of: Restriction
  has value: 2.777778e-13
subclass of: Restriction
  has value: 0e+00
alternative label: Micrograms per cubic metre per hour
qudtReference: http://qudt.org/vocab/unit/MicroGM-PER-M3-HR
ucumCode: ug.m-3.h-1
unitSymbol: µg/(m³⋅day)

MicroGramPerGram
type: Class
comment: One part per 10**6 (million) by mass of the measurand in the matrix. -- QUDT
subclass of: Restriction
  some values from: GramPerGram
subclass of: Restriction
  has value: 1e-06
subclass of: Restriction
  has value: 0e+00
alternative label: Micrograms per gram
qudtReference: http://qudt.org/vocab/unit/MicroGM-PER-GM
ucumCode: ug.g-1
unitSymbol: µg/g
EMMO 967080e5 2f42 4eb2 a3a9 c58143e835f9: One part per 10**6 (million) by mass of the measurand in the matrix. -- QUDT

MicroGramPerKilogram
type: Class
comment: mass ratio as 0.000000001-fold of the SI base unit kilogram divided by the SI base unit kilogram -- QUDT
subclass of: Restriction
  has value: 1e-09
subclass of: Restriction
  has value: 0e+00
alternative label: Microgram Per Kilogram
qudtReference: http://qudt.org/vocab/unit/MicroGM-PER-KiloGM
ucumCode: ug.kg-1
ucumCode: ug/kg
unitSymbol: μg/kg
EMMO 967080e5 2f42 4eb2 a3a9 c58143e835f9: mass ratio as 0.000000001-fold of the SI base unit kilogram divided by the SI base unit kilogram -- QUDT

MicroGramPerLitre
type: Class
comment: 0.000000001-fold of the SI base unit kilogram divided by the unit litre -- QUDT
subclass of: Restriction
  has value: 1e-06
subclass of: Restriction
  has value: 0e+00
alternative label: Microgram Per Litre
qudtReference: http://qudt.org/vocab/unit/MicroGM-PER-L
ucumCode: ug.L-1
ucumCode: ug/L
unitSymbol: μg/L
EMMO 967080e5 2f42 4eb2 a3a9 c58143e835f9: 0.000000001-fold of the SI base unit kilogram divided by the unit litre -- QUDT

MicroGramPerLitrePerHour
type: Class
comment: A rate of change of mass of a measurand equivalent to 10⁻⁹ kilogram (the SI unit of mass) per litre volume of matrix over a period of 1 hour. -- QUDT
subclass of: Restriction
  has value: 2.777778e-10
subclass of: Restriction
  has value: 0e+00
alternative label: Micrograms per litre per hour
qudtReference: http://qudt.org/vocab/unit/MicroGM-PER-L-HR
ucumCode: ug.L-1.h-1
unitSymbol: µg/(L⋅h)
EMMO 967080e5 2f42 4eb2 a3a9 c58143e835f9: A rate of change of mass of a measurand equivalent to 10⁻⁹ kilogram (the SI unit of mass) per litre volume of matrix over a period of 1 hour. -- QUDT

MicroGramPerMilliLitre
type: Class
comment: One 10**6 part of the SI standard unit of mass of the measurand per millilitre volume of matrix. -- QUDT
subclass of: Restriction
  some values from: GramPerMilliLitre
subclass of: Restriction
  has value: 1e-03
subclass of: Restriction
  has value: 0e+00
alternative label: Micrograms per millilitre
qudtReference: http://qudt.org/vocab/unit/MicroGM-PER-MilliL
ucumCode: ug.mL-1
unitSymbol: µg/mL
EMMO 967080e5 2f42 4eb2 a3a9 c58143e835f9: One 10**6 part of the SI standard unit of mass of the measurand per millilitre volume of matrix. -- QUDT

MicroGramPerSquareCentiMetre
type: Class
comment: A unit of mass per area, equivalent to 0.01 grammes per square metre -- QUDT
subclass of: Restriction
  some values from: GramPerSquareCentiMetre
subclass of: Restriction
  has value: 1e-02
subclass of: Restriction
  has value: 0e+00
alternative label: Microgram per square centimetre
qudtReference: http://qudt.org/vocab/unit/MicroG-PER-CentiM2
unitSymbol: µg/cm²
EMMO 967080e5 2f42 4eb2 a3a9 c58143e835f9: A unit of mass per area, equivalent to 0.01 grammes per square metre -- QUDT

MicroGramPerSquareMetrePerDay
type: Class
subclass of: Restriction
  some values from: GramPerSquareMetrePerDay
subclass of: Restriction
  has value: 1.157407e-14
subclass of: Restriction
  has value: 0e+00
alternative label: Micrograms per square metre per day
qudtReference: http://qudt.org/vocab/unit/MicroGM-PER-M2-DAY
ucumCode: ug.m-2.d-1
unitSymbol: µg/(m²⋅day)

MicroGravity
type: Class
comment: "Microgravity" is a unit for 'Linear Acceleration' expressed as microG. -- QUDT
subclass of: Restriction
  some values from: Gravity
subclass of: Restriction
  has value: 9.80665e-06
subclass of: Restriction
  has value: 0e+00
qudtReference: http://qudt.org/vocab/unit/MicroG
ucumCode: u[g]
unitSymbol: µG
EMMO 967080e5 2f42 4eb2 a3a9 c58143e835f9: "Microgravity" is a unit for 'Linear Acceleration' expressed as microG. -- QUDT

MicroGray
type: Class
comment: 0.000001 fold of the SI unit of radiation dose. Radiation carries energy, and when it is absorbed by matter the matter receives this energy. The dose is the amount of energy deposited per unit of mass. One gray is defined to be the dose of one joule of energy absorbed per kilogram of matter, or 100 rad. The unit is named for the British physician L. Harold Gray (1905-1965), an authority on the use of radiation in the treatment of cancer. -- QUDT
subclass of: Restriction
  has value: 0e+00
subclass of: Restriction
  some values from: Gray
subclass of: Restriction
  has value: 1e-06
qudtReference: http://qudt.org/vocab/unit/MicroGRAY
ucumCode: uGy
unitSymbol: µGy
EMMO 967080e5 2f42 4eb2 a3a9 c58143e835f9: 0.000001 fold of the SI unit of radiation dose. Radiation carries energy, and when it is absorbed by matter the matter receives this energy. The dose is the amount of energy deposited per unit of mass. One gray is defined to be the dose of one joule of energy absorbed per kilogram of matter, or 100 rad. The unit is named for the British physician L. Harold Gray (1905-1965), an authority on the use of radiation in the treatment of cancer. -- QUDT
wikipediaReference: http://en.wikipedia.org/wiki/Grey

MicroHenry
type: Class
comment: The SI derived unit for inductance is the henry. 1 henry is equal to 1000000 microhenry. -- QUDT
subclass of: Restriction
  some values from: Henry
subclass of: Restriction
  has value: 1e-06
subclass of: Restriction
  has value: 0e+00
qudtReference: http://qudt.org/vocab/unit/MicroH
ucumCode: uH
unitSymbol: µH
EMMO 967080e5 2f42 4eb2 a3a9 c58143e835f9: The SI derived unit for inductance is the henry. 1 henry is equal to 1000000 microhenry. -- QUDT

MicroHenryPerKiloOhm
type: Class
comment: 0.000001-fold of the SI derived unit henry divided by the 1,000-fold of the SI derived unit ohm -- QUDT
subclass of: Restriction
  has value: 1e-09
subclass of: Restriction
  some values from: HenryPerKiloOhm
subclass of: Restriction
  has value: 0e+00
alternative label: Microhenry Per Kiloohm
qudtReference: http://qudt.org/vocab/unit/MicroH-PER-KiloOHM
ucumCode: uH.kOhm-1
unitSymbol: µH/kΩ
EMMO 967080e5 2f42 4eb2 a3a9 c58143e835f9: 0.000001-fold of the SI derived unit henry divided by the 1,000-fold of the SI derived unit ohm -- QUDT

MicroHenryPerMetre
type: Class
comment: 0.000001-fold of the SI derived unit henry divided by the SI base unit metre -- QUDT
subclass of: Restriction
  has value: 1e-06
subclass of: Restriction
  has value: 0e+00
alternative label: Microhenry Per Metre
qudtReference: http://qudt.org/vocab/unit/MicroH-PER-M
ucumCode: uH.m-1
unitSymbol: μH/m
EMMO 967080e5 2f42 4eb2 a3a9 c58143e835f9: 0.000001-fold of the SI derived unit henry divided by the SI base unit metre -- QUDT

MicroHenryPerOhm
type: Class
comment: 0.000001-fold of the SI derived unit henry divided by the SI derived unit ohm -- QUDT
subclass of: Restriction
  has value: 0e+00
subclass of: Restriction
  some values from: HenryPerOhm
subclass of: Restriction
  has value: 1e-06
alternative label: Microhenry Per Ohm
qudtReference: http://qudt.org/vocab/unit/MicroH-PER-OHM
ucumCode: uH.Ohm-1
unitSymbol: µH/Ω
EMMO 967080e5 2f42 4eb2 a3a9 c58143e835f9: 0.000001-fold of the SI derived unit henry divided by the SI derived unit ohm -- QUDT

MicroInch
type: Class
comment: "Microinch" is an Imperial unit for 'Length' expressed as in⁻⁶. -- QUDT
subclass of: Restriction
  some values from: Inch
subclass of: Restriction
  has value: 2.54e-08
subclass of: Restriction
  has value: 0e+00
qudtReference: http://qudt.org/vocab/unit/MicroIN
ucumCode: u[in_i]
unitSymbol: µin
EMMO 967080e5 2f42 4eb2 a3a9 c58143e835f9: "Microinch" is an Imperial unit for 'Length' expressed as in⁻⁶. -- QUDT

MicroJoule
type: Class
comment: 0.000001-fold of the SI derived unit joule -- QUDT
subclass of: Restriction
  has value: 0e+00
subclass of: Restriction
  some values from: Joule
subclass of: Restriction
  has value: 1e-06
alternative label: Micro Joule
qudtReference: http://qudt.org/vocab/unit/MicroJ
unitSymbol: µJ
EMMO 967080e5 2f42 4eb2 a3a9 c58143e835f9: 0.000001-fold of the SI derived unit joule -- QUDT

MicroLitre
type: Class
comment: 0.000001-fold of the unit litre -- QUDT
subclass of: Restriction
  has value: 1e-09
subclass of: Restriction
  has value: 0e+00
qudtReference: http://qudt.org/vocab/unit/MicroL
ucumCode: uL
unitSymbol: μL
EMMO 967080e5 2f42 4eb2 a3a9 c58143e835f9: 0.000001-fold of the unit litre -- QUDT

MicroLitrePerLitre
type: Class
comment: volume ratio as 0.000001-fold of the unit litre divided by the unit litre -- QUDT
subclass of: Restriction
  has value: 1e-06
subclass of: Restriction
  has value: 0e+00
alternative label: Microlitre Per Litre
qudtReference: http://qudt.org/vocab/unit/MicroL-PER-L
ucumCode: uL.L-1
ucumCode: uL/L
unitSymbol: μL/L
EMMO 967080e5 2f42 4eb2 a3a9 c58143e835f9: volume ratio as 0.000001-fold of the unit litre divided by the unit litre -- QUDT

MicroMetre
type: Class
comment: "Micrometer" is a unit for 'Length' expressed as microm. -- QUDT
subclass of: Restriction
  some values from: Metre
subclass of: Restriction
  has value: 1e-06
subclass of: Restriction
  has value: 0e+00
alternative label: Microm
alternative label: MicroMeter
qudtReference: http://qudt.org/vocab/unit/MicroM
ucumCode: um
unitSymbol: µm
EMMO 967080e5 2f42 4eb2 a3a9 c58143e835f9: "Micrometer" is a unit for 'Length' expressed as microm. -- QUDT
wikipediaReference: http://en.wikipedia.org/wiki/Micrometer

MicroMetrePerKelvin
type: Class
comment: 0.000001-fold of the SI base unit metre divided by the SI base unit kelvin -- QUDT
subclass of: Restriction
  has value: 1e-06
subclass of: Restriction
  has value: 0e+00
alternative label: Micrometre Per Kelvin
qudtReference: http://qudt.org/vocab/unit/MicroM-PER-K
ucumCode: um.K-1
unitSymbol: μm/K
EMMO 967080e5 2f42 4eb2 a3a9 c58143e835f9: 0.000001-fold of the SI base unit metre divided by the SI base unit kelvin -- QUDT

MicroMetrePerNewton
type: Class
comment: Micro metres measured per Newton -- QUDT
subclass of: Restriction
  has value: 1e-06
subclass of: Restriction
  has value: 0e+00
alternative label: Micro metre per Newton
qudtReference: http://qudt.org/vocab/unit/MicroM-PER-N
unitSymbol: µJ/N
EMMO 967080e5 2f42 4eb2 a3a9 c58143e835f9: Micro metres measured per Newton -- QUDT

MicroMho
type: Class
comment: 0.000001-fold of the obsolete unit mho of the electric conductance -- QUDT
subclass of: Restriction
  has value: 0e+00
subclass of: Restriction
  has value: 1e-06
qudtReference: http://qudt.org/vocab/unit/MicroMHO
ucumCode: umho
unitSymbol: μmho
EMMO 967080e5 2f42 4eb2 a3a9 c58143e835f9: 0.000001-fold of the obsolete unit mho of the electric conductance -- QUDT

MicroMole
type: Class
comment: 0.000001-fold of the SI base unit mol -- QUDT
subclass of: Restriction
  has value: 1e-06
subclass of: Restriction
  has value: 0e+00
qudtReference: http://qudt.org/vocab/unit/MicroMOL
ucumCode: umol
unitSymbol: μmol
EMMO 967080e5 2f42 4eb2 a3a9 c58143e835f9: 0.000001-fold of the SI base unit mol -- QUDT

MicroMolePerGram
type: Class
comment: 0.000001-fold of the SI base unit mol divided by the 0.001-fold of the SI base unit kilogram -- QUDT
subclass of: Restriction
  has value: 1e-03
subclass of: Restriction
  has value: 0e+00
alternative label: Micromoles per gram
qudtReference: http://qudt.org/vocab/unit/MicroMOL-PER-GM
ucumCode: umol.g-1
ucumCode: umol/g
unitSymbol: µmol/g
EMMO 967080e5 2f42 4eb2 a3a9 c58143e835f9: 0.000001-fold of the SI base unit mol divided by the 0.001-fold of the SI base unit kilogram -- QUDT

MicroMolePerGramPerHour
type: Class
subclass of: Restriction
  some values from: MolePerGramPerHour
subclass of: Restriction
  has value: 2.777778e-07
subclass of: Restriction
  has value: 0e+00
alternative label: Micromoles per gram per hour
qudtReference: http://qudt.org/vocab/unit/MicroMOL-PER-GM-HR
ucumCode: umol.g-1.h-1
ucumCode: umol/g/h
unitSymbol: µmol/(g⋅h)

MicroMolePerGramPerSecond
type: Class
subclass of: Restriction
  has value: 1e-04
subclass of: Restriction
  has value: 0e+00
alternative label: Micromoles per gram per second
qudtReference: http://qudt.org/vocab/unit/MicroMOL-PER-GM-SEC
ucumCode: umol.g-1.s-1
ucumCode: umol/g/s
unitSymbol: μmol/(g⋅s)

MicroMolePerKilogram
type: Class
subclass of: Restriction
  has value: 1e-06
subclass of: Restriction
  has value: 0e+00
alternative label: Micromoles per kilogram
qudtReference: http://qudt.org/vocab/unit/MicroMOL-PER-KiloGM
ucumCode: umol.kg-1
ucumCode: umol/kg
unitSymbol: µmol/kg

MicroMolePerLitre
type: Class
subclass of: Restriction
  some values from: MolePerLitre
subclass of: Restriction
  has value: 1e-03
subclass of: Restriction
  has value: 0e+00
alternative label: Micromoles per litre
qudtReference: http://qudt.org/vocab/unit/MicroMOL-PER-L
ucumCode: umol.L-1
ucumCode: umol/L
unitSymbol: µmol/L

MicroMolePerLitrePerDay
type: Class
subclass of: Restriction
  has value: 0e+00
subclass of: Restriction
  has value: 1.157407e-08
alternative label: Micromoles per litre per day
qudtReference: http://qudt.org/vocab/unit/MicroM-PER-L-DAY
ucumCode: um.L-1.d-1
unitSymbol: µm/(L⋅day)

MicroMolePerLitrePerHour
type: Class
subclass of: Restriction
  has value: 2.777778e-07
subclass of: Restriction
  has value: 0e+00
alternative label: Micromoles per litre per hour
qudtReference: http://qudt.org/vocab/unit/MicroMOL-PER-L-HR
ucumCode: umol.L-1.h-1
ucumCode: umol/L/h
unitSymbol: µmol/(L⋅h)

MicroMolePerMicroMoleOfBiomassPerDay
type: Class
subclass of: Restriction
  has value: 1.157407e-05
subclass of: Restriction
  has value: 0e+00
alternative label: Micromole per micromole of biomass per day
qudtReference: http://qudt.org/vocab/unit/MicroMOL-PER-MicroMOL-DAY
ucumCode: umol.umol-1.d-1
ucumCode: umol/umol/d
unitSymbol: µmol/(µmol⋅day)

MicroMolePerMole
type: Class
subclass of: Restriction
  has value: 1e-06
subclass of: Restriction
  has value: 0e+00
alternative label: Micromoles per mole
qudtReference: http://qudt.org/vocab/unit/MicroMOL-PER-MOL
ucumCode: umol.mol-1
ucumCode: umol/mol
unitSymbol: µmol/mol

MicroMolePerSecond
type: Class
comment: This unit is used commonly to describe Photosynthetic Photon Flux (PPF) - the total number of photons emitted by a light source each second within the PAR wavelength range. -- QUDT
subclass of: Restriction
  some values from: MolePerSecond
subclass of: Restriction
  has value: 1e-06
subclass of: Restriction
  has value: 0e+00
alternative label: Micromoles per second
qudtReference: http://qudt.org/vocab/unit/MicroMOL-PER-SEC
ucumCode: umol.s-1
ucumCode: umol/s
unitSymbol: µmol/s
EMMO 967080e5 2f42 4eb2 a3a9 c58143e835f9: This unit is used commonly to describe Photosynthetic Photon Flux (PPF) - the total number of photons emitted by a light source each second within the PAR wavelength range. -- QUDT

MicroMolePerSquareMetre
type: Class
comment: One part per 10**6 (million) of the SI unit of quantity of matter (the mole) per SI unit area. -- QUDT
subclass of: Restriction
  some values from: MolePerSquareMetre
subclass of: Restriction
  has value: 1e-06
subclass of: Restriction
  has value: 0e+00
alternative label: Micromoles per square metre
qudtReference: http://qudt.org/vocab/unit/MicroMOL-PER-M2
ucumCode: umol.m-2
ucumCode: umol/m2
unitSymbol: µmol/m²
EMMO 967080e5 2f42 4eb2 a3a9 c58143e835f9: One part per 10**6 (million) of the SI unit of quantity of matter (the mole) per SI unit area. -- QUDT

MicroMolePerSquareMetrePerDay
type: Class
subclass of: Restriction
  some values from: MolePerSquareMetrePerDay
subclass of: Restriction
  has value: 1.157407e-11
subclass of: Restriction
  has value: 0e+00
alternative label: Micromoles per square metre per day
qudtReference: http://qudt.org/vocab/unit/MicroMOL-PER-M2-DAY
ucumCode: umol.m-2.d-1
ucumCode: umol/m2/d
unitSymbol: µmol/(m²⋅day)

MicroMolePerSquareMetrePerHour
type: Class
subclass of: Restriction
  has value: 2.777778e-10
subclass of: Restriction
  has value: 0e+00
alternative label: Micromoles per square metre per hour
qudtReference: http://qudt.org/vocab/unit/MicroMOL-PER-M2-HR
ucumCode: umol.m-2.h-1
ucumCode: umol/m2/h
unitSymbol: µmol/(m²⋅h)

MicroMolePerSquareMetrePerSecond
type: Class
comment: One part per 10**6 (million) of the SI unit of quantity of matter (the mole) per SI unit area per SI unit of time. This term is based on the number of photons in a certain waveband incident per unit time (s) on a unit area (m2) divided by the Avogadro constant (6.022 x 1023 mol-1). It is used commonly to describe PAR in the 400-700 nm waveband. Definition Source: Thimijan, Richard W., and Royal D. Heins. 1982. Photometric, Radiometric, and Quantum Light Units of Measure: A Review of Procedures for Interconversion. HortScience 18:818-822. -- QUDT
subclass of: Restriction
  has value: 1e-06
subclass of: Restriction
  some values from: MolePerSquareMetrePerSecond
subclass of: Restriction
  has value: 0e+00
alternative label: Micromoles per square metre per second
qudtReference: http://qudt.org/vocab/unit/MicroMOL-PER-M2-SEC
ucumCode: umol.m-2.s-1
ucumCode: umol/m2/s
unitSymbol: µmol/(m²⋅s)
EMMO 967080e5 2f42 4eb2 a3a9 c58143e835f9: One part per 10**6 (million) of the SI unit of quantity of matter (the mole) per SI unit area per SI unit of time. This term is based on the number of photons in a certain waveband incident per unit time (s) on a unit area (m2) divided by the Avogadro constant (6.022 x 1023 mol-1). It is used commonly to describe PAR in the 400-700 nm waveband. Definition Source: Thimijan, Richard W., and Royal D. Heins. 1982. Photometric, Radiometric, and Quantum Light Units of Measure: A Review of Procedures for Interconversion. HortScience 18:818-822. -- QUDT

MicroNewton
type: Class
comment: 0.000001-fold of the SI derived unit newton -- QUDT
subclass of: Restriction
  has value: 1e-06
subclass of: Restriction
  has value: 0e+00
qudtReference: http://qudt.org/vocab/unit/MicroN
ucumCode: uN
unitSymbol: μN
EMMO 967080e5 2f42 4eb2 a3a9 c58143e835f9: 0.000001-fold of the SI derived unit newton -- QUDT

MicroNewtonMetre
type: Class
comment: 0.000001-fold of the product out of the derived SI newton and the SI base unit metre -- QUDT
subclass of: Restriction
  has value: 0e+00
subclass of: Restriction
  has value: 1e-06
alternative label: Micronewton Metre
qudtReference: http://qudt.org/vocab/unit/MicroN-M
ucumCode: uN.m
unitSymbol: μN⋅m
EMMO 967080e5 2f42 4eb2 a3a9 c58143e835f9: 0.000001-fold of the product out of the derived SI newton and the SI base unit metre -- QUDT

MicroOhm
type: Class
comment: 0.000001-fold of the SI derived unit ohm -- QUDT
subclass of: Restriction
  has value: 1e-06
subclass of: Restriction
  has value: 0e+00
qudtReference: http://qudt.org/vocab/unit/MicroOHM
ucumCode: uOhm
unitSymbol: μΩ
EMMO 967080e5 2f42 4eb2 a3a9 c58143e835f9: 0.000001-fold of the SI derived unit ohm -- QUDT

MicroPascal
type: Class
comment: 0.000001-fold of the SI derived unit pascal -- QUDT
subclass of: Restriction
  has value: 1e-06
subclass of: Restriction
  has value: 0e+00
qudtReference: http://qudt.org/vocab/unit/MicroPA
ucumCode: uPa
unitSymbol: μPa
EMMO 967080e5 2f42 4eb2 a3a9 c58143e835f9: 0.000001-fold of the SI derived unit pascal -- QUDT

MicroPoise
type: Class
comment: 0.000001-fold of the CGS unit of the dynamic viscosity poise -- QUDT
subclass of: Restriction
  has value: 1e-07
subclass of: Restriction
  has value: 0e+00
qudtReference: http://qudt.org/vocab/unit/MicroPOISE
ucumCode: uP
unitSymbol: μP
EMMO 967080e5 2f42 4eb2 a3a9 c58143e835f9: 0.000001-fold of the CGS unit of the dynamic viscosity poise -- QUDT

MicroRadian
type: Class
subclass of: Restriction
  some values from: Radian
subclass of: Restriction
  has value: 1e-06
subclass of: Restriction
  has value: 0e+00
alternative label: microradian
qudtReference: http://qudt.org/vocab/unit/MicroRAD
ucumCode: urad
unitSymbol: µrad

MicroSecond
type: Class
comment: "Microsecond" is a unit for 'Time' expressed as microsec. -- QUDT
subclass of: Restriction
  some values from: Second
subclass of: Restriction
  has value: 1e-06
subclass of: Restriction
  has value: 0e+00
alternative label: microsecond
qudtReference: http://qudt.org/vocab/unit/MicroSEC
ucumCode: us
unitSymbol: µs
EMMO 967080e5 2f42 4eb2 a3a9 c58143e835f9: "Microsecond" is a unit for 'Time' expressed as microsec. -- QUDT

MicroSiemens
type: Class
comment: 0.000001-fold of the SI derived unit siemens -- QUDT
subclass of: Restriction
  has value: 1e-06
subclass of: Restriction
  has value: 0e+00
qudtReference: http://qudt.org/vocab/unit/MicroS
ucumCode: uS
unitSymbol: μS
EMMO 967080e5 2f42 4eb2 a3a9 c58143e835f9: 0.000001-fold of the SI derived unit siemens -- QUDT

MicroSiemensPerCentiMetre
type: Class
comment: 0.000001-fold of the SI derived unit Siemens divided by the 0.01-fold of the SI base unit metre -- QUDT
subclass of: Restriction
  has value: 0e+00
subclass of: Restriction
  has value: 1e-04
alternative label: Microsiemens Per Centimetre
qudtReference: http://qudt.org/vocab/unit/MicroS-PER-CentiM
ucumCode: uS.cm-1
unitSymbol: μS/cm
EMMO 967080e5 2f42 4eb2 a3a9 c58143e835f9: 0.000001-fold of the SI derived unit Siemens divided by the 0.01-fold of the SI base unit metre -- QUDT

MicroSiemensPerMetre
type: Class
comment: 0.000001-fold of the SI derived unit Siemens divided by the SI base unit metre -- QUDT
subclass of: Restriction
  has value: 1e-06
subclass of: Restriction
  has value: 0e+00
alternative label: Microsiemens Per Metre
qudtReference: http://qudt.org/vocab/unit/MicroS-PER-M
ucumCode: uS.m-1
unitSymbol: μS/m
EMMO 967080e5 2f42 4eb2 a3a9 c58143e835f9: 0.000001-fold of the SI derived unit Siemens divided by the SI base unit metre -- QUDT

MicroSievert
type: Class
comment: Although the sievert has the same dimensions as the gray (i.e. joules per kilogram), it measures a different quantity. To avoid any risk of confusion between the absorbed dose and the equivalent dose, the corresponding special units, namely the gray instead of the joule per kilogram for absorbed dose and the sievert instead of the joule per kilogram for the dose equivalent, should be used. 0.000001-fold of the SI derived unit sievert. -- QUDT
subclass of: Restriction
  some values from: Sievert
subclass of: Restriction
  has value: 1e-06
subclass of: Restriction
  has value: 0e+00
qudtReference: http://qudt.org/vocab/unit/MicroSV
ucumCode: uSv
unitSymbol: µSv
EMMO 967080e5 2f42 4eb2 a3a9 c58143e835f9: Although the sievert has the same dimensions as the gray (i.e. joules per kilogram), it measures a different quantity. To avoid any risk of confusion between the absorbed dose and the equivalent dose, the corresponding special units, namely the gray instead of the joule per kilogram for absorbed dose and the sievert instead of the joule per kilogram for the dose equivalent, should be used. 0.000001-fold of the SI derived unit sievert. -- QUDT
wikipediaReference: http://en.wikipedia.org/wiki/Sievert

MicroSievertPerHour
type: Class
comment: 0.000001-fold of the derived SI unit sievert divided by the unit hour -- QUDT
subclass of: Restriction
  has value: 2.77778e-10
subclass of: Restriction
  has value: 0e+00
alternative label: MicroSievert per hour
qudtReference: http://qudt.org/vocab/unit/MicroSV-PER-HR
ucumCode: uSv.h-1
unitSymbol: µSv/h
EMMO 967080e5 2f42 4eb2 a3a9 c58143e835f9: 0.000001-fold of the derived SI unit sievert divided by the unit hour -- QUDT
wikipediaReference: http://en.wikipedia.org/wiki/Sievert

MicroTesla
type: Class
comment: 0.000001-fold of the SI derived unit tesla -- QUDT
subclass of: Restriction
  some values from: Tesla
subclass of: Restriction
  has value: 1e-06
subclass of: Restriction
  has value: 0e+00
qudtReference: http://qudt.org/vocab/unit/MicroT
ucumCode: uT
unitSymbol: µT
EMMO 967080e5 2f42 4eb2 a3a9 c58143e835f9: 0.000001-fold of the SI derived unit tesla -- QUDT

MicroTorr
type: Class
comment: "MicroTorr" is a unit for 'Force Per Area' expressed as microtorr. -- QUDT
subclass of: Restriction
  has value: 1.33322e-04
subclass of: Restriction
  some values from: Torr
subclass of: Restriction
  has value: 0e+00
qudtReference: http://qudt.org/vocab/unit/MicroTORR
unitSymbol: µTorr
EMMO 967080e5 2f42 4eb2 a3a9 c58143e835f9: "MicroTorr" is a unit for 'Force Per Area' expressed as microtorr. -- QUDT

MicroVolt
type: Class
comment: 0.000001-fold of the SI derived unit volt -- QUDT
subclass of: Restriction
  some values from: Volt
subclass of: Restriction
  has value: 1e-06
subclass of: Restriction
  has value: 0e+00
qudtReference: http://qudt.org/vocab/unit/MicroV
ucumCode: uV
unitSymbol: µV
EMMO 967080e5 2f42 4eb2 a3a9 c58143e835f9: 0.000001-fold of the SI derived unit volt -- QUDT

MicroVoltPerMetre
type: Class
comment: 0.000001-fold of the SI derived unit volt divided by the SI base unit metre -- QUDT
subclass of: Restriction
  some values from: VoltPerMetre
subclass of: Restriction
  has value: 1e-06
subclass of: Restriction
  has value: 0e+00
alternative label: Microvolt Per Metre
qudtReference: http://qudt.org/vocab/unit/MicroV-PER-M
ucumCode: uV.m-1
unitSymbol: µV/m
EMMO 967080e5 2f42 4eb2 a3a9 c58143e835f9: 0.000001-fold of the SI derived unit volt divided by the SI base unit metre -- QUDT

MicroWatt
type: Class
comment: 0.000001-fold of the SI derived unit watt -- QUDT
subclass of: Restriction
  has value: 1e-06
subclass of: Restriction
  has value: 0e+00
qudtReference: http://qudt.org/vocab/unit/MicroW
ucumCode: uW
unitSymbol: μW
EMMO 967080e5 2f42 4eb2 a3a9 c58143e835f9: 0.000001-fold of the SI derived unit watt -- QUDT

MicroWattPerSquareMetre
type: Class
comment: 0.000001-fold of the SI derived unit watt divided by the power of the SI base unit metre with the exponent 2 -- QUDT
subclass of: Restriction
  some values from: WattPerSquareMetre
subclass of: Restriction
  has value: 1e-06
subclass of: Restriction
  has value: 0e+00
alternative label: Microwatt Per Square Metre
qudtReference: http://qudt.org/vocab/unit/MicroW-PER-M2
ucumCode: uW.m-2
unitSymbol: µW/m²
EMMO 967080e5 2f42 4eb2 a3a9 c58143e835f9: 0.000001-fold of the SI derived unit watt divided by the power of the SI base unit metre with the exponent 2 -- QUDT

Mil
type: Class
comment: The Mil unit of plane angle, as defined by NATO to be 1/6400 of a circle. -- QUDT
subclass of: Restriction
  has value: 4.908739e-04
subclass of: Restriction
  has value: 0e+00
alternative label: Mil Angle (NATO)
qudtReference: http://qudt.org/vocab/unit/MIL
unitSymbol: mil{NATO}
EMMO 967080e5 2f42 4eb2 a3a9 c58143e835f9: The Mil unit of plane angle, as defined by NATO to be 1/6400 of a circle. -- QUDT

MilLength
type: Class
comment: "Mil Length" is a C.G.S System unit for 'Length' expressed as mil. -- QUDT
subclass of: Restriction
  has value: 2.54e-05
subclass of: Restriction
  has value: 0e+00
alternative label: Mil Length
qudtReference: http://qudt.org/vocab/unit/MilLength
ucumCode: [mil_i]
unitSymbol: mil
EMMO 967080e5 2f42 4eb2 a3a9 c58143e835f9: "Mil Length" is a C.G.S System unit for 'Length' expressed as mil. -- QUDT

MilePerHour
type: Class
comment: Miles per hour is an imperial unit of speed expressing the number of statute miles covered in one hour. It is currently the standard unit used for speed limits, and to express speeds generally, on roads in the United Kingdom and the United States. A common abbreviation is mph or MPH. -- QUDT
subclass of: Restriction
  has value: 4.4704e-01
subclass of: Restriction
  has value: 0e+00
alternative label: Mile per Hour
qudtReference: http://qudt.org/vocab/unit/MI-PER-HR
ucumCode: [mi_i].h-1
ucumCode: [mi_i]/h
unitSymbol: mi/hr
EMMO 967080e5 2f42 4eb2 a3a9 c58143e835f9: Miles per hour is an imperial unit of speed expressing the number of statute miles covered in one hour. It is currently the standard unit used for speed limits, and to express speeds generally, on roads in the United Kingdom and the United States. A common abbreviation is mph or MPH. -- QUDT
wikipediaReference: http://en.wikipedia.org/wiki/Miles_per_hour

MilePerMinute
type: Class
comment: Miles per minute is an imperial unit of speed expressing the number of statute miles covered in one minute. -- QUDT
subclass of: Restriction
  has value: 2.68224e+01
subclass of: Restriction
  has value: 0e+00
alternative label: Mile per Minute
qudtReference: http://qudt.org/vocab/unit/MI-PER-MIN
ucumCode: [mi_i].min-1
ucumCode: [mi_i]/min
unitSymbol: mi/min
EMMO 967080e5 2f42 4eb2 a3a9 c58143e835f9: Miles per minute is an imperial unit of speed expressing the number of statute miles covered in one minute. -- QUDT

MilePerSecond
type: Class
comment: Miles per second is an imperial unit of speed expressing the number of statute miles covered in one second. -- QUDT
subclass of: Restriction
  has value: 1.609344e+03
subclass of: Restriction
  has value: 0e+00
alternative label: Mile per Second
qudtReference: http://qudt.org/vocab/unit/MI-PER-SEC
ucumCode: [mi_i].sec-1
ucumCode: [mi_i]/sec
unitSymbol: mi/sec
EMMO 967080e5 2f42 4eb2 a3a9 c58143e835f9: Miles per second is an imperial unit of speed expressing the number of statute miles covered in one second. -- QUDT

MileUsStatute
type: Class
comment: The exact length of the land mile varied slightly among English-speaking countries until the international yard and pound agreement in 1959 established the yard as exactly 0.9144 metres, giving a mile of exactly 1,609.344 metres. The United States adopted this international mile for most purposes, but retained the pre-1959 mile for some land-survey data, terming it the US survey mile. In the US, statute mile formally refers to the survey mile, about 3.219 mm (1/8 inch) longer than the international mile (the international mile is exactly 0.0002% less than the US survey mile). -- QUDT
subclass of: Restriction
  has value: 1.609347e+03
subclass of: Restriction
  has value: 0e+00
alternative label: Mile US Statute
qudtReference: http://qudt.org/vocab/unit/MI_US
ucumCode: [mi_us]
unitSymbol: mi{US}
EMMO 967080e5 2f42 4eb2 a3a9 c58143e835f9: The exact length of the land mile varied slightly among English-speaking countries until the international yard and pound agreement in 1959 established the yard as exactly 0.9144 metres, giving a mile of exactly 1,609.344 metres. The United States adopted this international mile for most purposes, but retained the pre-1959 mile for some land-survey data, terming it the US survey mile. In the US, statute mile formally refers to the survey mile, about 3.219 mm (1/8 inch) longer than the international mile (the international mile is exactly 0.0002% less than the US survey mile). -- QUDT
wikipediaReference: http://en.wikipedia.org/wiki/Mile

MilliAmpere
type: Class
comment: A milliampere is 0.001 A
subclass of: Restriction
  some values from: Ampere
subclass of: Restriction
  has value: 1e-03
subclass of: Restriction
  has value: 0e+00
alternative label: milliampere
qudtReference: http://qudt.org/vocab/unit/MilliA
ucumCode: mA
unitSymbol: mA
EMMO 967080e5 2f42 4eb2 a3a9 c58143e835f9: A milliampere is 0.001 A

MilliAmpereHour
type: Class
comment: product of the 0.001-fold of the SI base unit ampere and the unit hour -- QUDT
subclass of: Restriction
  has value: 3.6e+00
subclass of: Restriction
  has value: 0e+00
alternative label: Milliampere Hour
qudtReference: http://qudt.org/vocab/unit/MilliA-HR
ucumCode: mA.h
unitSymbol: µA⋅h
EMMO 967080e5 2f42 4eb2 a3a9 c58143e835f9: product of the 0.001-fold of the SI base unit ampere and the unit hour -- QUDT

MilliAmpereHourPerGram
type: Class
comment: `Milliampere hour per gram` is a practical unit of electric charge relative to the mass of the (active) parts. 1mAh/g describes the capability of a material to store charge equivalent to 1h charge with 1mA per gram. The unit is often used in electrochemistry to describe the properties of active components like electrodes. -- QUDT
subclass of: Restriction
  has value: 0e+00
subclass of: Restriction
  has value: 3.6e+03
alternative label: Milliampere Hour per Gram
qudtReference: http://qudt.org/vocab/unit/MilliA-HR-PER-GM
unitSymbol: mA⋅h/g
EMMO 967080e5 2f42 4eb2 a3a9 c58143e835f9: `Milliampere hour per gram` is a practical unit of electric charge relative to the mass of the (active) parts. 1mAh/g describes the capability of a material to store charge equivalent to 1h charge with 1mA per gram. The unit is often used in electrochemistry to describe the properties of active components like electrodes. -- QUDT

MilliAmpereHourPerSquareCentiMetre
type: Class
comment: unit of areic capacity
subclass of: Restriction
  has value: 3.6e+10
subclass of: Restriction
  has value: 0e+00
ucumCode: mA.h.cm-2
unitSymbol: mA⋅h/cm²
EMMO 967080e5 2f42 4eb2 a3a9 c58143e835f9: unit of areic capacity

MilliAmperePerGram
type: Class
comment: a unit of electric current per mass
subclass of: Restriction
  has value: 1e+00
subclass of: Restriction
  has value: 0e+00
unitSymbol: mA/g
EMMO 967080e5 2f42 4eb2 a3a9 c58143e835f9: a unit of electric current per mass

MilliAmperePerInch
type: Class
comment: 0.001-fold of the SI base unit ampere divided by the unit inch according to the Anglo-American and the Imperial system of units -- QUDT
subclass of: Restriction
  has value: 0e+00
subclass of: Restriction
  has value: 3.937008e-02
alternative label: Milliampere Per Inch
qudtReference: http://qudt.org/vocab/unit/MilliA-PER-IN
ucumCode: mA.[in_i]-1
unitSymbol: µA/in
EMMO 967080e5 2f42 4eb2 a3a9 c58143e835f9: 0.001-fold of the SI base unit ampere divided by the unit inch according to the Anglo-American and the Imperial system of units -- QUDT

MilliAmperePerMilliMetre
type: Class
comment: 0.001-fold of the SI base unit ampere divided by the 0.001-fold of the SI base unit metre -- QUDT
subclass of: Restriction
  some values from: AmperePerMilliMetre
subclass of: Restriction
  has value: 1e+00
subclass of: Restriction
  has value: 0e+00
alternative label: Milliampere Per Millimetre
qudtReference: http://qudt.org/vocab/unit/MilliA-PER-MilliM
ucumCode: mA.mm-1
unitSymbol: mA/mm
EMMO 967080e5 2f42 4eb2 a3a9 c58143e835f9: 0.001-fold of the SI base unit ampere divided by the 0.001-fold of the SI base unit metre -- QUDT

MilliAmperePerSquareCentiMetre
type: Class
comment: 0.001-fold of the SI base unit ampere divided by the 0.0001-fold of the power of the SI base unit metre by exponent 2
subclass of: Restriction
  has value: 0e+00
subclass of: Restriction
  has value: 1e+01
unitSymbol: mA/cm²
EMMO 967080e5 2f42 4eb2 a3a9 c58143e835f9: 0.001-fold of the SI base unit ampere divided by the 0.0001-fold of the power of the SI base unit metre by exponent 2

MilliArcsecond
type: Class
comment: A minute of arc, arcminute, or minute arc (MOA), is a unit of angular measurement equal to one sixtieth (1/60) of one degree (circle/21,600), or π /10,800 radians. In turn, a second of arc or arcsecond is one sixtieth (1/60) of one minute of arc. Since one degree is defined as one three hundred and sixtieth (1/360) of a rotation, one minute of arc is 1/21,600 of a rotation. the milliarcsecond, abbreviated mas, is used in astronomy. -- QUDT
subclass of: Restriction
  has value: 4.848137e-09
subclass of: Restriction
  some values from: Arcsecond
subclass of: Restriction
  has value: 0e+00
alternative label: Milli ArcSecond
qudtReference: http://qudt.org/vocab/unit/MilliARCSEC
ucumCode: m''
unitSymbol: mas
EMMO 967080e5 2f42 4eb2 a3a9 c58143e835f9: A minute of arc, arcminute, or minute arc (MOA), is a unit of angular measurement equal to one sixtieth (1/60) of one degree (circle/21,600), or π /10,800 radians. In turn, a second of arc or arcsecond is one sixtieth (1/60) of one minute of arc. Since one degree is defined as one three hundred and sixtieth (1/360) of a rotation, one minute of arc is 1/21,600 of a rotation. the milliarcsecond, abbreviated mas, is used in astronomy. -- QUDT
wikipediaReference: http://en.wikipedia.org/wiki/Minute_of_arc

MilliBar
type: Class
comment: The bar is a non-SI unit of pressure, defined by the IUPAC as exactly equal to 100,000 Pa. It is about equal to the atmospheric pressure on Earth at sea level, and since 1982 the IUPAC has recommended that the standard for atmospheric pressure should be harmonized to 100,000 Pa = 1 bar ≈ 750.0616827 Torr. Units derived from the bar are the megabar (symbol: Mbar), kilobar (symbol: kbar), decibar (symbol: dbar), centibar (symbol: cbar), and millibar (symbol: mbar or mb). They are not SI or cgs units, but they are accepted for use with the SI. -- QUDT
subclass of: Restriction
  some values from: Bar
subclass of: Restriction
  has value: 1e+02
subclass of: Restriction
  has value: 0e+00
qudtReference: http://qudt.org/vocab/unit/MilliBAR
ucumCode: mbar
unitSymbol: mbar
EMMO 967080e5 2f42 4eb2 a3a9 c58143e835f9: The bar is a non-SI unit of pressure, defined by the IUPAC as exactly equal to 100,000 Pa. It is about equal to the atmospheric pressure on Earth at sea level, and since 1982 the IUPAC has recommended that the standard for atmospheric pressure should be harmonized to 100,000 Pa = 1 bar ≈ 750.0616827 Torr. Units derived from the bar are the megabar (symbol: Mbar), kilobar (symbol: kbar), decibar (symbol: dbar), centibar (symbol: cbar), and millibar (symbol: mbar or mb). They are not SI or cgs units, but they are accepted for use with the SI. -- QUDT
wikipediaReference: http://en.wikipedia.org/wiki/Bar_(unit)

MilliBarCubicMetrePerSecond
type: Class
comment: product of the unit bar and the power of the SI base unit metre with the exponent 3 divided by the SI base unit second -- QUDT
subclass of: Restriction
  some values from: BarCubicMetrePerSecond
subclass of: Restriction
  has value: 1e+02
subclass of: Restriction
  has value: 0e+00
alternative label: Millibar Cubic Metre Per Second
qudtReference: http://qudt.org/vocab/unit/MilliBAR-M3-PER-SEC
ucumCode: mbar.m3.s-1
unitSymbol: mbar⋅m³/s
EMMO 967080e5 2f42 4eb2 a3a9 c58143e835f9: product of the unit bar and the power of the SI base unit metre with the exponent 3 divided by the SI base unit second -- QUDT

MilliBarLitrePerSecond
type: Class
comment: product out of the 0.001-fold of the unit bar and the unit litre divided by the SI base unit second -- QUDT
subclass of: Restriction
  some values from: BarLitrePerSecond
subclass of: Restriction
  has value: 1e-01
subclass of: Restriction
  has value: 0e+00
alternative label: Millibar Litre Per Second
qudtReference: http://qudt.org/vocab/unit/MilliBAR-L-PER-SEC
ucumCode: mbar.L.s-1
unitSymbol: mbar⋅L/s
EMMO 967080e5 2f42 4eb2 a3a9 c58143e835f9: product out of the 0.001-fold of the unit bar and the unit litre divided by the SI base unit second -- QUDT

MilliBarPerBar
type: Class
comment: 0.01-fold of the unit bar divided by the unit bar -- QUDT
subclass of: Restriction
  some values from: BarPerBar
subclass of: Restriction
  has value: 1e-03
subclass of: Restriction
  has value: 0e+00
alternative label: Millibar Per Bar
qudtReference: http://qudt.org/vocab/unit/MilliBAR-PER-BAR
ucumCode: mbar.bar-1
unitSymbol: mbar/bar
EMMO 967080e5 2f42 4eb2 a3a9 c58143e835f9: 0.01-fold of the unit bar divided by the unit bar -- QUDT

MilliBarPerKelvin
type: Class
comment: 0.001-fold of the unit bar divided by the unit temperature kelvin -- QUDT
subclass of: Restriction
  has value: 1e+02
subclass of: Restriction
  some values from: BarPerKelvin
subclass of: Restriction
  has value: 0e+00
alternative label: Millibar Per Kelvin
qudtReference: http://qudt.org/vocab/unit/MilliBAR-PER-K
ucumCode: mbar.K-1
unitSymbol: mbar/K
EMMO 967080e5 2f42 4eb2 a3a9 c58143e835f9: 0.001-fold of the unit bar divided by the unit temperature kelvin -- QUDT

MilliBecquerel
type: Class
subclass of: Restriction
  has value: 1e-03
subclass of: Restriction
  some values from: Becquerel
subclass of: Restriction
  has value: 0e+00
qudtReference: http://qudt.org/vocab/unit/MilliBQ
unitSymbol: mBq

MilliBecquerelPerGram
type: Class
comment: One radioactive disintegration per thousand seconds per 1000th SI unit of sample mass. -- QUDT
subclass of: Restriction
  has value: 0e+00
subclass of: Restriction
  has value: 1e+00
alternative label: Millibecquerels per gram
qudtReference: http://qudt.org/vocab/unit/MilliBQ-PER-GM
ucumCode: mBq.g-1
unitSymbol: mBq/g
EMMO 967080e5 2f42 4eb2 a3a9 c58143e835f9: One radioactive disintegration per thousand seconds per 1000th SI unit of sample mass. -- QUDT

MilliBecquerelPerKilogram
type: Class
comment: One radioactive disintegration per thousand seconds from an SI standard unit of mass of sample. -- QUDT
subclass of: Restriction
  some values from: BecquerelPerKilogram
subclass of: Restriction
  has value: 1e-03
subclass of: Restriction
  has value: 0e+00
alternative label: Millibecquerels per kilogram
qudtReference: http://qudt.org/vocab/unit/MilliBQ-PER-KiloGM
ucumCode: mBq.kg-1
unitSymbol: mBq/kg
EMMO 967080e5 2f42 4eb2 a3a9 c58143e835f9: One radioactive disintegration per thousand seconds from an SI standard unit of mass of sample. -- QUDT

MilliBecquerelPerLitre
type: Class
comment: One radioactive disintegration per second from the SI unit of volume (cubic metre). Equivalent to Becquerels per cubic metre. -- QUDT
subclass of: Restriction
  some values from: BecquerelPerLitre
subclass of: Restriction
  has value: 1e+00
subclass of: Restriction
  has value: 0e+00
alternative label: Millibecquerels per litre
qudtReference: http://qudt.org/vocab/unit/MilliBQ-PER-L
ucumCode: mBq.L-1
unitSymbol: mBq/L
EMMO 967080e5 2f42 4eb2 a3a9 c58143e835f9: One radioactive disintegration per second from the SI unit of volume (cubic metre). Equivalent to Becquerels per cubic metre. -- QUDT

MilliBecquerelPerSquareMetrePerDay
type: Class
comment: One radioactive disintegration per thousand seconds in material passing through an area of one square metre during a period of one day (86400 seconds). -- QUDT
subclass of: Restriction
  has value: 1.157407e-08
subclass of: Restriction
  has value: 0e+00
alternative label: Millibecquerels per square metre per day
qudtReference: http://qudt.org/vocab/unit/MilliBQ-PER-M2-DAY
ucumCode: mBq.m-2.d-1
unitSymbol: mBq/(m²⋅day)
EMMO 967080e5 2f42 4eb2 a3a9 c58143e835f9: One radioactive disintegration per thousand seconds in material passing through an area of one square metre during a period of one day (86400 seconds). -- QUDT

MilliCoulomb
type: Class
comment: A MilliCoulomb is 10⁻³ C. -- QUDT
subclass of: Restriction
  some values from: Coulomb
subclass of: Restriction
  has value: 1e-03
subclass of: Restriction
  has value: 0e+00
qudtReference: http://qudt.org/vocab/unit/MilliC
ucumCode: mC
unitSymbol: mC
EMMO 967080e5 2f42 4eb2 a3a9 c58143e835f9: A MilliCoulomb is 10⁻³ C. -- QUDT

MilliCoulombPerCubicMetre
type: Class
comment: 0.001-fold of the SI derived unit coulomb divided by the power of the SI base unit metre with the exponent 3 -- QUDT
subclass of: Restriction
  has value: 1e-03
subclass of: Restriction
  some values from: CoulombPerCubicMetre
subclass of: Restriction
  has value: 0e+00
alternative label: Millicoulomb Per Cubic Metre
qudtReference: http://qudt.org/vocab/unit/MilliC-PER-M3
ucumCode: mC.m-3
unitSymbol: mC/m³
EMMO 967080e5 2f42 4eb2 a3a9 c58143e835f9: 0.001-fold of the SI derived unit coulomb divided by the power of the SI base unit metre with the exponent 3 -- QUDT

MilliCoulombPerKilogram
type: Class
comment: 0.001-fold of the SI derived unit coulomb divided by the SI base unit kilogram -- QUDT
subclass of: Restriction
  some values from: CoulombPerKilogram
subclass of: Restriction
  has value: 1e-03
subclass of: Restriction
  has value: 0e+00
alternative label: Millicoulomb Per Kilogram
qudtReference: http://qudt.org/vocab/unit/MilliC-PER-KiloGM
ucumCode: mC.kg-1
unitSymbol: mC/kg
EMMO 967080e5 2f42 4eb2 a3a9 c58143e835f9: 0.001-fold of the SI derived unit coulomb divided by the SI base unit kilogram -- QUDT

MilliCoulombPerSquareMetre
type: Class
comment: 0.001-fold of the SI derived unit coulomb divided by the power of the SI base unit metre with the exponent 2 -- QUDT
subclass of: Restriction
  some values from: CoulombPerSquareMetre
subclass of: Restriction
  has value: 1e-03
subclass of: Restriction
  has value: 0e+00
alternative label: Millicoulomb Per Square Metre
qudtReference: http://qudt.org/vocab/unit/MilliC-PER-M2
ucumCode: mC.m-2
unitSymbol: mC/m²
EMMO 967080e5 2f42 4eb2 a3a9 c58143e835f9: 0.001-fold of the SI derived unit coulomb divided by the power of the SI base unit metre with the exponent 2 -- QUDT

MilliCurie
type: Class
comment: 0.001-fold of the SI derived unit curie -- QUDT
subclass of: Restriction
  has value: 3.7e+07
subclass of: Restriction
  some values from: Curie
subclass of: Restriction
  has value: 0e+00
qudtReference: http://qudt.org/vocab/unit/MilliCi
ucumCode: mCi
unitSymbol: mCi
EMMO 967080e5 2f42 4eb2 a3a9 c58143e835f9: 0.001-fold of the SI derived unit curie -- QUDT

MilliDegreeCelsius
type: Class
comment: Millidegree Celsius is a scaled unit of measurement for temperature. -- QUDT
subclass of: Restriction
  has value: 2.7315e+02
subclass of: Restriction
  has value: 1e-03
subclass of: Restriction
  some values from: DegreeCelsius
alternative label: Millidegree Celsius
qudtReference: http://qudt.org/vocab/unit/MilliDEG_C
ucumCode: mCel
unitSymbol: m°C
EMMO 967080e5 2f42 4eb2 a3a9 c58143e835f9: Millidegree Celsius is a scaled unit of measurement for temperature. -- QUDT
wikipediaReference: http://en.wikipedia.org/wiki/Celsius

MilliFarad
type: Class
comment: 0.001-fold of the SI derived unit farad -- QUDT
subclass of: Restriction
  has value: 0e+00
subclass of: Restriction
  some values from: Farad
subclass of: Restriction
  has value: 1e-03
qudtReference: http://qudt.org/vocab/unit/MilliFARAD
ucumCode: mF
unitSymbol: mF
EMMO 967080e5 2f42 4eb2 a3a9 c58143e835f9: 0.001-fold of the SI derived unit farad -- QUDT

MilliGal
type: Class
comment: 0.001-fold of the unit of acceleration called gal according to the CGS system of units -- QUDT
subclass of: Restriction
  has value: 0e+00
subclass of: Restriction
  has value: 1e-05
qudtReference: http://qudt.org/vocab/unit/MilliGAL
ucumCode: mGal
unitSymbol: mgal
EMMO 967080e5 2f42 4eb2 a3a9 c58143e835f9: 0.001-fold of the unit of acceleration called gal according to the CGS system of units -- QUDT

MilliGalsPerMonth
type: Class
comment: A rate of change of one millionth part of a unit of gravitational acceleration equal to one centimetre per second per second over a time duration of 30.4375 days or 2629800 seconds. -- QUDT
subclass of: Restriction
  has value: 3.802571e-10
subclass of: Restriction
  has value: 0e+00
alternative label: MilliGals per month
qudtReference: http://qudt.org/vocab/unit/MilliGAL-PER-MO
ucumCode: mGal.mo-1
unitSymbol: mgal/mo
EMMO 967080e5 2f42 4eb2 a3a9 c58143e835f9: A rate of change of one millionth part of a unit of gravitational acceleration equal to one centimetre per second per second over a time duration of 30.4375 days or 2629800 seconds. -- QUDT

MilliGram
type: Class
comment: 0.000001-fold of the SI base unit kilogram -- QUDT
subclass of: Restriction
  some values from: Gram
subclass of: Restriction
  has value: 1e-06
subclass of: Restriction
  has value: 0e+00
qudtReference: http://qudt.org/vocab/unit/MilliGM
ucumCode: mg
unitSymbol: mg
EMMO 967080e5 2f42 4eb2 a3a9 c58143e835f9: 0.000001-fold of the SI base unit kilogram -- QUDT

MilliGramPerCubicMetre
type: Class
comment: 0.000001-fold of the SI base unit kilogram divided by the power of the SI base unit metre with the exponent 3 -- QUDT
subclass of: Restriction
  some values from: GramPerCubicMetre
subclass of: Restriction
  has value: 1e-06
subclass of: Restriction
  has value: 0e+00
alternative label: Milligram Per Cubic Metre
qudtReference: http://qudt.org/vocab/unit/MilliGM-PER-M3
ucumCode: mg.m-3
ucumCode: mg/m3
unitSymbol: mg/m³
EMMO 967080e5 2f42 4eb2 a3a9 c58143e835f9: 0.000001-fold of the SI base unit kilogram divided by the power of the SI base unit metre with the exponent 3 -- QUDT

MilliGramPerCubicMetrePerDay
type: Class
subclass of: Restriction
  has value: 1.157407e-11
subclass of: Restriction
  has value: 0e+00
alternative label: Milligrams per cubic metre per day
qudtReference: http://qudt.org/vocab/unit/MilliGM-PER-M3-DAY
ucumCode: mg.m-3.d-1
unitSymbol: mg/(m³⋅day)

MilliGramPerCubicMetrePerHour
type: Class
subclass of: Restriction
  has value: 2.777778e-10
subclass of: Restriction
  has value: 0e+00
alternative label: Milligrams per cubic metre per hour
qudtReference: http://qudt.org/vocab/unit/MilliGM-PER-M3-HR
ucumCode: mg.m-3.h-1
unitSymbol: mg/(m³⋅h)

MilliGramPerCubicMetrePerSecond
type: Class
subclass of: Restriction
  has value: 1e-06
subclass of: Restriction
  has value: 0e+00
alternative label: Milligrams per cubic metre per second
qudtReference: http://qudt.org/vocab/unit/MilliGM-PER-M3-SEC
ucumCode: mg.m-3.s-1
unitSymbol: mg/(m³⋅s)

MilliGramPerDay
type: Class
comment: 0.000001-fold of the SI base unit kilogram divided by the unit day -- QUDT
subclass of: Restriction
  some values from: GramPerDay
subclass of: Restriction
  has value: 1.157407e-11
subclass of: Restriction
  has value: 0e+00
alternative label: Milligram Per Day
qudtReference: http://qudt.org/vocab/unit/MilliGM-PER-DAY
ucumCode: mg.d-1
unitSymbol: mg/day
EMMO 967080e5 2f42 4eb2 a3a9 c58143e835f9: 0.000001-fold of the SI base unit kilogram divided by the unit day -- QUDT

MilliGramPerDeciLitre
type: Class
comment: A derived unit for amount-of-substance concentration measured in mg/dL. -- QUDT
subclass of: Restriction
  has value: 1e-02
subclass of: Restriction
  has value: 0e+00
alternative label: milligrams per decilitre
qudtReference: http://qudt.org/vocab/unit/MilliGM-PER-DeciL
ucumCode: mg.dL-1
unitSymbol: mg/L
EMMO 967080e5 2f42 4eb2 a3a9 c58143e835f9: A derived unit for amount-of-substance concentration measured in mg/dL. -- QUDT

MilliGramPerGram
type: Class
comment: 0.000001-fold of the SI base unit kilogram divided by the 0.001-fold of the SI base unit kilogram -- QUDT
subclass of: Restriction
  has value: 0e+00
subclass of: Restriction
  some values from: GramPerGram
subclass of: Restriction
  has value: 1e-03
alternative label: Milligram Per Gram
qudtReference: http://qudt.org/vocab/unit/MilliGM-PER-GM
ucumCode: mg.g-1
ucumCode: mg/g
unitSymbol: mg/gm
EMMO 967080e5 2f42 4eb2 a3a9 c58143e835f9: 0.000001-fold of the SI base unit kilogram divided by the 0.001-fold of the SI base unit kilogram -- QUDT

MilliGramPerHectare
type: Class
comment: 0.000001-fold of the SI base unit kilogram divided by the 10,0000-fold of the power of the SI base unit metre with the exponent 2 -- QUDT
subclass of: Restriction
  has value: 1e-10
subclass of: Restriction
  has value: 0e+00
alternative label: Milligram Per Hectare
qudtReference: http://qudt.org/vocab/unit/MilliGM-PER-HA
ucumCode: mg.har-1
unitSymbol: mg/ha
EMMO 967080e5 2f42 4eb2 a3a9 c58143e835f9: 0.000001-fold of the SI base unit kilogram divided by the 10,0000-fold of the power of the SI base unit metre with the exponent 2 -- QUDT

MilliGramPerHour
type: Class
comment: 0.000001-fold of the SI base unit kilogram divided by the unit hour -- QUDT
subclass of: Restriction
  some values from: GramPerHour
subclass of: Restriction
  has value: 2.777778e-10
subclass of: Restriction
  has value: 0e+00
alternative label: Milligram Per Hour
qudtReference: http://qudt.org/vocab/unit/MilliGM-PER-HR
ucumCode: mg.h-1
unitSymbol: mg/h
EMMO 967080e5 2f42 4eb2 a3a9 c58143e835f9: 0.000001-fold of the SI base unit kilogram divided by the unit hour -- QUDT

MilliGramPerKilogram
type: Class
comment: 0.000001-fold of the SI base unit kilogram divided by the SI base unit kilogram -- QUDT
subclass of: Restriction
  some values from: GramPerKilogram
subclass of: Restriction
  has value: 1e-06
subclass of: Restriction
  has value: 0e+00
alternative label: Milligram Per Kilogram
qudtReference: http://qudt.org/vocab/unit/MilliGM-PER-KiloGM
ucumCode: mg.kg-1
ucumCode: mg/kg
unitSymbol: mg/kg
EMMO 967080e5 2f42 4eb2 a3a9 c58143e835f9: 0.000001-fold of the SI base unit kilogram divided by the SI base unit kilogram -- QUDT

MilliGramPerLitre
type: Class
comment: 0.000001-fold of the SI base unit kilogram divided by the unit litre -- QUDT
subclass of: Restriction
  some values from: GramPerLitre
subclass of: Restriction
  has value: 1e-06
subclass of: Restriction
  has value: 0e+00
alternative label: Milligram Per Litre
qudtReference: http://qudt.org/vocab/unit/MilliGM-PER-L
ucumCode: mg.L-1
ucumCode: mg/L
unitSymbol: mg/L
EMMO 967080e5 2f42 4eb2 a3a9 c58143e835f9: 0.000001-fold of the SI base unit kilogram divided by the unit litre -- QUDT

MilliGramPerMetre
type: Class
comment: 0.000001-fold of the SI base unit kilogram divided by the SI base unit metre -- QUDT
subclass of: Restriction
  has value: 1e-06
subclass of: Restriction
  some values from: GramPerMetre
subclass of: Restriction
  has value: 0e+00
alternative label: Milligram Per Metre
qudtReference: http://qudt.org/vocab/unit/MilliGM-PER-M
ucumCode: mg.m-1
unitSymbol: mg/m
EMMO 967080e5 2f42 4eb2 a3a9 c58143e835f9: 0.000001-fold of the SI base unit kilogram divided by the SI base unit metre -- QUDT

MilliGramPerMilliLitre
type: Class
comment: 0.000001-fold of the SI base unit kilogram divided by the unit millilitre -- QUDT
subclass of: Restriction
  some values from: GramPerMilliLitre
subclass of: Restriction
  has value: 1e-06
subclass of: Restriction
  has value: 0e+00
alternative label: Milligram Per Millilitre
qudtReference: http://qudt.org/vocab/unit/MilliGM-PER-MilliL
ucumCode: mg.mL-1
ucumCode: mg/mL
unitSymbol: mg/mL
EMMO 967080e5 2f42 4eb2 a3a9 c58143e835f9: 0.000001-fold of the SI base unit kilogram divided by the unit millilitre -- QUDT

MilliGramPerMinute
type: Class
comment: 0.000001-fold of the SI base unit kilogram divided by the unit minute -- QUDT
subclass of: Restriction
  some values from: GramPerMinute
subclass of: Restriction
  has value: 1.666667e-08
subclass of: Restriction
  has value: 0e+00
alternative label: Milligram Per Minute
qudtReference: http://qudt.org/vocab/unit/MilliGM-PER-MIN
ucumCode: mg/min
unitSymbol: mg/min
EMMO 967080e5 2f42 4eb2 a3a9 c58143e835f9: 0.000001-fold of the SI base unit kilogram divided by the unit minute -- QUDT

MilliGramPerSecond
type: Class
comment: 0.000001-fold of the SI base unit kilogram divided by the SI base unit second -- QUDT
subclass of: Restriction
  has value: 1e-06
subclass of: Restriction
  some values from: GramPerSecond
subclass of: Restriction
  has value: 0e+00
alternative label: Milligram Per Second
qudtReference: http://qudt.org/vocab/unit/MilliGM-PER-SEC
ucumCode: mg/s
unitSymbol: mg/s
EMMO 967080e5 2f42 4eb2 a3a9 c58143e835f9: 0.000001-fold of the SI base unit kilogram divided by the SI base unit second -- QUDT

MilliGramPerSquareCentiMetre
type: Class
comment: 0.000001-fold of the SI base unit kilogram divided by the 0.0001-fold of the power of the SI base unit metre with the exponent 2 -- QUDT
subclass of: Restriction
  has value: 0e+00
subclass of: Restriction
  some values from: GramPerSquareCentiMetre
subclass of: Restriction
  has value: 1e-02
alternative label: Milligram Per Square Centimetre
qudtReference: http://qudt.org/vocab/unit/MilliGM-PER-CentiM2
ucumCode: mg.cm-2
unitSymbol: mg/cm²
EMMO 967080e5 2f42 4eb2 a3a9 c58143e835f9: 0.000001-fold of the SI base unit kilogram divided by the 0.0001-fold of the power of the SI base unit metre with the exponent 2 -- QUDT

MilliGramPerSquareMetre
type: Class
comment: 0.000001-fold of the SI base unit kilogram divided by the power of the SI base unit metre with the exponent 2 -- QUDT
subclass of: Restriction
  some values from: GramPerSquareMetre
subclass of: Restriction
  has value: 1e-06
subclass of: Restriction
  has value: 0e+00
alternative label: Milligram Per Square Metre
qudtReference: http://qudt.org/vocab/unit/MilliGM-PER-M2
ucumCode: mg.m-2
ucumCode: mg/m2
unitSymbol: mg/m²
EMMO 967080e5 2f42 4eb2 a3a9 c58143e835f9: 0.000001-fold of the SI base unit kilogram divided by the power of the SI base unit metre with the exponent 2 -- QUDT

MilliGramPerSquareMetrePerDay
type: Class
subclass of: Restriction
  some values from: GramPerSquareMetrePerDay
subclass of: Restriction
  has value: 1.157407e-11
subclass of: Restriction
  has value: 0e+00
alternative label: Milligrams per square metre per day
qudtReference: http://qudt.org/vocab/unit/MilliGM-PER-M2-DAY
ucumCode: mg.m-2.d-1
unitSymbol: mg/(m²⋅day)

MilliGramPerSquareMetrePerHour
type: Class
subclass of: Restriction
  has value: 2.777778e-10
subclass of: Restriction
  has value: 0e+00
alternative label: Milligrams per square metre per hour
qudtReference: http://qudt.org/vocab/unit/MilliGM-PER-M2-HR
ucumCode: mg.m-2.h-1
unitSymbol: mg/(m²⋅h)

MilliGramPerSquareMetrePerSecond
type: Class
subclass of: Restriction
  has value: 1e-06
subclass of: Restriction
  has value: 0e+00
alternative label: Milligrams per square metre per second
qudtReference: http://qudt.org/vocab/unit/MilliGM-PER-M2-SEC
ucumCode: mg.m-2.s-1
unitSymbol: mg/(m²⋅s)

MilliGravity
type: Class
comment: "Milligravity" is a unit for 'Linear Acceleration' expressed as mG. -- QUDT
subclass of: Restriction
  some values from: Gravity
subclass of: Restriction
  has value: 9.80665e-03
subclass of: Restriction
  has value: 0e+00
qudtReference: http://qudt.org/vocab/unit/MilliG
ucumCode: m[g]
unitSymbol: mG
EMMO 967080e5 2f42 4eb2 a3a9 c58143e835f9: "Milligravity" is a unit for 'Linear Acceleration' expressed as mG. -- QUDT

MilliGray
type: Class
comment: 0.001-fold of the SI derived unit gray -- QUDT
subclass of: Restriction
  some values from: Gray
subclass of: Restriction
  has value: 1e-03
subclass of: Restriction
  has value: 0e+00
qudtReference: http://qudt.org/vocab/unit/MilliGRAY
ucumCode: mGy
unitSymbol: mGy
EMMO 967080e5 2f42 4eb2 a3a9 c58143e835f9: 0.001-fold of the SI derived unit gray -- QUDT

MilliHenry
type: Class
comment: A unit of inductance equal to one thousandth of a henry. -- QUDT
subclass of: Restriction
  some values from: Henry
subclass of: Restriction
  has value: 1e-03
subclass of: Restriction
  has value: 0e+00
qudtReference: http://qudt.org/vocab/unit/MilliH
ucumCode: mH
unitSymbol: mH
EMMO 967080e5 2f42 4eb2 a3a9 c58143e835f9: A unit of inductance equal to one thousandth of a henry. -- QUDT

MilliHenryPerKiloOhm
type: Class
comment: 0.001-fold of the SI derived unit henry divided by the 1 000-fold of the SI derived unit ohm -- QUDT
subclass of: Restriction
  some values from: HenryPerKiloOhm
subclass of: Restriction
  has value: 1e-06
subclass of: Restriction
  has value: 0e+00
alternative label: Millihenry Per Kiloohm
qudtReference: http://qudt.org/vocab/unit/MilliH-PER-KiloOHM
ucumCode: mH.kOhm-1
unitSymbol: mH/kΩ
EMMO 967080e5 2f42 4eb2 a3a9 c58143e835f9: 0.001-fold of the SI derived unit henry divided by the 1 000-fold of the SI derived unit ohm -- QUDT

MilliHenryPerOhm
type: Class
comment: 0.001-fold of the SI derived unit henry divided by the SI derived unit ohm -- QUDT
subclass of: Restriction
  has value: 1e-03
subclass of: Restriction
  some values from: HenryPerOhm
subclass of: Restriction
  has value: 0e+00
alternative label: Millihenry Per Ohm
qudtReference: http://qudt.org/vocab/unit/MilliH-PER-OHM
ucumCode: mH.Ohm-1
unitSymbol: mH/Ω
EMMO 967080e5 2f42 4eb2 a3a9 c58143e835f9: 0.001-fold of the SI derived unit henry divided by the SI derived unit ohm -- QUDT

MilliInch
type: Class
comment: 0.001-fold of the unit inch according to the Anglo-American and Imperial system of units -- QUDT
subclass of: Restriction
  has value: 2.54e-05
subclass of: Restriction
  has value: 0e+00
alternative label: Milli-inch
qudtReference: http://qudt.org/vocab/unit/MilliIN
ucumCode: m[in_i]
unitSymbol: mil
EMMO 967080e5 2f42 4eb2 a3a9 c58143e835f9: 0.001-fold of the unit inch according to the Anglo-American and Imperial system of units -- QUDT

MilliJoule
type: Class
comment: 0.001-fold of the SI derived unit joule -- QUDT
subclass of: Restriction
  some values from: Joule
subclass of: Restriction
  has value: 1e-03
subclass of: Restriction
  has value: 0e+00
qudtReference: http://qudt.org/vocab/unit/MilliJ
ucumCode: mJ
unitSymbol: mJ
EMMO 967080e5 2f42 4eb2 a3a9 c58143e835f9: 0.001-fold of the SI derived unit joule -- QUDT

MilliLitre
type: Class
comment: 0.001-fold of the unit litre -- QUDT
subclass of: Restriction
  some values from: Litre
subclass of: Restriction
  has value: 1e-06
subclass of: Restriction
  has value: 0e+00
qudtReference: http://qudt.org/vocab/unit/MilliL
ucumCode: mL
unitSymbol: mL
EMMO 967080e5 2f42 4eb2 a3a9 c58143e835f9: 0.001-fold of the unit litre -- QUDT

MilliLitrePerCubicMetre
type: Class
comment: 0.001-fold of the unit litre divided by the power of the SI base unit metre with the exponent 3 -- QUDT
subclass of: Restriction
  has value: 1e-06
subclass of: Restriction
  has value: 0e+00
alternative label: Millilitre Per Cubic Metre
qudtReference: http://qudt.org/vocab/unit/MilliL-PER-M3
ucumCode: mL.m-3
ucumCode: mL/m3
unitSymbol: mL/m³
EMMO 967080e5 2f42 4eb2 a3a9 c58143e835f9: 0.001-fold of the unit litre divided by the power of the SI base unit metre with the exponent 3 -- QUDT

MilliLitrePerDay
type: Class
comment: 0.001-fold of the unit litre divided by the unit day -- QUDT
subclass of: Restriction
  has value: 0e+00
subclass of: Restriction
  some values from: LitrePerDay
subclass of: Restriction
  has value: 1.157407e-11
alternative label: Millilitre Per Day
qudtReference: http://qudt.org/vocab/unit/MilliL-PER-DAY
ucumCode: mL.d-1
unitSymbol: mL/day
EMMO 967080e5 2f42 4eb2 a3a9 c58143e835f9: 0.001-fold of the unit litre divided by the unit day -- QUDT

MilliLitrePerHour
type: Class
comment: 0.001-fold of the unit litre divided by the unit hour -- QUDT
subclass of: Restriction
  has value: 0e+00
subclass of: Restriction
  some values from: LitrePerHour
subclass of: Restriction
  has value: 2.777778e-10
alternative label: Millilitre Per Hour
qudtReference: http://qudt.org/vocab/unit/MilliL-PER-HR
ucumCode: mL.h-1
unitSymbol: mL/h
EMMO 967080e5 2f42 4eb2 a3a9 c58143e835f9: 0.001-fold of the unit litre divided by the unit hour -- QUDT

MilliLitrePerKelvin
type: Class
comment: 0.001-fold of the unit litre divided by the SI base unit kelvin -- QUDT
subclass of: Restriction
  some values from: LitrePerKelvin
subclass of: Restriction
  has value: 1e-06
subclass of: Restriction
  has value: 0e+00
alternative label: Millilitre Per Kelvin
qudtReference: http://qudt.org/vocab/unit/MilliL-PER-K
ucumCode: mL.K-1
unitSymbol: mL/K
EMMO 967080e5 2f42 4eb2 a3a9 c58143e835f9: 0.001-fold of the unit litre divided by the SI base unit kelvin -- QUDT

MilliLitrePerKilogram
type: Class
comment: 0.001-fold of the unit of the volume litre divided by the SI base unit kilogram -- QUDT
subclass of: Restriction
  some values from: LitrePerKilogram
subclass of: Restriction
  has value: 1e-06
subclass of: Restriction
  has value: 0e+00
alternative label: Millilitre Per Kilogram
qudtReference: http://qudt.org/vocab/unit/MilliL-PER-KiloGM
ucumCode: mL.kg-1
ucumCode: mL/kg
unitSymbol: mL/kg
EMMO 967080e5 2f42 4eb2 a3a9 c58143e835f9: 0.001-fold of the unit of the volume litre divided by the SI base unit kilogram -- QUDT

MilliLitrePerLitre
type: Class
comment: volume ratio consisting of the 0.001-fold of the unit litre divided by the unit litre -- QUDT
subclass of: Restriction
  some values from: LitrePerLitre
subclass of: Restriction
  has value: 1e-03
subclass of: Restriction
  has value: 0e+00
alternative label: Millilitre Per Litre
qudtReference: http://qudt.org/vocab/unit/MilliL-PER-L
ucumCode: mL.L-1
ucumCode: mL/L
unitSymbol: mL/L
EMMO 967080e5 2f42 4eb2 a3a9 c58143e835f9: volume ratio consisting of the 0.001-fold of the unit litre divided by the unit litre -- QUDT

MilliLitrePerMinute
type: Class
comment: 0.001-fold of the unit litre divided by the unit minute -- QUDT
subclass of: Restriction
  some values from: LitrePerMinute
subclass of: Restriction
  has value: 1.666667e-08
subclass of: Restriction
  has value: 0e+00
alternative label: Millilitre Per Minute
qudtReference: http://qudt.org/vocab/unit/MilliL-PER-MIN
ucumCode: mL.min-1
ucumCode: mL/min
unitSymbol: mL/min
EMMO 967080e5 2f42 4eb2 a3a9 c58143e835f9: 0.001-fold of the unit litre divided by the unit minute -- QUDT

MilliLitrePerSecond
type: Class
comment: 0.001-fold of the unit litre divided by the SI base unit second -- QUDT
subclass of: Restriction
  some values from: LitrePerSecond
subclass of: Restriction
  has value: 1e-06
subclass of: Restriction
  has value: 0e+00
alternative label: Millilitre Per Second
qudtReference: http://qudt.org/vocab/unit/MilliL-PER-SEC
ucumCode: mL.s-1
unitSymbol: mL/s
EMMO 967080e5 2f42 4eb2 a3a9 c58143e835f9: 0.001-fold of the unit litre divided by the SI base unit second -- QUDT

MilliLitrePerSquareCentiMetreMinute
type: Class
comment: quotient of the 0.001-fold of the unit litre and the unit minute divided by the 0.0001-fold of the power of the SI base unit metre with the exponent 2 -- QUDT
subclass of: Restriction
  has value: 1.666667e-04
subclass of: Restriction
  has value: 0e+00
alternative label: Millilitre Per Square Centimetre Minute
qudtReference: http://qudt.org/vocab/unit/MilliL-PER-CentiM2-MIN
ucumCode: mL.cm-2
unitSymbol: mL/(cm²⋅min)
EMMO 967080e5 2f42 4eb2 a3a9 c58143e835f9: quotient of the 0.001-fold of the unit litre and the unit minute divided by the 0.0001-fold of the power of the SI base unit metre with the exponent 2 -- QUDT

MilliLitrePerSquareCentiMetreSecond
type: Class
comment: unit of the volume flow rate millilitre divided by second related to the transfer area as 0.0001-fold of the power of the SI base unit metre by exponent 2 -- QUDT
subclass of: Restriction
  has value: 1e-02
subclass of: Restriction
  has value: 0e+00
alternative label: Millilitre Per Square Centimetre Second
qudtReference: http://qudt.org/vocab/unit/MilliL-PER-CentiM2-SEC
ucumCode: mL.cm-2.s-1
unitSymbol: mL/(cm²⋅s)
EMMO 967080e5 2f42 4eb2 a3a9 c58143e835f9: unit of the volume flow rate millilitre divided by second related to the transfer area as 0.0001-fold of the power of the SI base unit metre by exponent 2 -- QUDT

MilliLitrePerSquareMetrePerDay
type: Class
subclass of: Restriction
  has value: 1.157407e-11
subclass of: Restriction
  has value: 0e+00
alternative label: Millilitres per square metre per day
qudtReference: http://qudt.org/vocab/unit/MilliL-PER-M2-DAY
ucumCode: mL.m-2.d-1
unitSymbol: mL/(m²⋅day)

MilliMetre
type: Class
comment: The millimetre (International spelling as used by the International Bureau of Weights and Measures) or millimeter (American spelling) (SI unit symbol mm) is a unit of length in the metric system, equal to one thousandth of a metre, which is the SI base unit of length. It is equal to 1000 micrometres or 1000000 nanometres. A millimetre is equal to exactly 5/127 (approximately 0.039370) of an inch. -- QUDT
subclass of: Restriction
  some values from: Metre
subclass of: Restriction
  has value: 1e-03
subclass of: Restriction
  has value: 0e+00
qudtReference: http://qudt.org/vocab/unit/MilliM
ucumCode: mm
unitSymbol: mm
EMMO 967080e5 2f42 4eb2 a3a9 c58143e835f9: The millimetre (International spelling as used by the International Bureau of Weights and Measures) or millimeter (American spelling) (SI unit symbol mm) is a unit of length in the metric system, equal to one thousandth of a metre, which is the SI base unit of length. It is equal to 1000 micrometres or 1000000 nanometres. A millimetre is equal to exactly 5/127 (approximately 0.039370) of an inch. -- QUDT
wikipediaReference: http://en.wikipedia.org/wiki/Millimetre

MilliMetreOfMercury
type: Class
comment: The millimeter of mercury is defined as the pressure exerted at the base of a column of fluid exactly 1 mm high, when the density of the fluid is exactly 13.5951 g/cm³, at a place where the acceleration of gravity is exactly 9.80665 m/s². -- QUDT
subclass of: Restriction
  has value: 1.333224e+02
subclass of: Restriction
  has value: 0e+00
alternative label: Millimetre of Mercury
qudtReference: http://qudt.org/vocab/unit/MilliM_HG
ucumCode: mm[Hg]
unitSymbol: mmHg
EMMO 967080e5 2f42 4eb2 a3a9 c58143e835f9: The millimeter of mercury is defined as the pressure exerted at the base of a column of fluid exactly 1 mm high, when the density of the fluid is exactly 13.5951 g/cm³, at a place where the acceleration of gravity is exactly 9.80665 m/s². -- QUDT
wikipediaReference: http://en.wikipedia.org/wiki/Torr

MilliMetreOfMercury_Absolute
type: Class
comment: Millimeters of Mercury inclusive of atmospheric pressure -- QUDT
alternative label: Millimetre of Mercury - Absolute
qudtReference: http://qudt.org/vocab/unit/MilliM_HGA
ucumCode: mm[Hg]{absolute}
unitSymbol: mmHgA
EMMO 967080e5 2f42 4eb2 a3a9 c58143e835f9: Millimeters of Mercury inclusive of atmospheric pressure -- QUDT

MilliMetrePerDay
type: Class
comment: A measure of change in depth over time for a specific area, typically used to express precipitation intensity or evaporation (the amount of liquid water evaporated per unit of time from the area) -- QUDT
subclass of: Restriction
  has value: 1.15741e-08
subclass of: Restriction
  has value: 0e+00
alternative label: millimetres per day
qudtReference: http://qudt.org/vocab/unit/MilliM-PER-DAY
ucumCode: mm.d-1
ucumCode: mm/d
unitSymbol: mm/day
EMMO 967080e5 2f42 4eb2 a3a9 c58143e835f9: A measure of change in depth over time for a specific area, typically used to express precipitation intensity or evaporation (the amount of liquid water evaporated per unit of time from the area) -- QUDT

MilliMetrePerHour
type: Class
comment: 0001-fold of the SI base unit metre divided by the unit hour -- QUDT
subclass of: Restriction
  some values from: MetrePerHour
subclass of: Restriction
  has value: 2.777778e-07
subclass of: Restriction
  has value: 0e+00
alternative label: Millimetre Per Hour
qudtReference: http://qudt.org/vocab/unit/MilliM-PER-HR
ucumCode: mm.h-1
ucumCode: mm/h
unitSymbol: mm/h
EMMO 967080e5 2f42 4eb2 a3a9 c58143e835f9: 0001-fold of the SI base unit metre divided by the unit hour -- QUDT

MilliMetrePerKelvin
type: Class
comment: 0.001-fold of the SI base unit metre divided by the SI base unit kelvin -- QUDT
subclass of: Restriction
  some values from: MetrePerKelvin
subclass of: Restriction
  has value: 1e-03
subclass of: Restriction
  has value: 0e+00
alternative label: Millimetre Per Kelvin
qudtReference: http://qudt.org/vocab/unit/MilliM-PER-K
ucumCode: mm.K-1
unitSymbol: mm/K
EMMO 967080e5 2f42 4eb2 a3a9 c58143e835f9: 0.001-fold of the SI base unit metre divided by the SI base unit kelvin -- QUDT

MilliMetrePerMinute
type: Class
comment: 0.001-fold of the SI base unit metre divided by the unit minute -- QUDT
subclass of: Restriction
  has value: 1.666667e-05
subclass of: Restriction
  some values from: MetrePerMinute
subclass of: Restriction
  has value: 0e+00
alternative label: Millimetre Per Minute
qudtReference: http://qudt.org/vocab/unit/MilliM-PER-MIN
ucumCode: mm.min-1
ucumCode: mm/min
unitSymbol: mm/min
EMMO 967080e5 2f42 4eb2 a3a9 c58143e835f9: 0.001-fold of the SI base unit metre divided by the unit minute -- QUDT

MilliMetrePerSecond
type: Class
comment: 0.001-fold of the SI base unit metre divided by the SI base unit second -- QUDT
subclass of: Restriction
  some values from: MetrePerSecond
subclass of: Restriction
  has value: 1e-03
subclass of: Restriction
  has value: 0e+00
alternative label: Millimetre Per Second
qudtReference: http://qudt.org/vocab/unit/MilliM-PER-SEC
ucumCode: mm.s-1
unitSymbol: mm/s
EMMO 967080e5 2f42 4eb2 a3a9 c58143e835f9: 0.001-fold of the SI base unit metre divided by the SI base unit second -- QUDT

MilliMetrePerYear
type: Class
comment: 0.001-fold of the SI base unit metre divided by the unit year -- QUDT
subclass of: Restriction
  some values from: MetrePerYear
subclass of: Restriction
  has value: 1.71e-12
subclass of: Restriction
  has value: 0e+00
alternative label: Millimetre Per Year
qudtReference: http://qudt.org/vocab/unit/MilliM-PER-YR
ucumCode: mm.a-1
ucumCode: mm/a
unitSymbol: mm/yr
EMMO 967080e5 2f42 4eb2 a3a9 c58143e835f9: 0.001-fold of the SI base unit metre divided by the unit year -- QUDT

MilliMole
type: Class
comment: 0.001-fold of the SI base unit mol -- QUDT
subclass of: Restriction
  has value: 0e+00
subclass of: Restriction
  some values from: Mole
subclass of: Restriction
  has value: 1e-03
qudtReference: http://qudt.org/vocab/unit/MilliMOL
ucumCode: mmol
unitSymbol: mmol
EMMO 967080e5 2f42 4eb2 a3a9 c58143e835f9: 0.001-fold of the SI base unit mol -- QUDT

MilliMolePerCubicMetre
type: Class
comment: Unavailable. -- QUDT
subclass of: Restriction
  has value: 1e-03
subclass of: Restriction
  some values from: MolePerCubicMetre
subclass of: Restriction
  has value: 0e+00
alternative label: Millimoles per cubic metre
qudtReference: http://qudt.org/vocab/unit/MilliMOL-PER-M3
ucumCode: mmol.m-3
unitSymbol: mmol/m³
EMMO 967080e5 2f42 4eb2 a3a9 c58143e835f9: Unavailable. -- QUDT

MilliMolePerCubicMetrePerDay
type: Class
comment: Unavailable. -- QUDT
subclass of: Restriction
  has value: 1.157407e-08
subclass of: Restriction
  has value: 0e+00
alternative label: Millimoles per cubic metre per day
qudtReference: http://qudt.org/vocab/unit/MilliMOL-PER-M3-DAY
ucumCode: mmol.m-3.d-1
unitSymbol: mmol/(m³⋅day)
EMMO 967080e5 2f42 4eb2 a3a9 c58143e835f9: Unavailable. -- QUDT

MilliMolePerGram
type: Class
comment: 0.001-fold of the SI base unit mol divided by the 0.001-fold of the SI base unit kilogram -- QUDT
subclass of: Restriction
  has value: 1e+00
subclass of: Restriction
  has value: 0e+00
alternative label: Millimole Per Gram
qudtReference: http://qudt.org/vocab/unit/MilliMOL-PER-GM
ucumCode: mmol.g-1
unitSymbol: mmol/g
EMMO 967080e5 2f42 4eb2 a3a9 c58143e835f9: 0.001-fold of the SI base unit mol divided by the 0.001-fold of the SI base unit kilogram -- QUDT

MilliMolePerKilogram
type: Class
comment: 0.001-fold of the SI base unit mol divided by the SI base unit kilogram -- QUDT
subclass of: Restriction
  has value: 0e+00
subclass of: Restriction
  has value: 1e-03
alternative label: Millimole Per Kilogram
qudtReference: http://qudt.org/vocab/unit/MilliMOL-PER-KiloGM
ucumCode: mmol.kg-1
ucumCode: mmol/kg
unitSymbol: mmol/kg
EMMO 967080e5 2f42 4eb2 a3a9 c58143e835f9: 0.001-fold of the SI base unit mol divided by the SI base unit kilogram -- QUDT

MilliMolePerLitre
type: Class
comment: The SI derived unit for amount-of-substance concentration is the mmo/L. -- QUDT
subclass of: Restriction
  some values from: MolePerLitre
subclass of: Restriction
  has value: 1e+00
subclass of: Restriction
  has value: 0e+00
alternative label: millimoles per litre
qudtReference: http://qudt.org/vocab/unit/MilliMOL-PER-L
ucumCode: mmol.L-1
ucumCode: mmol/L
unitSymbol: mmo/L
EMMO 967080e5 2f42 4eb2 a3a9 c58143e835f9: The SI derived unit for amount-of-substance concentration is the mmo/L. -- QUDT

MilliMolePerMole
type: Class
subclass of: Restriction
  has value: 1e-03
subclass of: Restriction
  has value: 0e+00
alternative label: Millimoles per mole
qudtReference: http://qudt.org/vocab/unit/MilliMOL-PER-MOL
ucumCode: mmol.mol-1
unitSymbol: mmol/mol

MilliMolePerSquareMetre
type: Class
comment: Unavailable. -- QUDT
subclass of: Restriction
  some values from: MolePerSquareMetre
subclass of: Restriction
  has value: 1e-03
subclass of: Restriction
  has value: 0e+00
alternative label: Millimoles per square metre
qudtReference: http://qudt.org/vocab/unit/MilliMOL-PER-M2
ucumCode: mmol.m-2
unitSymbol: mmol/m²
EMMO 967080e5 2f42 4eb2 a3a9 c58143e835f9: Unavailable. -- QUDT

MilliMolePerSquareMetrePerDay
type: Class
subclass of: Restriction
  some values from: MolePerSquareMetrePerDay
subclass of: Restriction
  has value: 1.157407e-08
subclass of: Restriction
  has value: 0e+00
alternative label: Millimoles per square metre per day
qudtReference: http://qudt.org/vocab/unit/MilliMOL-PER-M2-DAY
ucumCode: mmol.m-2.d-1
unitSymbol: mmol/(m²⋅day)

MilliMolePerSquareMetrePerSecond
type: Class
subclass of: Restriction
  has value: 1e-03
subclass of: Restriction
  has value: 0e+00
alternative label: Millimoles per square metre per second
qudtReference: http://qudt.org/vocab/unit/MilliMOL-PER-M2-SEC
ucumCode: mmol.m-2.s-1
ucumCode: mmol/m2/s1
unitSymbol: µg/(m²⋅s)

MilliNewton
type: Class
comment: 0.001-fold of the SI derived unit newton -- QUDT
subclass of: Restriction
  has value: 1e-03
subclass of: Restriction
  has value: 0e+00
subclass of: Restriction
  some values from: Newton
qudtReference: http://qudt.org/vocab/unit/MilliN
ucumCode: mN
unitSymbol: mN
EMMO 967080e5 2f42 4eb2 a3a9 c58143e835f9: 0.001-fold of the SI derived unit newton -- QUDT

MilliNewtonMetre
type: Class
comment: 0.001-fold of the product of the SI derived unit newton and the SI base unit metre -- QUDT
subclass of: Restriction
  has value: 1e-03
subclass of: Restriction
  some values from: NewtonMetre
subclass of: Restriction
  has value: 0e+00
alternative label: Millinewton Metre
qudtReference: http://qudt.org/vocab/unit/MilliN-M
ucumCode: mN.m
unitSymbol: mN⋅m
EMMO 967080e5 2f42 4eb2 a3a9 c58143e835f9: 0.001-fold of the product of the SI derived unit newton and the SI base unit metre -- QUDT

MilliNewtonPerMetre
type: Class
comment: 0.001-fold of the SI derived unit newton divided by the SI base unit metre -- QUDT
subclass of: Restriction
  some values from: NewtonPerMetre
subclass of: Restriction
  has value: 1e-03
subclass of: Restriction
  has value: 0e+00
alternative label: Millinewton Per Metre
qudtReference: http://qudt.org/vocab/unit/MilliN-PER-M
ucumCode: mN.m-1
unitSymbol: mN/m
EMMO 967080e5 2f42 4eb2 a3a9 c58143e835f9: 0.001-fold of the SI derived unit newton divided by the SI base unit metre -- QUDT

MilliOhm
type: Class
comment: 0.001-fold of the SI derived unit ohm -- QUDT
subclass of: Restriction
  some values from: Ohm
subclass of: Restriction
  has value: 1e-03
subclass of: Restriction
  has value: 0e+00
qudtReference: http://qudt.org/vocab/unit/MilliOHM
ucumCode: mOhm
unitSymbol: mΩ
EMMO 967080e5 2f42 4eb2 a3a9 c58143e835f9: 0.001-fold of the SI derived unit ohm -- QUDT

MilliPascal
type: Class
comment: 0.001-fold of the SI derived unit pascal -- QUDT
subclass of: Restriction
  some values from: Pascal
subclass of: Restriction
  has value: 1e-03
subclass of: Restriction
  has value: 0e+00
qudtReference: http://qudt.org/vocab/unit/MilliPA
ucumCode: mPa
unitSymbol: mPa
EMMO 967080e5 2f42 4eb2 a3a9 c58143e835f9: 0.001-fold of the SI derived unit pascal -- QUDT

MilliPascalSecond
type: Class
comment: 0.001-fold of the product of the SI derived unit pascal and the SI base unit second -- QUDT
subclass of: Restriction
  some values from: PascalSecond
subclass of: Restriction
  has value: 1e-03
subclass of: Restriction
  has value: 0e+00
alternative label: Millipascal Second
qudtReference: http://qudt.org/vocab/unit/MilliPA-SEC
ucumCode: mPa.s
unitSymbol: mPa⋅s
EMMO 967080e5 2f42 4eb2 a3a9 c58143e835f9: 0.001-fold of the product of the SI derived unit pascal and the SI base unit second -- QUDT

MilliPascalSecondPerBar
type: Class
comment: 0.001-fold of the product of the SI derived unit pascal and the SI base unit second divided by the unit of the pressure bar -- QUDT
subclass of: Restriction
  some values from: PascalSecondPerBar
subclass of: Restriction
  has value: 1e-08
subclass of: Restriction
  has value: 0e+00
alternative label: Millipascal Second Per Bar
qudtReference: http://qudt.org/vocab/unit/MilliPA-SEC-PER-BAR
ucumCode: mPa.s.bar-1
unitSymbol: mPa⋅s/bar
EMMO 967080e5 2f42 4eb2 a3a9 c58143e835f9: 0.001-fold of the product of the SI derived unit pascal and the SI base unit second divided by the unit of the pressure bar -- QUDT

MilliRad
type: Class
subclass of: Restriction
  some values from: Rad
subclass of: Restriction
  has value: 1e-05
subclass of: Restriction
  has value: 0e+00
qudtReference: http://qudt.org/vocab/unit/MilliRAD_R
unitSymbol: mrad

MilliRadPerHour
type: Class
comment: One thousandth part of an absorbed ionizing radiation dose equal to 100 ergs per gram of irradiated material received per hour. -- QUDT
subclass of: Restriction
  has value: 2.777778e-07
subclass of: Restriction
  has value: 0e+00
alternative label: Millirads per hour
qudtReference: http://qudt.org/vocab/unit/MilliRAD_R-PER-HR
ucumCode: mRAD.h-1
unitSymbol: mrad/h
EMMO 967080e5 2f42 4eb2 a3a9 c58143e835f9: One thousandth part of an absorbed ionizing radiation dose equal to 100 ergs per gram of irradiated material received per hour. -- QUDT

MilliRadian
type: Class
subclass of: Restriction
  has value: 0e+00
subclass of: Restriction
  some values from: Radian
subclass of: Restriction
  has value: 1e-03
alternative label: milliradian
qudtReference: http://qudt.org/vocab/unit/MilliRAD
ucumCode: mrad
unitSymbol: mrad

MilliRoentgen
type: Class
comment: 0.001-fold of the unit roentgen. -- QUDT
subclass of: Restriction
  some values from: Roentgen
subclass of: Restriction
  has value: 2.58e-07
subclass of: Restriction
  has value: 0e+00
qudtReference: http://qudt.org/vocab/unit/MilliR
ucumCode: mR
unitSymbol: mR
EMMO 967080e5 2f42 4eb2 a3a9 c58143e835f9: 0.001-fold of the unit roentgen. -- QUDT
wikipediaReference: https://en.wikipedia.org/wiki/Roentgen_(unit)

MilliRoentgenEquivalentMan
type: Class
comment: The roentgen equivalent man (or rem) is a CGS unit of equivalent dose, effective dose, and committed dose, which are measures of the health effect of low levels of ionizing radiation on the human body. -- QUDT
subclass of: Restriction
  has value: 2.58e-07
subclass of: Restriction
  has value: 0e+00
alternative label: Milliroentgen Equivalent Man
qudtReference: http://qudt.org/vocab/unit/MilliR_man
ucumCode: mREM
unitSymbol: mrem
EMMO 967080e5 2f42 4eb2 a3a9 c58143e835f9: The roentgen equivalent man (or rem) is a CGS unit of equivalent dose, effective dose, and committed dose, which are measures of the health effect of low levels of ionizing radiation on the human body. -- QUDT
wikipediaReference: https://en.wikipedia.org/wiki/Roentgen_equivalent_man

MilliSecond
type: Class
comment: "Millisecond" is an Imperial unit for 'Time' expressed as ms. -- QUDT
subclass of: Restriction
  some values from: Second
subclass of: Restriction
  has value: 1e-03
subclass of: Restriction
  has value: 0e+00
alternative label: millisecond
qudtReference: http://qudt.org/vocab/unit/MilliSEC
ucumCode: ms
unitSymbol: ms
EMMO 967080e5 2f42 4eb2 a3a9 c58143e835f9: "Millisecond" is an Imperial unit for 'Time' expressed as ms. -- QUDT
wikipediaReference: http://en.wikipedia.org/wiki/Millisecond

MilliSiemens
type: Class
comment: 0.001-fold of the SI derived unit siemens -- QUDT
subclass of: Restriction
  some values from: Siemens
subclass of: Restriction
  has value: 1e-03
subclass of: Restriction
  has value: 0e+00
qudtReference: http://qudt.org/vocab/unit/MilliS
ucumCode: mS
unitSymbol: mS
EMMO 967080e5 2f42 4eb2 a3a9 c58143e835f9: 0.001-fold of the SI derived unit siemens -- QUDT

MilliSiemensPerCentiMetre
type: Class
comment: 0.001-fold of the SI derived unit Siemens divided by the 0.01-fold of the SI base unit metre -- QUDT
subclass of: Restriction
  some values from: SiemensPerCentiMetre
subclass of: Restriction
  has value: 1e-01
subclass of: Restriction
  has value: 0e+00
alternative label: Millisiemens Per Centimetre
qudtReference: http://qudt.org/vocab/unit/MilliS-PER-CentiM
ucumCode: mS.cm-1
ucumCode: mS/cm
unitSymbol: mS/cm
EMMO 967080e5 2f42 4eb2 a3a9 c58143e835f9: 0.001-fold of the SI derived unit Siemens divided by the 0.01-fold of the SI base unit metre -- QUDT

MilliSiemensPerMetre
type: Class
subclass of: Restriction
  some values from: SiemensPerMetre
subclass of: Restriction
  has value: 1e-03
subclass of: Restriction
  has value: 0e+00
alternative label: MilliSiemens per metre
qudtReference: http://qudt.org/vocab/unit/MilliS-PER-M
ucumCode: mS.m-1
unitSymbol: mS/m

MilliSievert
type: Class
comment: 0.001-fold of the SI derived unit sievert -- QUDT
subclass of: Restriction
  has value: 0e+00
subclass of: Restriction
  some values from: Sievert
subclass of: Restriction
  has value: 1e-03
qudtReference: http://qudt.org/vocab/unit/MilliSV
ucumCode: mSv
unitSymbol: mSv
EMMO 967080e5 2f42 4eb2 a3a9 c58143e835f9: 0.001-fold of the SI derived unit sievert -- QUDT

MilliTesla
type: Class
comment: 0.001-fold of the SI derived unit tesla -- QUDT
subclass of: Restriction
  some values from: Tesla
subclass of: Restriction
  has value: 1e-03
subclass of: Restriction
  has value: 0e+00
qudtReference: http://qudt.org/vocab/unit/MilliT
ucumCode: mT
unitSymbol: mT
EMMO 967080e5 2f42 4eb2 a3a9 c58143e835f9: 0.001-fold of the SI derived unit tesla -- QUDT

MilliTorr
type: Class
comment: "MilliTorr" is a unit for 'Force Per Area' expressed as utorr. -- QUDT
subclass of: Restriction
  some values from: Torr
subclass of: Restriction
  has value: 1.33322e-01
subclass of: Restriction
  has value: 0e+00
qudtReference: http://qudt.org/vocab/unit/MilliTORR
unitSymbol: mTorr
EMMO 967080e5 2f42 4eb2 a3a9 c58143e835f9: "MilliTorr" is a unit for 'Force Per Area' expressed as utorr. -- QUDT

MilliVolt
type: Class
comment: 0,001-fold of the SI derived unit volt -- QUDT
subclass of: Restriction
  has value: 0e+00
subclass of: Restriction
  has value: 1e-03
subclass of: Restriction
  some values from: Volt
qudtReference: http://qudt.org/vocab/unit/MilliV
ucumCode: mV
unitSymbol: mV
EMMO 967080e5 2f42 4eb2 a3a9 c58143e835f9: 0,001-fold of the SI derived unit volt -- QUDT

MilliVoltPerMetre
type: Class
comment: 0.000001-fold of the SI derived unit volt divided by the SI base unit metre -- QUDT
subclass of: Restriction
  some values from: VoltPerMetre
subclass of: Restriction
  has value: 1e-03
subclass of: Restriction
  has value: 0e+00
alternative label: Millivolt Per Metre
qudtReference: http://qudt.org/vocab/unit/MilliV-PER-M
ucumCode: mV.m-1
unitSymbol: mV/m
EMMO 967080e5 2f42 4eb2 a3a9 c58143e835f9: 0.000001-fold of the SI derived unit volt divided by the SI base unit metre -- QUDT

MilliVoltPerMinute
type: Class
comment: 0.001-fold of the SI derived unit volt divided by the unit minute -- QUDT
subclass of: Restriction
  has value: 1.666667e-05
subclass of: Restriction
  has value: 0e+00
alternative label: Millivolt Per Minute
qudtReference: http://qudt.org/vocab/unit/MilliV-PER-MIN
ucumCode: mV.min-1
unitSymbol: mV/min
EMMO 967080e5 2f42 4eb2 a3a9 c58143e835f9: 0.001-fold of the SI derived unit volt divided by the unit minute -- QUDT

MilliWatt
type: Class
comment: A milliwatt 0.01 N.
subclass of: Restriction
  some values from: Watt
subclass of: Restriction
  has value: 1e-03
subclass of: Restriction
  has value: 0e+00
alternative label: milliwatt
qudtReference: http://qudt.org/vocab/unit/MilliW
ucumCode: mW
unitSymbol: mW
EMMO 967080e5 2f42 4eb2 a3a9 c58143e835f9: A milliwatt 0.01 N.

MilliWattPerSquareCentiMetrePerMicroMetrePerSteradian
type: Class
subclass of: Restriction
  has value: 1e+07
subclass of: Restriction
  has value: 0e+00
alternative label: Milliwatts per square centimetre per micrometre per steradian
qudtReference: http://qudt.org/vocab/unit/MilliW-PER-CentiM2-MicroM-SR
ucumCode: mW.cm-2.um-1.sr-1
unitSymbol: mW/(cm⋅µm⋅sr)

MilliWattPerSquareMetre
type: Class
comment: 0.001-fold of the SI derived unit weber divided by the power of the SI base unit metre with the exponent 2 -- QUDT
subclass of: Restriction
  some values from: WattPerSquareMetre
subclass of: Restriction
  has value: 1e-03
subclass of: Restriction
  has value: 0e+00
alternative label: Milliwatt Per Square Metre
qudtReference: http://qudt.org/vocab/unit/MilliW-PER-M2
ucumCode: mW.m-2
unitSymbol: mW/m²
EMMO 967080e5 2f42 4eb2 a3a9 c58143e835f9: 0.001-fold of the SI derived unit weber divided by the power of the SI base unit metre with the exponent 2 -- QUDT

MilliWattPerSquareMetrePerNanoMetre
type: Class
subclass of: Restriction
  some values from: WattPerSquareMetrePerNanoMetre
subclass of: Restriction
  has value: 1e+06
subclass of: Restriction
  has value: 0e+00
alternative label: Milliwatts per square metre per nanometre
qudtReference: http://qudt.org/vocab/unit/MilliW-PER-M2-NanoM
ucumCode: mW.m-2.nm-1
unitSymbol: mW/(cm⋅nm)

MilliWattPerSquareMetrePerNanoMetrePerSteradian
type: Class
subclass of: Restriction
  some values from: WattPerSquareMetrePerNanoMetrePerSteradian
subclass of: Restriction
  has value: 1e+06
subclass of: Restriction
  has value: 0e+00
alternative label: Milliwatts per square metre per nanometre per steradian
qudtReference: http://qudt.org/vocab/unit/MilliW-PER-M2-NanoM-SR
ucumCode: mW.m-2.nm-1.sr-1
unitSymbol: mW/(cm⋅nm⋅sr)

MilliWeber
type: Class
comment: 0.001-fold of the SI derived unit weber -- QUDT
subclass of: Restriction
  has value: 1e-03
subclass of: Restriction
  has value: 0e+00
subclass of: Restriction
  some values from: Weber
qudtReference: http://qudt.org/vocab/unit/MilliWB
ucumCode: mWb
unitSymbol: mWb
EMMO 967080e5 2f42 4eb2 a3a9 c58143e835f9: 0.001-fold of the SI derived unit weber -- QUDT

MillionYear
type: Class
comment: 1,000,000-fold of the derived unit year. -- QUDT
subclass of: Restriction
  has value: 0e+00
subclass of: Restriction
  has value: 3.15576e+13
alternative label: Million Years
qudtReference: http://qudt.org/vocab/unit/MegaYR
ucumCode: Ma
unitSymbol: Myr
EMMO 967080e5 2f42 4eb2 a3a9 c58143e835f9: 1,000,000-fold of the derived unit year. -- QUDT

Minute
type: Class
comment: A minute is a unit of measurement of time. The minute is a unit of time equal to 1/60 (the first sexagesimal fraction of an hour or 60 seconds. In the UTC time scale, a minute on rare occasions has 59 or 61 seconds; see leap second. The minute is not an SI unit; however, it is accepted for use with SI units. The SI symbol for minute or minutes is min (for time measurement) or the prime symbol after a number, e.g. 5' (for angle measurement, even if it is informally used for time). -- QUDT
comment: Non-SI time unit defined as 60 seconds.
subclass of: Restriction
  has value: 6e+01
subclass of: Restriction
  has value: 0e+00
subclass of: Restriction
  has value: min
unit code: MIN
qudtReference: http://qudt.org/vocab/unit/MIN
ucumCode: min
dbpediaReference: http://dbpedia.org/page/Minute
EMMO 70fe84ff 99b6 4206 a9fc 9a8931836d84: Non-SI time unit defined as 60 seconds.
EMMO 967080e5 2f42 4eb2 a3a9 c58143e835f9: A minute is a unit of measurement of time. The minute is a unit of time equal to 1/60 (the first sexagesimal fraction of an hour or 60 seconds. In the UTC time scale, a minute on rare occasions has 59 or 61 seconds; see leap second. The minute is not an SI unit; however, it is accepted for use with SI units. The SI symbol for minute or minutes is min (for time measurement) or the prime symbol after a number, e.g. 5' (for angle measurement, even if it is informally used for time). -- QUDT

MinuteAngle
type: Class
subclass of: Restriction
  has value: 2.908882e-04
subclass of: Restriction
  has value: 0e+00
alternative label: Minute Angle
qudtReference: http://qudt.org/vocab/unit/MIN_Angle
ucumCode: '
unitSymbol: '

Mohm
type: Class
comment: A unit of mechanical mobility for sound waves, being the reciprocal of the mechanical ohm unit of impedance, i.e., for an acoustic medium, the ratio of the flux or volumic speed (area times particle speed) of the resulting waves through it to the effective sound pressure (i.e. force) causing them, the unit being qualified, according to the units used, as m.k.s. or c.g.s. The mechanical ohm is equivalent to 1 dyn· s· cm⁻¹ or 10⁻³ N· s· m⁻¹. -- QUDT
subclass of: Restriction
  has value: 1e+03
subclass of: Restriction
  has value: 0e+00
qudtReference: http://qudt.org/vocab/unit/MOHM
unitSymbol: mohm
EMMO 967080e5 2f42 4eb2 a3a9 c58143e835f9: A unit of mechanical mobility for sound waves, being the reciprocal of the mechanical ohm unit of impedance, i.e., for an acoustic medium, the ratio of the flux or volumic speed (area times particle speed) of the resulting waves through it to the effective sound pressure (i.e. force) causing them, the unit being qualified, according to the units used, as m.k.s. or c.g.s. The mechanical ohm is equivalent to 1 dyn· s· cm⁻¹ or 10⁻³ N· s· m⁻¹. -- QUDT

MoleDegreeCelsius
type: Class
comment: `Mole Degree Celsius` is a C.G.S System unit for 'Temperature Amount Of Substance' expressed as mol-degC. -- QUDT
alternative label: Mole Degree Celsius
qudtReference: http://qudt.org/vocab/unit/MOL-DEG_C
ucumCode: mol.Cel
unitSymbol: mol⋅°C
EMMO 967080e5 2f42 4eb2 a3a9 c58143e835f9: `Mole Degree Celsius` is a C.G.S System unit for 'Temperature Amount Of Substance' expressed as mol-degC. -- QUDT

MoleKelvin
type: Class
comment: Mole Kelvin is a unit for `Temperature Amount Of Substance` expressed as mol-K. -- QUDT
subclass of: Restriction
  has value: 1e+00
subclass of: Restriction
  has value: 0e+00
alternative label: Mole Kelvin
qudtReference: http://qudt.org/vocab/unit/MOL-K
ucumCode: mol.K
unitSymbol: mol⋅K
EMMO 967080e5 2f42 4eb2 a3a9 c58143e835f9: Mole Kelvin is a unit for `Temperature Amount Of Substance` expressed as mol-K. -- QUDT

MolePerCubicDeciMetre
type: Class
comment: SI base unit mol divided by the 0.001-fold of the power of the SI base unit metre with the exponent 3 -- QUDT
subclass of: Restriction
  has value: 1e+03
subclass of: Restriction
  has value: 0e+00
alternative label: Mole Per Cubic Decimetre
qudtReference: http://qudt.org/vocab/unit/MOL-PER-DeciM3
ucumCode: mol.dm-3
unitSymbol: mol/dm³
EMMO 967080e5 2f42 4eb2 a3a9 c58143e835f9: SI base unit mol divided by the 0.001-fold of the power of the SI base unit metre with the exponent 3 -- QUDT

MolePerKilogramPascal
type: Class
comment: Mole Per Kilogram Pascal (mol/kg-pa) is a unit of Molar Mass variation due to Pressure. -- QUDT
subclass of: Restriction
  has value: 0e+00
subclass of: Restriction
  has value: 1e+00
alternative label: Mole per Kilogram Pascal
qudtReference: http://qudt.org/vocab/unit/MOL-PER-KiloGM-PA
ucumCode: mol.kg-1.Pa-1
unitSymbol: mol/(kg⋅Pa)
EMMO 967080e5 2f42 4eb2 a3a9 c58143e835f9: Mole Per Kilogram Pascal (mol/kg-pa) is a unit of Molar Mass variation due to Pressure. -- QUDT

MolePerSquareMetrePerSecondPerMetre
type: Class
comment: Moles per square metre and second and metre.
subclass of: Restriction
  has value: 1e+00
subclass of: Restriction
  has value: 0e+00
qudtReference: http://qudt.org/vocab/unit/MOL-PER-M2-SEC-M
ucumCode: mol.m-2.s-1.m-1
unitSymbol: mol/(m²⋅s⋅m)
EMMO 967080e5 2f42 4eb2 a3a9 c58143e835f9: Moles per square metre and second and metre.

MolePerSquareMetrePerSecondPerMetrePerSteradian
type: Class
comment: Moles per square metre per second per metre per steradian.
subclass of: Restriction
  has value: 1e+00
subclass of: Restriction
  has value: 0e+00
qudtReference: http://qudt.org/vocab/unit/MOL-PER-M2-SEC-M-SR
ucumCode: mol.m-2.s-1.m-1.sr-1
unitSymbol: mol/(m²⋅s⋅m⋅sr)
EMMO 967080e5 2f42 4eb2 a3a9 c58143e835f9: Moles per square metre per second per metre per steradian.

MolePerSquareMetrePerSecondPerSteradian
type: Class
comment: Moles per square metre per second per steradian.
subclass of: Restriction
  has value: 1e+00
subclass of: Restriction
  has value: 0e+00
qudtReference: http://qudt.org/vocab/unit/MOL-PER-M2-SEC-SR
ucumCode: mol.m-2.s-1.sr-1
unitSymbol: mol/(m²⋅s⋅sr)
EMMO 967080e5 2f42 4eb2 a3a9 c58143e835f9: Moles per square metre per second per steradian.

Month
type: Class
comment: A unit of time corresponding approximately to one cycle of the moon's phases, or about 30 days or 4 weeks. Also known as the 'Synodic Month' and calculated as 29.53059 days. -- QUDT
subclass of: Restriction
  has value: 2.551443e+06
subclass of: Restriction
  has value: 0e+00
qudtReference: http://qudt.org/vocab/unit/MO
ucumCode: mo
unitSymbol: mo
EMMO 967080e5 2f42 4eb2 a3a9 c58143e835f9: A unit of time corresponding approximately to one cycle of the moon's phases, or about 30 days or 4 weeks. Also known as the 'Synodic Month' and calculated as 29.53059 days. -- QUDT
wikipediaReference: https://en.wikipedia.org/wiki/Month

NanoAmpere
type: Class
subclass of: Restriction
  some values from: Ampere
subclass of: Restriction
  has value: 1e-09
subclass of: Restriction
  has value: 0e+00
alternative label: nanoampere
qudtReference: http://qudt.org/vocab/unit/NanoA
ucumCode: nA
unitSymbol: nA

NanoBecquerel
type: Class
subclass of: Restriction
  has value: 0e+00
subclass of: Restriction
  some values from: Becquerel
subclass of: Restriction
  has value: 1e-09
qudtReference: http://qudt.org/vocab/unit/NanoBQ
unitSymbol: nBq

NanoBecquerelPerLitre
type: Class
subclass of: Restriction
  has value: 1e-06
subclass of: Restriction
  has value: 0e+00
subclass of: Restriction
  some values from: BecquerelPerLitre
alternative label: Nanobecquerels per litre
qudtReference: http://qudt.org/vocab/unit/NanoBQ-PER-L
ucumCode: nBq.L-1
unitSymbol: nBq/L

NanoCoulomb
type: Class
comment: A NanoCoulomb is 10⁻⁹ C. -- QUDT
subclass of: Restriction
  some values from: Coulomb
subclass of: Restriction
  has value: 1e-09
subclass of: Restriction
  has value: 0e+00
qudtReference: http://qudt.org/vocab/unit/NanoC
ucumCode: nC
unitSymbol: nC
EMMO 967080e5 2f42 4eb2 a3a9 c58143e835f9: A NanoCoulomb is 10⁻⁹ C. -- QUDT

NanoFarad
type: Class
comment: A common metric unit of electric capacitance equal to 10⁻⁹ farad. This unit was previously called the millimicrofarad. -- QUDT
subclass of: Restriction
  some values from: Farad
subclass of: Restriction
  has value: 1e-09
subclass of: Restriction
  has value: 0e+00
qudtReference: http://qudt.org/vocab/unit/NanoFARAD
ucumCode: nF
unitSymbol: nF
EMMO 967080e5 2f42 4eb2 a3a9 c58143e835f9: A common metric unit of electric capacitance equal to 10⁻⁹ farad. This unit was previously called the millimicrofarad. -- QUDT
wikipediaReference: http://en.wikipedia.org/wiki/Farad

NanoFaradPerMetre
type: Class
comment: 0.000000001-fold of the SI derived unit farad divided by the SI base unit metre -- QUDT
subclass of: Restriction
  has value: 0e+00
subclass of: Restriction
  some values from: FaradPerMetre
subclass of: Restriction
  has value: 1e-09
alternative label: Nanofarad Per Metre
qudtReference: http://qudt.org/vocab/unit/NanoFARAD-PER-M
ucumCode: nF.m-1
unitSymbol: nF/m
EMMO 967080e5 2f42 4eb2 a3a9 c58143e835f9: 0.000000001-fold of the SI derived unit farad divided by the SI base unit metre -- QUDT

NanoGram
type: Class
comment: 10**-9 grams or one 10**-12 of the SI standard unit of mass (kilogram). -- QUDT
subclass of: Restriction
  some values from: Gram
subclass of: Restriction
  has value: 1e-12
subclass of: Restriction
  has value: 0e+00
qudtReference: http://qudt.org/vocab/unit/NanoGM
ucumCode: ng
unitSymbol: ng
EMMO 967080e5 2f42 4eb2 a3a9 c58143e835f9: 10**-9 grams or one 10**-12 of the SI standard unit of mass (kilogram). -- QUDT

NanoGramPerCubicMetre
type: Class
comment: 0.000000000001-fold of the SI base unit kilogram divided by the power of the SI base unit metre with the exponent 3 -- QUDT
subclass of: Restriction
  some values from: GramPerCubicMetre
subclass of: Restriction
  has value: 1e-12
subclass of: Restriction
  has value: 0e+00
alternative label: Nanogram Per Cubic Metre
qudtReference: http://qudt.org/vocab/unit/NanoGM-PER-M3
ucumCode: ng.m-3
unitSymbol: ng/m³
EMMO 967080e5 2f42 4eb2 a3a9 c58143e835f9: 0.000000000001-fold of the SI base unit kilogram divided by the power of the SI base unit metre with the exponent 3 -- QUDT

NanoGramPerDay
type: Class
subclass of: Restriction
  some values from: GramPerDay
subclass of: Restriction
  has value: 1.157407e-17
subclass of: Restriction
  has value: 0e+00
alternative label: Nanograms per day
qudtReference: http://qudt.org/vocab/unit/NanoGM-PER-DAY
ucumCode: ng.d-1
unitSymbol: ng/day

NanoGramPerKilogram
type: Class
comment: mass ratio consisting of the 0.000000000001-fold of the SI base unit kilogram divided by the SI base unit kilogram -- QUDT
subclass of: Restriction
  some values from: GramPerKilogram
subclass of: Restriction
  has value: 1e-12
subclass of: Restriction
  has value: 0e+00
alternative label: Nanogram Per Kilogram
qudtReference: http://qudt.org/vocab/unit/NanoGM-PER-KiloGM
ucumCode: ng.kg-1
ucumCode: ng/kg
unitSymbol: ng/Kg
EMMO 967080e5 2f42 4eb2 a3a9 c58143e835f9: mass ratio consisting of the 0.000000000001-fold of the SI base unit kilogram divided by the SI base unit kilogram -- QUDT

NanoGramPerLitre
type: Class
subclass of: Restriction
  some values from: GramPerLitre
subclass of: Restriction
  has value: 1e-09
subclass of: Restriction
  has value: 0e+00
alternative label: Nanograms per litre
qudtReference: http://qudt.org/vocab/unit/NanoGM-PER-L
ucumCode: ng.L-1
unitSymbol: ng/L

NanoGramPerMicroLitre
type: Class
subclass of: Restriction
  has value: 1e-03
subclass of: Restriction
  has value: 0e+00
alternative label: Nanograms per microlitre
qudtReference: http://qudt.org/vocab/unit/NanoGM-PER-MicroL
ucumCode: ng.uL-1
unitSymbol: ng/µL

NanoGramPerMilliLitre
type: Class
comment: One 10**12 part of the SI standard unit of mass of the measurand per millilitre volume of matrix. -- QUDT
subclass of: Restriction
  some values from: GramPerMilliLitre
subclass of: Restriction
  has value: 1e-06
subclass of: Restriction
  has value: 0e+00
alternative label: Nanograms per millilitre
qudtReference: http://qudt.org/vocab/unit/NanoGM-PER-MilliL
ucumCode: ng.mL-1
unitSymbol: ng/mL
EMMO 967080e5 2f42 4eb2 a3a9 c58143e835f9: One 10**12 part of the SI standard unit of mass of the measurand per millilitre volume of matrix. -- QUDT

NanoGramPerSquareMetrePerPascalPerSecond
type: Class
subclass of: Restriction
  has value: 1e-12
subclass of: Restriction
  has value: 0e+00
alternative label: Nanograms per square metre per Pascal per second
qudtReference: http://qudt.org/vocab/unit/NanoGM-PER-M2-PA-SEC
unitSymbol: ng/(m²⋅s⋅Pa)
wikipediaReference: https://en.wikipedia.org/wiki/Perm_(unit)

NanoHenry
type: Class
comment: 0.000000001-fold of the SI derived unit henry -- QUDT
subclass of: Restriction
  some values from: Henry
subclass of: Restriction
  has value: 1e-09
subclass of: Restriction
  has value: 0e+00
qudtReference: http://qudt.org/vocab/unit/NanoH
ucumCode: nH
unitSymbol: nH
EMMO 967080e5 2f42 4eb2 a3a9 c58143e835f9: 0.000000001-fold of the SI derived unit henry -- QUDT

NanoHenryPerMetre
type: Class
comment: 0.000000001-fold of the SI derived unit henry divided by the SI base unit metre -- QUDT
subclass of: Restriction
  has value: 1e-09
subclass of: Restriction
  some values from: HenryPerMetre
subclass of: Restriction
  has value: 0e+00
alternative label: Nanohenry Per Metre
qudtReference: http://qudt.org/vocab/unit/NanoH-PER-M
ucumCode: nH.m-1
unitSymbol: nH/m
EMMO 967080e5 2f42 4eb2 a3a9 c58143e835f9: 0.000000001-fold of the SI derived unit henry divided by the SI base unit metre -- QUDT

NanoLitre
type: Class
comment: 0.000000001-fold of the unit litre -- QUDT
subclass of: Restriction
  some values from: Litre
subclass of: Restriction
  has value: 1e-12
subclass of: Restriction
  has value: 0e+00
qudtReference: http://qudt.org/vocab/unit/NanoL
ucumCode: nL
unitSymbol: nL
EMMO 967080e5 2f42 4eb2 a3a9 c58143e835f9: 0.000000001-fold of the unit litre -- QUDT

NanoMeterPerCentiMeterPsi
type: Class
subclass of: Restriction
  has value: 1.450377e-11
subclass of: Restriction
  has value: 0e+00
alternative label: Nanometer Per Centimeter PSI
qudtReference: http://qudt.org/vocab/unit/NanoM-PER-CentiM-PSI
ucumCode: nm.cm-1.PSI-1
unitSymbol: nm/(cm⋅PSI)

NanoMeterPerMilliMeterMegaPascal
type: Class
subclass of: Restriction
  has value: 1e-12
subclass of: Restriction
  has value: 0e+00
alternative label: Nanometer Per Millimeter Megapascal
qudtReference: http://qudt.org/vocab/unit/NanoM-PER-MilliM-MegaPA
ucumCode: nm.mm-1.MPa-1
unitSymbol: nm/(mm⋅MPa)

NanoMetre
type: Class
comment: 0.000000001-fold of the SI base unit metre -- QUDT
subclass of: Restriction
  some values from: Metre
subclass of: Restriction
  has value: 1e-09
subclass of: Restriction
  has value: 0e+00
qudtReference: http://qudt.org/vocab/unit/NanoM
ucumCode: nm
unitSymbol: nM
EMMO 967080e5 2f42 4eb2 a3a9 c58143e835f9: 0.000000001-fold of the SI base unit metre -- QUDT

NanoMole
type: Class
subclass of: Restriction
  some values from: Mole
subclass of: Restriction
  has value: 1e-09
subclass of: Restriction
  has value: 0e+00
qudtReference: http://qudt.org/vocab/unit/NanoMOL
unitSymbol: nmol

NanoMolePerCubicCentiMetrePerHour
type: Class
subclass of: Restriction
  has value: 0e+00
subclass of: Restriction
  has value: 2.777778e-07
alternative label: Nanomoles per cubic centimetre per hour
qudtReference: http://qudt.org/vocab/unit/NanoMOL-PER-CentiM3-HR
ucumCode: nmol.cm-3.h-1
unitSymbol: nmol/(cm³⋅h)

NanoMolePerGramPerSecond
type: Class
subclass of: Restriction
  has value: 1e-06
subclass of: Restriction
  has value: 0e+00
alternative label: Nanomoles per gram per second
qudtReference: http://qudt.org/vocab/unit/NanoMOL-PER-GM-SEC
ucumCode: nmol.g-1.s-1
unitSymbol: nmol/(g⋅s)

NanoMolePerKilogram
type: Class
subclass of: Restriction
  has value: 0e+00
subclass of: Restriction
  has value: 1e-09
alternative label: Nanomoles per kilogram
qudtReference: http://qudt.org/vocab/unit/NanoMOL-PER-KiloGM
ucumCode: nmol.kg-1
unitSymbol: nmol/kg

NanoMolePerLitre
type: Class
comment: A scaled unit of amount-of-substance concentration. -- QUDT
subclass of: Restriction
  some values from: MolePerLitre
subclass of: Restriction
  has value: 1e-06
subclass of: Restriction
  has value: 0e+00
alternative label: Nanomoles per litre
qudtReference: http://qudt.org/vocab/unit/NanoMOL-PER-L
ucumCode: nmol.L-1
ucumCode: nmol/L
unitSymbol: nmol/L
EMMO 967080e5 2f42 4eb2 a3a9 c58143e835f9: A scaled unit of amount-of-substance concentration. -- QUDT

NanoMolePerLitrePerDay
type: Class
subclass of: Restriction
  has value: 0e+00
subclass of: Restriction
  has value: 1.157407e-11
alternative label: Nanomoles per litre per day
qudtReference: http://qudt.org/vocab/unit/NanoMOL-PER-L-DAY
ucumCode: nmol.L-1.d-1
unitSymbol: nmol/(L⋅day)

NanoMolePerLitrePerHour
type: Class
subclass of: Restriction
  has value: 2.777778e-10
subclass of: Restriction
  has value: 0e+00
alternative label: Nanomoles per litre per hour
qudtReference: http://qudt.org/vocab/unit/NanoMOL-PER-L-HR
ucumCode: nmol.L-1.h-1
unitSymbol: nmol/(L⋅h)

NanoMolePerMicroGramPerHour
type: Class
subclass of: Restriction
  has value: 2.777778e-04
subclass of: Restriction
  has value: 0e+00
alternative label: Nanomoles per microgram per hour
qudtReference: http://qudt.org/vocab/unit/NanoMOL-PER-MicroGM-HR
ucumCode: nmol.ug-1.h-1
unitSymbol: nmol/(µg⋅h)

NanoMolePerMicroMole
type: Class
comment: Unavailable. -- QUDT
subclass of: Restriction
  has value: 1e-03
subclass of: Restriction
  has value: 0e+00
alternative label: Nanomoles per micromole
qudtReference: http://qudt.org/vocab/unit/NanoMOL-PER-MicroMOL
ucumCode: nmol.umol-1
unitSymbol: nmol/µmol
EMMO 967080e5 2f42 4eb2 a3a9 c58143e835f9: Unavailable. -- QUDT

NanoMolePerMicroMolePerDay
type: Class
comment: Unavailable. -- QUDT
subclass of: Restriction
  has value: 1.157407e-08
subclass of: Restriction
  has value: 0e+00
alternative label: Nanomoles per micromole per day
qudtReference: http://qudt.org/vocab/unit/NanoMOL-PER-MicroMOL-DAY
ucumCode: nmol.umol-1.d-1
unitSymbol: nmol/(µmol⋅day)
EMMO 967080e5 2f42 4eb2 a3a9 c58143e835f9: Unavailable. -- QUDT

NanoMolePerSquareMetrePerDay
type: Class
subclass of: Restriction
  some values from: MolePerSquareMetrePerDay
subclass of: Restriction
  has value: 1.157407e-14
subclass of: Restriction
  has value: 0e+00
alternative label: Nanomoles per square metre per day
qudtReference: http://qudt.org/vocab/unit/NanoMOL-PER-M2-DAY
ucumCode: nmol.m-2.d-1
unitSymbol: nmol/(m²⋅day)

NanoSecond
type: Class
comment: A nanosecond is a SI unit of time equal to one billionth of a second (10-9 or 1/1,000,000,000 s). One nanosecond is to one second as one second is to 31.69 years. The word nanosecond is formed by the prefix nano and the unit second. -- QUDT
subclass of: Restriction
  some values from: Second
subclass of: Restriction
  has value: 1e-09
subclass of: Restriction
  has value: 0e+00
alternative label: nanosecond
qudtReference: http://qudt.org/vocab/unit/NanoSEC
ucumCode: ns
unitSymbol: ns
EMMO 967080e5 2f42 4eb2 a3a9 c58143e835f9: A nanosecond is a SI unit of time equal to one billionth of a second (10-9 or 1/1,000,000,000 s). One nanosecond is to one second as one second is to 31.69 years. The word nanosecond is formed by the prefix nano and the unit second. -- QUDT
wikipediaReference: http://en.wikipedia.org/wiki/Nanosecond

NanoSiemens
type: Class
subclass of: Restriction
  has value: 0e+00
subclass of: Restriction
  some values from: Siemens
subclass of: Restriction
  has value: 1e-09
qudtReference: http://qudt.org/vocab/unit/NanoS
unitSymbol: nS

NanoSiemensPerCentiMetre
type: Class
comment: 0.000000001-fold of the SI derived unit Siemens by the 0.01 fol of the SI base unit metre -- QUDT
subclass of: Restriction
  some values from: SiemensPerCentiMetre
subclass of: Restriction
  has value: 1e-07
subclass of: Restriction
  has value: 0e+00
alternative label: Nanosiemens Per Centimetre
qudtReference: http://qudt.org/vocab/unit/NanoS-PER-CentiM
ucumCode: nS.cm-1
unitSymbol: nS/cm
EMMO 967080e5 2f42 4eb2 a3a9 c58143e835f9: 0.000000001-fold of the SI derived unit Siemens by the 0.01 fol of the SI base unit metre -- QUDT

NanoSiemensPerMetre
type: Class
comment: 0.000000001-fold of the SI derived unit Siemens divided by the SI base unit metre -- QUDT
subclass of: Restriction
  has value: 1e-09
subclass of: Restriction
  some values from: SiemensPerMetre
subclass of: Restriction
  has value: 0e+00
alternative label: Nanosiemens Per Metre
qudtReference: http://qudt.org/vocab/unit/NanoS-PER-M
ucumCode: nS.m-1
unitSymbol: nS/m
EMMO 967080e5 2f42 4eb2 a3a9 c58143e835f9: 0.000000001-fold of the SI derived unit Siemens divided by the SI base unit metre -- QUDT

NanoTesla
type: Class
comment: 0.000000001-fold of the SI derived unit tesla -- QUDT
subclass of: Restriction
  has value: 0e+00
subclass of: Restriction
  some values from: Tesla
subclass of: Restriction
  has value: 1e-09
qudtReference: http://qudt.org/vocab/unit/NanoT
ucumCode: nT
unitSymbol: nT
EMMO 967080e5 2f42 4eb2 a3a9 c58143e835f9: 0.000000001-fold of the SI derived unit tesla -- QUDT

NanoWatt
type: Class
comment: 0.000000001-fold of the SI derived unit watt -- QUDT
subclass of: Restriction
  some values from: Watt
subclass of: Restriction
  has value: 1e-09
subclass of: Restriction
  has value: 0e+00
qudtReference: http://qudt.org/vocab/unit/NanoW
ucumCode: nW
unitSymbol: nW
EMMO 967080e5 2f42 4eb2 a3a9 c58143e835f9: 0.000000001-fold of the SI derived unit watt -- QUDT

Nat
type: Class
comment: A nat is a logarithmic unit of information or entropy, based on natural logarithms and powers of e, rather than the powers of 2 and base 2 logarithms which define the bit. The nat is the natural unit for information entropy. Physical systems of natural units which normalize Boltzmann's constant to 1 are effectively measuring thermodynamic entropy in nats. -- QUDT
subclass of: Restriction
  has value: 1e+00
subclass of: Restriction
  has value: 0e+00
qudtReference: http://qudt.org/vocab/unit/NAT
unitSymbol: nat
EMMO 967080e5 2f42 4eb2 a3a9 c58143e835f9: A nat is a logarithmic unit of information or entropy, based on natural logarithms and powers of e, rather than the powers of 2 and base 2 logarithms which define the bit. The nat is the natural unit for information entropy. Physical systems of natural units which normalize Boltzmann's constant to 1 are effectively measuring thermodynamic entropy in nats. -- QUDT
wikipediaReference: http://en.wikipedia.org/wiki/Nat

NatPerSecond
type: Class
comment: "Nat per Second" is information rate in natural units. -- QUDT
subclass of: Restriction
  has value: 1e+00
subclass of: Restriction
  has value: 0e+00
alternative label: Nat per Second
qudtReference: http://qudt.org/vocab/unit/NAT-PER-SEC
unitSymbol: nat/s
EMMO 967080e5 2f42 4eb2 a3a9 c58143e835f9: "Nat per Second" is information rate in natural units. -- QUDT
wikipediaReference: http://en.wikipedia.org/wiki/Nat

NauticalMile
type: Class
comment: A unit of distance used primarily at sea and in aviation. The nautical mile is defined to be the average distance on the Earth's surface represented by one minute of latitude. In 1929 an international conference in Monaco redefined the nautical mile to be exactly 1852 meters or 6076.115 49 feet, a distance known as the international nautical mile. The international nautical mile equals about 1.1508 statute miles. There are usually 3 nautical miles in a league. The unit is designed to equal 1/60 degree, although actual degrees of latitude vary from about 59.7 to 60.3 nautical miles. (Note: using data from the Geodetic Reference System 1980, the "true" length of a nautical mile would be 1852.216 meters.) -- QUDT
subclass of: Restriction
  has value: 1.852e+03
subclass of: Restriction
  has value: 0e+00
alternative label: Nautical Mile
qudtReference: http://qudt.org/vocab/unit/MI_N
ucumCode: [nmi_i]
unitSymbol: nmi
EMMO 967080e5 2f42 4eb2 a3a9 c58143e835f9: A unit of distance used primarily at sea and in aviation. The nautical mile is defined to be the average distance on the Earth's surface represented by one minute of latitude. In 1929 an international conference in Monaco redefined the nautical mile to be exactly 1852 meters or 6076.115 49 feet, a distance known as the international nautical mile. The international nautical mile equals about 1.1508 statute miles. There are usually 3 nautical miles in a league. The unit is designed to equal 1/60 degree, although actual degrees of latitude vary from about 59.7 to 60.3 nautical miles. (Note: using data from the Geodetic Reference System 1980, the "true" length of a nautical mile would be 1852.216 meters.) -- QUDT

NauticalMilePerHour
type: Class
comment: The knot is a unit of speed equal to one nautical mile (1.852 km) per hour, approximately 1.151 mph. The abbreviation kn is preferred by the International Hydrographic Organization (IHO), which includes every major seafaring nation; but the abbreviations kt (singular) and kts (plural) are also widely used conflicting with the SI symbol for kilotonne which is also "kt". The knot is a non-SI unit accepted for use with the International System of Units (SI). Worldwide, the knot is used in meteorology, and in maritime and air navigation-for example, a vessel travelling at 1 knot along a meridian travels one minute of geographic latitude in one hour. -- QUDT
subclass of: Restriction
  has value: 5.14444e-01
subclass of: Restriction
  has value: 0e+00
alternative label: Nautical Mile per Hour
qudtReference: http://qudt.org/vocab/unit/MI_N-PER-HR
ucumCode: [nmi_i].h-1
ucumCode: [nmi_i]/h
unitSymbol: nmi/hr
EMMO 967080e5 2f42 4eb2 a3a9 c58143e835f9: The knot is a unit of speed equal to one nautical mile (1.852 km) per hour, approximately 1.151 mph. The abbreviation kn is preferred by the International Hydrographic Organization (IHO), which includes every major seafaring nation; but the abbreviations kt (singular) and kts (plural) are also widely used conflicting with the SI symbol for kilotonne which is also "kt". The knot is a non-SI unit accepted for use with the International System of Units (SI). Worldwide, the knot is used in meteorology, and in maritime and air navigation-for example, a vessel travelling at 1 knot along a meridian travels one minute of geographic latitude in one hour. -- QUDT

NauticalMilePerMinute
type: Class
comment: The SI derived unit for speed is the meter/second. 1 meter/second is equal to 0.0323974082073 nautical mile per minute. -- QUDT
alternative label: Nautical Mile per Minute
qudtReference: http://qudt.org/vocab/unit/MI_N-PER-MIN
ucumCode: [nmi_i].min-1
ucumCode: [nmi_i]/min
unitSymbol: nmi/min
EMMO 967080e5 2f42 4eb2 a3a9 c58143e835f9: The SI derived unit for speed is the meter/second. 1 meter/second is equal to 0.0323974082073 nautical mile per minute. -- QUDT

Neper
type: Class
comment: The neper is a logarithmic unit for ratios of measurements of physical field and power quantities, such as gain and loss of electronic signals. It has the unit symbol Np. The unit's name is derived from the name of John Napier, the inventor of logarithms. As is the case for the decibel and bel, the neper is not a unit in the International System of Units (SI), but it is accepted for use alongside the SI. Like the decibel, the neper is a unit in a logarithmic scale. While the bel uses the decadic (base-10) logarithm to compute ratios, the neper uses the natural logarithm, based on Euler's number -- QUDT
comment: Unit of measurement for quantities of type level or level difference, which are defined as the natural logarithm of the ratio of power- or field-type quantities. The value of a ratio in nepers is given by `ln(x1/x2)` where `x1` and `x2` are the values of interest (amplitudes), and ln is the natural logarithm. When the values are quadratic in the amplitude (e.g. power), they are first linearised by taking the square root before the logarithm is taken, or equivalently the result is halved. Wikipedia
subclass of: Restriction
  has value: 0e+00
subclass of: Restriction
  has value: 1e+00
subclass of: Restriction
  has value: Np
unit code: C50
qudtReference: http://qudt.org/vocab/unit/NP
ucumCode: Np
dbpediaReference: http://dbpedia.org/page/Neper
EMMO 70fe84ff 99b6 4206 a9fc 9a8931836d84: Unit of measurement for quantities of type level or level difference, which are defined as the natural logarithm of the ratio of power- or field-type quantities. The value of a ratio in nepers is given by `ln(x1/x2)` where `x1` and `x2` are the values of interest (amplitudes), and ln is the natural logarithm. When the values are quadratic in the amplitude (e.g. power), they are first linearised by taking the square root before the logarithm is taken, or equivalently the result is halved. Wikipedia
EMMO 967080e5 2f42 4eb2 a3a9 c58143e835f9: The neper is a logarithmic unit for ratios of measurements of physical field and power quantities, such as gain and loss of electronic signals. It has the unit symbol Np. The unit's name is derived from the name of John Napier, the inventor of logarithms. As is the case for the decibel and bel, the neper is not a unit in the International System of Units (SI), but it is accepted for use alongside the SI. Like the decibel, the neper is a unit in a logarithmic scale. While the bel uses the decadic (base-10) logarithm to compute ratios, the neper uses the natural logarithm, based on Euler's number -- QUDT
wikipediaReference: https://en.wikipedia.org/wiki/Neper
iupacReference: https://doi.org/10.1351/goldbook.N04106

NephelometryTurbidityUnit
type: Class
comment: "Nephelometry Turbidity Unit" is a C.G.S System unit for 'Turbidity' expressed as NTU. -- QUDT
alternative label: Nephelometry Turbidity Unit
qudtReference: http://qudt.org/vocab/unit/NTU
unitSymbol: NTU
EMMO 967080e5 2f42 4eb2 a3a9 c58143e835f9: "Nephelometry Turbidity Unit" is a C.G.S System unit for 'Turbidity' expressed as NTU. -- QUDT

NewtonCentiMetre
type: Class
comment: product of the SI derived unit newton and the 0.01-fold of the SI base unit metre -- QUDT
subclass of: Restriction
  has value: 0e+00
subclass of: Restriction
  has value: 1e-02
alternative label: Newton Centimetre
qudtReference: http://qudt.org/vocab/unit/N-CentiM
ucumCode: N.cm
unitSymbol: N⋅cm
EMMO 967080e5 2f42 4eb2 a3a9 c58143e835f9: product of the SI derived unit newton and the 0.01-fold of the SI base unit metre -- QUDT

NewtonMetrePerAmpere
type: Class
comment: product of the SI derived unit newton and the SI base unit metre divided by the SI base unit ampere -- QUDT
subclass of: Restriction
  has value: 1e+00
subclass of: Restriction
  has value: 0e+00
alternative label: Newton Metre Per Ampere
qudtReference: http://qudt.org/vocab/unit/N-M-PER-A
ucumCode: N.m.A-1
unitSymbol: N⋅m/A
EMMO 967080e5 2f42 4eb2 a3a9 c58143e835f9: product of the SI derived unit newton and the SI base unit metre divided by the SI base unit ampere -- QUDT

NewtonMetrePerKilogram
type: Class
comment: product of the derived SI unit newton and the SI base unit metre divided by the SI base unit kilogram -- QUDT
subclass of: Restriction
  has value: 1e+00
subclass of: Restriction
  has value: 0e+00
alternative label: Newton Metre Per Kilogram
qudtReference: http://qudt.org/vocab/unit/N-M-PER-KiloGM
ucumCode: N.m.kg-1
unitSymbol: N⋅m/kg
EMMO 967080e5 2f42 4eb2 a3a9 c58143e835f9: product of the derived SI unit newton and the SI base unit metre divided by the SI base unit kilogram -- QUDT

NewtonMetrePerMetre
type: Class
comment: This is the SI unit for the rolling resistance, which is equivalent to drag force in newton -- QUDT
subclass of: Restriction
  has value: 1e+00
subclass of: Restriction
  has value: 0e+00
alternative label: Newton metre per metre
qudtReference: http://qudt.org/vocab/unit/N-M-PER-M
unitSymbol: N⋅m/m
EMMO 967080e5 2f42 4eb2 a3a9 c58143e835f9: This is the SI unit for the rolling resistance, which is equivalent to drag force in newton -- QUDT

NewtonMetrePerMetrePerRadian
type: Class
comment: Newton metre per metre and radian.
subclass of: Restriction
  has value: 1e+00
subclass of: Restriction
  has value: 0e+00
qudtReference: http://qudt.org/vocab/unit/N-M-PER-M-RAD
unitSymbol: N⋅m/(m⋅rad)
EMMO 967080e5 2f42 4eb2 a3a9 c58143e835f9: Newton metre per metre and radian.

NewtonMetrePerRadian
type: Class
comment: Newton Meter per Radian is the SI unit for Torsion Constant -- QUDT
subclass of: Restriction
  has value: 0e+00
subclass of: Restriction
  has value: 1e+00
alternative label: Newton metre per radian
qudtReference: http://qudt.org/vocab/unit/N-M-PER-RAD
unitSymbol: N⋅m/rad
EMMO 967080e5 2f42 4eb2 a3a9 c58143e835f9: Newton Meter per Radian is the SI unit for Torsion Constant -- QUDT

NewtonMetrePerSquareMetre
type: Class
comment: product of the SI derived unit newton and the SI base unit metre divided by the power of the SI base unit metre with the exponent 2 -- QUDT
subclass of: Restriction
  has value: 0e+00
subclass of: Restriction
  has value: 1e+00
alternative label: Newton Metre Per Square Metre
qudtReference: http://qudt.org/vocab/unit/N-M-PER-M2
ucumCode: N.m.m-2
unitSymbol: N⋅m/m²
EMMO 967080e5 2f42 4eb2 a3a9 c58143e835f9: product of the SI derived unit newton and the SI base unit metre divided by the power of the SI base unit metre with the exponent 2 -- QUDT

NewtonMetreSecond
type: Class
comment: The SI derived unit of angular momentum. -- QUDT
subclass of: Restriction
  has value: 0e+00
subclass of: Restriction
  has value: 1e+00
alternative label: Newton Metre Second
qudtReference: http://qudt.org/vocab/unit/N-M-SEC
ucumCode: N.m.s
unitSymbol: N⋅m⋅s
EMMO 967080e5 2f42 4eb2 a3a9 c58143e835f9: The SI derived unit of angular momentum. -- QUDT
wikipediaReference: http://en.wikipedia.org/wiki/SI_derived_unit

NewtonMetreSecondPerMetre
type: Class
comment: Newton metre seconds measured per metre -- QUDT
subclass of: Restriction
  has value: 1e+00
subclass of: Restriction
  has value: 0e+00
alternative label: Newton metre seconds per metre
qudtReference: http://qudt.org/vocab/unit/N-M-SEC-PER-M
unitSymbol: N⋅m⋅s/m
EMMO 967080e5 2f42 4eb2 a3a9 c58143e835f9: Newton metre seconds measured per metre -- QUDT

NewtonMetreSecondPerRadian
type: Class
comment: Newton metre seconds measured per radian -- QUDT
subclass of: Restriction
  has value: 1e+00
subclass of: Restriction
  has value: 0e+00
alternative label: Newton metre seconds per radian
qudtReference: http://qudt.org/vocab/unit/N-M-SEC-PER-RAD
unitSymbol: N⋅m⋅s/rad
EMMO 967080e5 2f42 4eb2 a3a9 c58143e835f9: Newton metre seconds measured per radian -- QUDT

NewtonPerAmpere
type: Class
comment: SI derived unit newton divided by the SI base unit ampere -- QUDT
subclass of: Restriction
  has value: 1e+00
subclass of: Restriction
  has value: 0e+00
alternative label: Newton Per Ampere
qudtReference: http://qudt.org/vocab/unit/N-PER-A
ucumCode: N.A-1
unitSymbol: N/A
EMMO 967080e5 2f42 4eb2 a3a9 c58143e835f9: SI derived unit newton divided by the SI base unit ampere -- QUDT

NewtonPerCentiMetre
type: Class
comment: SI derived unit newton divided by the 0.01-fold of the SI base unit metre -- QUDT
subclass of: Restriction
  has value: 1e+02
subclass of: Restriction
  has value: 0e+00
alternative label: Newton Per Centimetre
qudtReference: http://qudt.org/vocab/unit/N-PER-CentiM
ucumCode: N.cm-1
unitSymbol: N/cm
EMMO 967080e5 2f42 4eb2 a3a9 c58143e835f9: SI derived unit newton divided by the 0.01-fold of the SI base unit metre -- QUDT

NewtonPerCoulomb
type: Class
comment: Newton Per Coulomb ( N/C) is a unit in the category of Electric field strength. It is also known as newtons/coulomb. Newton Per Coulomb ( N/C) has a dimension of MLT-3I-1 where M is mass, L is length, T is time, and I is electric current. It essentially the same as the corresponding standard SI unit V/m. -- QUDT
subclass of: Restriction
  has value: 1e+00
subclass of: Restriction
  has value: 0e+00
alternative label: Newton per Coulomb
qudtReference: http://qudt.org/vocab/unit/N-PER-C
ucumCode: N.C-1
unitSymbol: N/C
EMMO 967080e5 2f42 4eb2 a3a9 c58143e835f9: Newton Per Coulomb ( N/C) is a unit in the category of Electric field strength. It is also known as newtons/coulomb. Newton Per Coulomb ( N/C) has a dimension of MLT-3I-1 where M is mass, L is length, T is time, and I is electric current. It essentially the same as the corresponding standard SI unit V/m. -- QUDT

NewtonPerCubicMetre
type: Class
comment: Newton per cubic metre.
subclass of: Restriction
  has value: 1e+00
subclass of: Restriction
  has value: 0e+00
qudtReference: http://qudt.org/vocab/unit/N-PER-M3
ucumCode: N.m-3
unitSymbol: N/m³
EMMO 967080e5 2f42 4eb2 a3a9 c58143e835f9: Newton per cubic metre.

NewtonPerKilogram
type: Class
comment: Gravitational field strength at a point is the gravitational force per unit mass at that point. It is a vector and its S.I. unit is N kg-1. -- QUDT
subclass of: Restriction
  has value: 1e+00
subclass of: Restriction
  has value: 0e+00
alternative label: Newton per Kilogram
qudtReference: http://qudt.org/vocab/unit/N-PER-KiloGM
ucumCode: N.kg-1
unitSymbol: N/kg
EMMO 967080e5 2f42 4eb2 a3a9 c58143e835f9: Gravitational field strength at a point is the gravitational force per unit mass at that point. It is a vector and its S.I. unit is N kg-1. -- QUDT

NewtonPerMilliMetre
type: Class
comment: SI derived unit newton divided by the 0.001-fold of the SI base unit metre -- QUDT
subclass of: Restriction
  has value: 1e+03
subclass of: Restriction
  has value: 0e+00
alternative label: Newton Per Millimetre
qudtReference: http://qudt.org/vocab/unit/N-PER-MilliM
ucumCode: N.mm-1
unitSymbol: N/mm
EMMO 967080e5 2f42 4eb2 a3a9 c58143e835f9: SI derived unit newton divided by the 0.001-fold of the SI base unit metre -- QUDT

NewtonPerRadian
type: Class
comment: A one-newton force applied for one angle/torsional torque -- QUDT
subclass of: Restriction
  has value: 1e+00
subclass of: Restriction
  has value: 0e+00
alternative label: Newton per radian
qudtReference: http://qudt.org/vocab/unit/N-PER-RAD
unitSymbol: N/rad
EMMO 967080e5 2f42 4eb2 a3a9 c58143e835f9: A one-newton force applied for one angle/torsional torque -- QUDT

NewtonPerSquareCentiMetre
type: Class
comment: derived SI unit newton divided by the 0.0001-fold of the power of the SI base unit metre by exponent 2 -- QUDT
subclass of: Restriction
  has value: 1e+04
subclass of: Restriction
  has value: 0e+00
alternative label: Newton Per Square Centimetre
qudtReference: http://qudt.org/vocab/unit/N-PER-CentiM2
ucumCode: N.cm-2
unitSymbol: N/cm²
EMMO 967080e5 2f42 4eb2 a3a9 c58143e835f9: derived SI unit newton divided by the 0.0001-fold of the power of the SI base unit metre by exponent 2 -- QUDT

NewtonPerSquareMetre
type: Class
comment: The SI unit of pressure. The pascal is the standard pressure unit in the MKS metric system, equal to one newton per square meter or one "kilogram per meter per second per second." The unit is named for Blaise Pascal (1623-1662), French philosopher and mathematician, who was the first person to use a barometer to measure differences in altitude. -- QUDT
subclass of: Restriction
  has value: 1e+00
subclass of: Restriction
  has value: 0e+00
alternative label: Newtons Per Square Metre
qudtReference: http://qudt.org/vocab/unit/N-PER-M2
ucumCode: N.m-2
unitSymbol: N/m²
EMMO 967080e5 2f42 4eb2 a3a9 c58143e835f9: The SI unit of pressure. The pascal is the standard pressure unit in the MKS metric system, equal to one newton per square meter or one "kilogram per meter per second per second." The unit is named for Blaise Pascal (1623-1662), French philosopher and mathematician, who was the first person to use a barometer to measure differences in altitude. -- QUDT
wikipediaReference: http://en.wikipedia.org/wiki/Pascal

NewtonPerSquareMilliMetre
type: Class
comment: SI derived unit newton divided by the 0.000001-fold of the power of the SI base unit metre with the exponent 2 -- QUDT
subclass of: Restriction
  has value: 1e+06
subclass of: Restriction
  has value: 0e+00
alternative label: Newton Per Square Millimetre
qudtReference: http://qudt.org/vocab/unit/N-PER-MilliM2
ucumCode: N.mm-2
unitSymbol: N/mm²
EMMO 967080e5 2f42 4eb2 a3a9 c58143e835f9: SI derived unit newton divided by the 0.000001-fold of the power of the SI base unit metre with the exponent 2 -- QUDT

NewtonSecond
type: Class
comment: product of the SI derived unit newton and the SI base unit second -- QUDT
subclass of: Restriction
  has value: 1e+00
subclass of: Restriction
  has value: 0e+00
alternative label: Newton Second
qudtReference: http://qudt.org/vocab/unit/N-SEC
ucumCode: N.s
unitSymbol: N⋅s
EMMO 967080e5 2f42 4eb2 a3a9 c58143e835f9: product of the SI derived unit newton and the SI base unit second -- QUDT

NewtonSecondPerCubicMetre
type: Class
comment: The SI unit of specific acoustic impedance. When sound waves pass through any physical substance the pressure of the waves causes the particles of the substance to move. The sound specific impedance is the ratio between the sound pressure and the particle velocity it produces. The specific impedance is 1 N · s · m⁻³ if unit pressure produces unit velocity. -- QUDT
subclass of: Restriction
  has value: 1e+00
subclass of: Restriction
  has value: 0e+00
alternative label: Newton second per Cubic Metre
qudtReference: http://qudt.org/vocab/unit/N-SEC-PER-M3
ucumCode: N.s.m-3
unitSymbol: N⋅s/m³
EMMO 967080e5 2f42 4eb2 a3a9 c58143e835f9: The SI unit of specific acoustic impedance. When sound waves pass through any physical substance the pressure of the waves causes the particles of the substance to move. The sound specific impedance is the ratio between the sound pressure and the particle velocity it produces. The specific impedance is 1 N · s · m⁻³ if unit pressure produces unit velocity. -- QUDT

NewtonSecondPerMetre
type: Class
comment: Newton second measured per metre -- QUDT
subclass of: Restriction
  has value: 1e+00
subclass of: Restriction
  has value: 0e+00
alternative label: Newton Second per Metre
qudtReference: http://qudt.org/vocab/unit/N-SEC-PER-M
ucumCode: N.s.m-1
unitSymbol: N⋅s/m
EMMO 967080e5 2f42 4eb2 a3a9 c58143e835f9: Newton second measured per metre -- QUDT

NewtonSecondPerRadian
type: Class
comment: Newton seconds measured per radian -- QUDT
subclass of: Restriction
  has value: 1e+00
subclass of: Restriction
  has value: 0e+00
alternative label: Newton seconds per radian
qudtReference: http://qudt.org/vocab/unit/N-SEC-PER-RAD
unitSymbol: N⋅s/rad
EMMO 967080e5 2f42 4eb2 a3a9 c58143e835f9: Newton seconds measured per radian -- QUDT

NewtonSquareMetrePerAmpere
type: Class
comment: Newton metre squared per Ampere.
subclass of: Restriction
  has value: 1e+00
subclass of: Restriction
  has value: 0e+00
qudtReference: http://qudt.org/vocab/unit/N-M2-PER-A
ucumCode: N.m2.A-1
ucumCode: N.m2/A
unitSymbol: N⋅m²/A
EMMO 967080e5 2f42 4eb2 a3a9 c58143e835f9: Newton metre squared per Ampere.

NewtonSquareMetrePerSquareKilogram
type: Class
comment: unit of gravitational constant as product of the derived SI unit newton, the power of the SI base unit metre with the exponent 2 divided by the power of the SI base unit kilogram with the exponent 2 -- QUDT
subclass of: Restriction
  has value: 1e+00
subclass of: Restriction
  has value: 0e+00
alternative label: Newton Square Metre Per Square Kilogram
qudtReference: http://qudt.org/vocab/unit/N-M2-PER-KiloGM2
ucumCode: N.m2.kg-2
unitSymbol: N⋅m²/kg²
EMMO 967080e5 2f42 4eb2 a3a9 c58143e835f9: unit of gravitational constant as product of the derived SI unit newton, the power of the SI base unit metre with the exponent 2 divided by the power of the SI base unit kilogram with the exponent 2 -- QUDT

NumberPer100Gram
type: Class
comment: Count of an entity or phenomenon occurrence in one 10th of the SI unit of mass (kilogram). -- QUDT
subclass of: Restriction
  has value: 1e+01
subclass of: Restriction
  has value: 0e+00
alternative label: Number per 100 grams
qudtReference: http://qudt.org/vocab/unit/NUM-PER-HectoGM
ucumCode: {#}.hg-1
unitSymbol: /hg
EMMO 967080e5 2f42 4eb2 a3a9 c58143e835f9: Count of an entity or phenomenon occurrence in one 10th of the SI unit of mass (kilogram). -- QUDT

NumberPerCubicMetre
type: Class
subclass of: Restriction
  has value: 0e+00
subclass of: Restriction
  has value: 1e+00
alternative label: Number per cubic metre
qudtReference: http://qudt.org/vocab/unit/NUM-PER-M3
ucumCode: {#}.m-3
unitSymbol: /m³

NumberPerGram
type: Class
subclass of: Restriction
  has value: 0e+00
subclass of: Restriction
  has value: 1e+03
alternative label: Number per gram
qudtReference: http://qudt.org/vocab/unit/NUM-PER-GM
ucumCode: {#}.g-1
unitSymbol: /g

NumberPerHectare
type: Class
comment: Count of an entity or phenomenon's occurrence in 10,000 times the SI unit area (square metre). -- QUDT
subclass of: Restriction
  has value: 0e+00
subclass of: Restriction
  has value: 1e+06
alternative label: Number per hectare
qudtReference: http://qudt.org/vocab/unit/NUM-PER-HA
ucumCode: {#}.har-1
unitSymbol: /ha
EMMO 967080e5 2f42 4eb2 a3a9 c58143e835f9: Count of an entity or phenomenon's occurrence in 10,000 times the SI unit area (square metre). -- QUDT

NumberPerHour
type: Class
subclass of: Restriction
  has value: 2.777778e-04
subclass of: Restriction
  has value: 0e+00
alternative label: Number per hour
qudtReference: http://qudt.org/vocab/unit/NUM-PER-HR
ucumCode: {#}.h-1
unitSymbol: /hr

NumberPerLitre
type: Class
subclass of: Restriction
  has value: 1e+03
subclass of: Restriction
  has value: 0e+00
alternative label: Number per litre
qudtReference: http://qudt.org/vocab/unit/NUM-PER-L
ucumCode: {#}.L-1
unitSymbol: /L

NumberPerMetre
type: Class
comment: Unavailable. -- QUDT
subclass of: Restriction
  has value: 1e+00
subclass of: Restriction
  has value: 0e+00
alternative label: Number per metre
qudtReference: http://qudt.org/vocab/unit/NUM-PER-M
ucumCode: {#}.m-1
unitSymbol: /m
EMMO 967080e5 2f42 4eb2 a3a9 c58143e835f9: Unavailable. -- QUDT

NumberPerMicroLitre
type: Class
subclass of: Restriction
  has value: 1e+09
subclass of: Restriction
  has value: 0e+00
alternative label: Number per microlitre
qudtReference: http://qudt.org/vocab/unit/NUM-PER-MicroL
ucumCode: {#}.uL-1
unitSymbol: /µL

NumberPerMilliGram
type: Class
comment: Count of an entity or phenomenon occurrence in one millionth of the SI unit of mass (kilogram). -- QUDT
subclass of: Restriction
  has value: 1e+06
subclass of: Restriction
  has value: 0e+00
alternative label: Number per milligram
qudtReference: http://qudt.org/vocab/unit/NUM-PER-MilliGM
ucumCode: {#}.mg-1
unitSymbol: /mg
EMMO 967080e5 2f42 4eb2 a3a9 c58143e835f9: Count of an entity or phenomenon occurrence in one millionth of the SI unit of mass (kilogram). -- QUDT

NumberPerNanoLitre
type: Class
subclass of: Restriction
  has value: 0e+00
subclass of: Restriction
  has value: 2.147484e+09
alternative label: Number per nanolitre
qudtReference: http://qudt.org/vocab/unit/NUM-PER-NanoL
ucumCode: {#}.nL-1
unitSymbol: /nL

NumberPerSquareCentiMetrePerThousandYear
type: Class
subclass of: Restriction
  has value: 3.168809e-07
subclass of: Restriction
  has value: 0e+00
alternative label: Number per square centimetre per thousand years
qudtReference: http://qudt.org/vocab/unit/NUM-PER-CentiM-KiloYR
ucumCode: {#}.cm-2.ka-1
unitSymbol: /(cm⋅1000 yr)

NumberPerSquareKiloMetre
type: Class
subclass of: Restriction
  has value: 1e-06
subclass of: Restriction
  has value: 0e+00
alternative label: Number per square kilometre
qudtReference: http://qudt.org/vocab/unit/NUM-PER-KiloM2
ucumCode: {#}.km-2
unitSymbol: /km²

NumberPerSquareMetre
type: Class
subclass of: Restriction
  has value: 0e+00
subclass of: Restriction
  has value: 1e+00
alternative label: Number per square metre
qudtReference: http://qudt.org/vocab/unit/NUM-PER-M2
ucumCode: {#}.m-2
unitSymbol: /m²

NumberPerSquareMetrePerDay
type: Class
subclass of: Restriction
  has value: 1.157407e-05
subclass of: Restriction
  has value: 0e+00
alternative label: Number per square metre per day
qudtReference: http://qudt.org/vocab/unit/NUM-PER-M2-DAY
ucumCode: {#}.m-2.d-1
unitSymbol: /(m²⋅day)

NumberPerYear
type: Class
comment: "Number per Year" is a unit for 'Frequency' expressed as #/yr. -- QUDT
subclass of: Restriction
  has value: 3.168809e-08
subclass of: Restriction
  has value: 0e+00
alternative label: Number per Year
qudtReference: http://qudt.org/vocab/unit/NUM-PER-YR
ucumCode: {#}.a-1
unitSymbol: #/yr
EMMO 967080e5 2f42 4eb2 a3a9 c58143e835f9: "Number per Year" is a unit for 'Frequency' expressed as #/yr. -- QUDT

Oct
type: Class
comment: An octave is a doubling or halving of a frequency. One oct is the logarithmic frequency interval between f1 and f2 when f2/f1 = 2. -- QUDT
subclass of: Restriction
  has value: 0e+00
subclass of: Restriction
  has value: 1e+00
qudtReference: http://qudt.org/vocab/unit/OCT
unitSymbol: oct
EMMO 967080e5 2f42 4eb2 a3a9 c58143e835f9: An octave is a doubling or halving of a frequency. One oct is the logarithmic frequency interval between f1 and f2 when f2/f1 = 2. -- QUDT
wikipediaReference: http://en.wikipedia.org/wiki/Octave_(electronics)

Oersted
type: Class
comment: Oersted (abbreviated as Oe) is the unit of magnetizing field (also known as H-field, magnetic field strength or intensity) in the CGS system of units. -- QUDT
subclass of: Restriction
  has value: 7.957747e+01
subclass of: Restriction
  has value: 0e+00
qudtReference: http://qudt.org/vocab/unit/OERSTED
ucumCode: Oe
unitSymbol: Oe
EMMO 967080e5 2f42 4eb2 a3a9 c58143e835f9: Oersted (abbreviated as Oe) is the unit of magnetizing field (also known as H-field, magnetic field strength or intensity) in the CGS system of units. -- QUDT
wikipediaReference: http://en.wikipedia.org/wiki/Oersted

OerstedCentiMetre
type: Class
comment: "Oersted Centimeter" is a C.G.S System unit for 'Magnetomotive Force' expressed as Oe-cm. -- QUDT
subclass of: Restriction
  has value: 0e+00
subclass of: Restriction
  has value: 7.957747e-01
alternative label: Oersted Centimetre
qudtReference: http://qudt.org/vocab/unit/OERSTED-CentiM
ucumCode: Oe.cm
unitSymbol: Oe⋅cm
EMMO 967080e5 2f42 4eb2 a3a9 c58143e835f9: "Oersted Centimeter" is a C.G.S System unit for 'Magnetomotive Force' expressed as Oe-cm. -- QUDT

OhmMetre
type: Class
comment: Ohm metre.
subclass of: Restriction
  has value: 0e+00
subclass of: Restriction
  has value: 1e+00
qudtReference: http://qudt.org/vocab/unit/OHM-M
ucumCode: Ohm.m
unitSymbol: Ω⋅m
EMMO 967080e5 2f42 4eb2 a3a9 c58143e835f9: Ohm metre.

OhmSquareMetrePerMetre
type: Class
comment: Ohm square metre per metre.
subclass of: Restriction
  has value: 1e+00
subclass of: Restriction
  has value: 0e+00
qudtReference: http://qudt.org/vocab/unit/OHM-M2-PER-M
ucumCode: Ohm2.m.m-1
unitSymbol: Ω⋅m²/m
EMMO 967080e5 2f42 4eb2 a3a9 c58143e835f9: Ohm square metre per metre.

OunceMass
type: Class
comment: An ounce of mass is 1/16th of a pound of mass, based on the international standard definition of the pound as exactly 0.45359237 kg. -- QUDT
subclass of: Restriction
  has value: 2.834952e-02
subclass of: Restriction
  has value: 0e+00
alternative label: Ounce Mass
qudtReference: http://qudt.org/vocab/unit/OZ
ucumCode: [oz_av]
unitSymbol: oz
EMMO 967080e5 2f42 4eb2 a3a9 c58143e835f9: An ounce of mass is 1/16th of a pound of mass, based on the international standard definition of the pound as exactly 0.45359237 kg. -- QUDT

OunceTroy
type: Class
comment: An obsolete unit of mass; the Troy Ounce is 1/12th of a Troy Pound. Based on the international definition of a Troy Pound as 5760 grains, the Troy Ounce is exactly 480 grains, or 0.0311034768 kg. -- QUDT
subclass of: Restriction
  has value: 3.110348e-02
subclass of: Restriction
  has value: 0e+00
alternative label: Ounce Troy
qudtReference: http://qudt.org/vocab/unit/OZ_TROY
ucumCode: [oz_tr]
unitSymbol: oz{Troy}
EMMO 967080e5 2f42 4eb2 a3a9 c58143e835f9: An obsolete unit of mass; the Troy Ounce is 1/12th of a Troy Pound. Based on the international definition of a Troy Pound as 5760 grains, the Troy Ounce is exactly 480 grains, or 0.0311034768 kg. -- QUDT

Oz_Ft
type: Class
comment: unit of the unbalance as a product of avoirdupois ounce according to the avoirdupois system of units and foot according to the Anglo-American and Imperial system of units -- QUDT
subclass of: Restriction
  has value: 8.6409e-03
subclass of: Restriction
  has value: 0e+00
alternative label: Ounce (avoirdupois) Foot
qudtReference: http://qudt.org/vocab/unit/OZ-FT
ucumCode: [oz_av].[ft_i]
unitSymbol: oz⋅ft
EMMO 967080e5 2f42 4eb2 a3a9 c58143e835f9: unit of the unbalance as a product of avoirdupois ounce according to the avoirdupois system of units and foot according to the Anglo-American and Imperial system of units -- QUDT

Oz_In
type: Class
comment: unit of the unbalance as a product of avoirdupois ounce according to the avoirdupois system of units and inch according to the Anglo-American and Imperial system of units -- QUDT
subclass of: Restriction
  has value: 0e+00
subclass of: Restriction
  has value: 6.94563e-04
alternative label: Ounce (avoirdupois) Inch
qudtReference: http://qudt.org/vocab/unit/OZ-IN
ucumCode: [oz_av].[in_i]
unitSymbol: oz⋅in
EMMO 967080e5 2f42 4eb2 a3a9 c58143e835f9: unit of the unbalance as a product of avoirdupois ounce according to the avoirdupois system of units and inch according to the Anglo-American and Imperial system of units -- QUDT

Oz_Per_Day
type: Class
comment: traditional unit of the mass avoirdupois ounce according to the avoirdupois system of units divided by the unit for time day -- QUDT
subclass of: Restriction
  has value: 0e+00
subclass of: Restriction
  has value: 3.2812e-07
alternative label: Ounce (avoirdupois) Per Day
qudtReference: http://qudt.org/vocab/unit/OZ-PER-DAY
ucumCode: [oz_av].d-1
unitSymbol: oz/day
EMMO 967080e5 2f42 4eb2 a3a9 c58143e835f9: traditional unit of the mass avoirdupois ounce according to the avoirdupois system of units divided by the unit for time day -- QUDT

Oz_Per_Gal_Uk
type: Class
comment: unit of the density according to the Imperial system of units -- QUDT
subclass of: Restriction
  has value: 6.236e+00
subclass of: Restriction
  has value: 0e+00
alternative label: Ounce (avoirdupois) Per Gallon (UK)
qudtReference: http://qudt.org/vocab/unit/OZ-PER-GAL_UK
ucumCode: [oz_av].[gal_br]-1
unitSymbol: oz/gal{UK}
EMMO 967080e5 2f42 4eb2 a3a9 c58143e835f9: unit of the density according to the Imperial system of units -- QUDT

Oz_Per_Gal_Us
type: Class
comment: unit of the density according to the Anglo-American system of units -- QUDT
subclass of: Restriction
  has value: 7.8125e+00
subclass of: Restriction
  has value: 0e+00
alternative label: Ounce (avoirdupois) Per Gallon (US)
qudtReference: http://qudt.org/vocab/unit/OZ-PER-GAL_US
ucumCode: [oz_av].[gal_us]-1
unitSymbol: oz/gal{US}
EMMO 967080e5 2f42 4eb2 a3a9 c58143e835f9: unit of the density according to the Anglo-American system of units -- QUDT

Oz_Per_Hr
type: Class
comment: traditional unit of the mass avoirdupois ounce according to the avoirdupois system of units divided by the unit for time hour -- QUDT
subclass of: Restriction
  has value: 7.87487e-06
subclass of: Restriction
  has value: 0e+00
alternative label: Ounce (avoirdupois) Per Hour
qudtReference: http://qudt.org/vocab/unit/OZ-PER-HR
ucumCode: [oz_av].h-1
unitSymbol: oz/hr
EMMO 967080e5 2f42 4eb2 a3a9 c58143e835f9: traditional unit of the mass avoirdupois ounce according to the avoirdupois system of units divided by the unit for time hour -- QUDT

Oz_Per_Min
type: Class
comment: traditional unit of the mass avoirdupois ounce according to the avoirdupois system of units divided by the unit for time minute -- QUDT
subclass of: Restriction
  has value: 0e+00
subclass of: Restriction
  has value: 4.72492e-04
alternative label: Ounce (avoirdupois) Per Minute
qudtReference: http://qudt.org/vocab/unit/OZ-PER-MIN
ucumCode: [oz_av].min-1
unitSymbol: oz/min
EMMO 967080e5 2f42 4eb2 a3a9 c58143e835f9: traditional unit of the mass avoirdupois ounce according to the avoirdupois system of units divided by the unit for time minute -- QUDT

Oz_Per_Sec
type: Class
comment: traditional unit of the mass avoirdupois ounce according to the avoirdupois system of units divided by the SI base unit second -- QUDT
subclass of: Restriction
  has value: 2.834952e-02
subclass of: Restriction
  has value: 0e+00
alternative label: Ounce (avoirdupois) Per Second
qudtReference: http://qudt.org/vocab/unit/OZ-PER-SEC
ucumCode: [oz_av].s-1
unitSymbol: oz/s
EMMO 967080e5 2f42 4eb2 a3a9 c58143e835f9: traditional unit of the mass avoirdupois ounce according to the avoirdupois system of units divided by the SI base unit second -- QUDT

Oz_Per_Yd3
type: Class
comment: unit ounce according to the avoirdupois system of units divided by the power of the unit yard according to the Anglo-American and the Imperial system of units with the exponent 3 -- QUDT
subclass of: Restriction
  has value: 3.70798e-02
subclass of: Restriction
  has value: 0e+00
alternative label: Ounce (avoirdupois) Per Cubic Yard
qudtReference: http://qudt.org/vocab/unit/OZ-PER-YD3
ucumCode: [oz_av].[cyd_i]-1
unitSymbol: oz/yd³
EMMO 967080e5 2f42 4eb2 a3a9 c58143e835f9: unit ounce according to the avoirdupois system of units divided by the power of the unit yard according to the Anglo-American and the Imperial system of units with the exponent 3 -- QUDT

Oz_Vol_Uk
type: Class
comment: unit of the volume for fluids according to the Imperial system of units -- QUDT
subclass of: Restriction
  has value: 2.841306e-05
subclass of: Restriction
  has value: 0e+00
alternative label: Fluid Ounce (UK)
qudtReference: http://qudt.org/vocab/unit/OZ_VOL_UK
ucumCode: [foz_br]
unitSymbol: oz{UK}
EMMO 967080e5 2f42 4eb2 a3a9 c58143e835f9: unit of the volume for fluids according to the Imperial system of units -- QUDT

Oz_Vol_Uk_Per_Day
type: Class
comment: unit of the volume fluid ounce (UK) for fluids according to the Imperial system of units divided by the unit for time day -- QUDT
subclass of: Restriction
  has value: 7.87487e-06
subclass of: Restriction
  has value: 0e+00
alternative label: Ounce (UK Fluid) Per Day
qudtReference: http://qudt.org/vocab/unit/OZ_VOL_UK-PER-DAY
ucumCode: [foz_br].d-1
unitSymbol: oz{UK}/day
EMMO 967080e5 2f42 4eb2 a3a9 c58143e835f9: unit of the volume fluid ounce (UK) for fluids according to the Imperial system of units divided by the unit for time day -- QUDT

Oz_Vol_Uk_Per_Hr
type: Class
comment: unit of the volume fluid ounce (UK) for fluids according to the Imperial system of units divided by the unit for time hour -- QUDT
subclass of: Restriction
  has value: 7.87487e-06
subclass of: Restriction
  has value: 0e+00
alternative label: Ounce (UK Fluid) Per Hour
qudtReference: http://qudt.org/vocab/unit/OZ_VOL_UK-PER-HR
ucumCode: [foz_br].h-1
unitSymbol: oz{UK}/hr
EMMO 967080e5 2f42 4eb2 a3a9 c58143e835f9: unit of the volume fluid ounce (UK) for fluids according to the Imperial system of units divided by the unit for time hour -- QUDT

Oz_Vol_Uk_Per_Min
type: Class
comment: unit of the volume fluid ounce (UK) for fluids according to the Imperial system of units divided by the unit for time minute -- QUDT
subclass of: Restriction
  has value: 4.72492e-03
subclass of: Restriction
  has value: 0e+00
alternative label: Ounce (UK Fluid) Per Minute
qudtReference: http://qudt.org/vocab/unit/OZ_VOL_UK-PER-MIN
ucumCode: [foz_br].min-1
unitSymbol: oz{UK}/min
EMMO 967080e5 2f42 4eb2 a3a9 c58143e835f9: unit of the volume fluid ounce (UK) for fluids according to the Imperial system of units divided by the unit for time minute -- QUDT

Oz_Vol_Uk_Per_Sec
type: Class
comment: unit of the volume fluid ounce (UK) for fluids according to the Imperial system of units divided by the SI base unit second -- QUDT
subclass of: Restriction
  has value: 2.84e-05
subclass of: Restriction
  has value: 0e+00
alternative label: Ounce (UK Fluid) Per Second
qudtReference: http://qudt.org/vocab/unit/OZ_VOL_UK-PER-SEC
ucumCode: [foz_br].s-1
unitSymbol: oz{UK}/s
EMMO 967080e5 2f42 4eb2 a3a9 c58143e835f9: unit of the volume fluid ounce (UK) for fluids according to the Imperial system of units divided by the SI base unit second -- QUDT

Oz_Vol_Us_Per_Day
type: Class
comment: unit of the volume fluid ounce (US) for fluids according to the Anglo-American system of units divided by unit for time day -- QUDT
subclass of: Restriction
  has value: 0e+00
subclass of: Restriction
  has value: 3.42286e-10
alternative label: Ounce (US Fluid) Per Day
qudtReference: http://qudt.org/vocab/unit/OZ_VOL_US-PER-DAY
ucumCode: [foz_us].d-1
unitSymbol: oz{US}/day
EMMO 967080e5 2f42 4eb2 a3a9 c58143e835f9: unit of the volume fluid ounce (US) for fluids according to the Anglo-American system of units divided by unit for time day -- QUDT

Oz_Vol_Us_Per_Hr
type: Class
comment: unit of the volume fluid ounce (US) for fluids according to the Anglo-American system of units divided by the unit for time hour -- QUDT
subclass of: Restriction
  has value: 8.214869e-09
subclass of: Restriction
  has value: 0e+00
alternative label: Ounce (US Fluid) Per Hour
qudtReference: http://qudt.org/vocab/unit/OZ_VOL_US-PER-HR
ucumCode: [foz_us].h-1
unitSymbol: oz{US}/hr
EMMO 967080e5 2f42 4eb2 a3a9 c58143e835f9: unit of the volume fluid ounce (US) for fluids according to the Anglo-American system of units divided by the unit for time hour -- QUDT

Oz_Vol_Us_Per_Min
type: Class
comment: unit of the volume fluid ounce (US) for fluids according to the Anglo-American system of units divided by the unit for time minute -- QUDT
subclass of: Restriction
  has value: 4.92892e-07
subclass of: Restriction
  has value: 0e+00
alternative label: Ounce (US Fluid) Per Minute
qudtReference: http://qudt.org/vocab/unit/OZ_VOL_US-PER-MIN
ucumCode: [foz_us].min-1
unitSymbol: oz{US}/min
EMMO 967080e5 2f42 4eb2 a3a9 c58143e835f9: unit of the volume fluid ounce (US) for fluids according to the Anglo-American system of units divided by the unit for time minute -- QUDT

Oz_Vol_Us_Per_Sec
type: Class
comment: unit of the volume fluid ounce (US) for fluids according to the Anglo-American system of units divided by the SI base unit second -- QUDT
subclass of: Restriction
  has value: 2.957353e-05
subclass of: Restriction
  has value: 0e+00
alternative label: Ounce (US Fluid) Per Second
qudtReference: http://qudt.org/vocab/unit/OZ_VOL_US-PER-SEC
ucumCode: [foz_us].s-1
unitSymbol: oz{US}/s
EMMO 967080e5 2f42 4eb2 a3a9 c58143e835f9: unit of the volume fluid ounce (US) for fluids according to the Anglo-American system of units divided by the SI base unit second -- QUDT

Parsec
type: Class
comment: The parsec (parallax of one arcsecond; symbol: pc) is a unit of length, equal to just under 31 trillion (31 × 10¹²) kilometres (about 19 trillion miles), 206265 AU, or about 3.26 light-years. The parsec measurement unit is used in astronomy. It is defined as the length of the adjacent side of an imaginary right triangle in space. The two dimensions that specify this triangle are the parallax angle (defined as 1 arcsecond) and the opposite side (defined as 1 astronomical unit (AU), the distance from the Earth to the Sun). Given these two measurements, along with the rules of trigonometry, the length of the adjacent side (the parsec) can be found. -- QUDT
subclass of: Restriction
  has value: 0e+00
subclass of: Restriction
  has value: 3.085678e+16
qudtReference: http://qudt.org/vocab/unit/PARSEC
ucumCode: pc
unitSymbol: pc
EMMO 967080e5 2f42 4eb2 a3a9 c58143e835f9: The parsec (parallax of one arcsecond; symbol: pc) is a unit of length, equal to just under 31 trillion (31 × 10¹²) kilometres (about 19 trillion miles), 206265 AU, or about 3.26 light-years. The parsec measurement unit is used in astronomy. It is defined as the length of the adjacent side of an imaginary right triangle in space. The two dimensions that specify this triangle are the parallax angle (defined as 1 arcsecond) and the opposite side (defined as 1 astronomical unit (AU), the distance from the Earth to the Sun). Given these two measurements, along with the rules of trigonometry, the length of the adjacent side (the parsec) can be found. -- QUDT

PartPerBillion
type: Class
comment: Dimensionless unit for concentration. Recommended practice is to use specific units such as ug/l. -- QUDT
subclass of: Restriction
  has value: 1e-09
subclass of: Restriction
  has value: 0e+00
alternative label: Parts per billion
qudtReference: http://qudt.org/vocab/unit/PPB
ucumCode: [ppb]
unitSymbol: PPB
EMMO 967080e5 2f42 4eb2 a3a9 c58143e835f9: Dimensionless unit for concentration. Recommended practice is to use specific units such as ug/l. -- QUDT

PartPerMillion
type: Class
comment: Dimensionless unit for concentration. Recommended practice is to use specific units such as ug/l. -- QUDT
subclass of: Restriction
  has value: 1e-06
subclass of: Restriction
  has value: 0e+00
alternative label: Parts per million
qudtReference: http://qudt.org/vocab/unit/PPM
ucumCode: [ppm]
unitSymbol: PPM
EMMO 967080e5 2f42 4eb2 a3a9 c58143e835f9: Dimensionless unit for concentration. Recommended practice is to use specific units such as ug/l. -- QUDT

PartPerMillionPerKelvin
type: Class
comment: Unit for expansion ratios expressed as parts per million per Kelvin. -- QUDT
subclass of: Restriction
  has value: 1e-06
subclass of: Restriction
  has value: 0e+00
alternative label: Parts Per Million per Kelvin
qudtReference: http://qudt.org/vocab/unit/PPM-PER-K
ucumCode: ppm.K-1
unitSymbol: PPM/K
EMMO 967080e5 2f42 4eb2 a3a9 c58143e835f9: Unit for expansion ratios expressed as parts per million per Kelvin. -- QUDT

PartPerTenMillion
type: Class
comment: Dimensionless unit for concentration. Recommended practice is to use specific units such as ug/l. -- QUDT
subclass of: Restriction
  has value: 1e-07
subclass of: Restriction
  has value: 0e+00
alternative label: Parts per Ten Million
qudtReference: http://qudt.org/vocab/unit/PPTM
unitSymbol: PPTM
EMMO 967080e5 2f42 4eb2 a3a9 c58143e835f9: Dimensionless unit for concentration. Recommended practice is to use specific units such as ug/l. -- QUDT

PartPerTenMillionPerKelvin
type: Class
comment: Unit for expansion ratios expressed as parts per ten million per Kelvin. -- QUDT
subclass of: Restriction
  has value: 1e-07
subclass of: Restriction
  has value: 0e+00
alternative label: Parts Per Ten Million per Kelvin
qudtReference: http://qudt.org/vocab/unit/PPTM-PER-K
unitSymbol: PPTM/K
EMMO 967080e5 2f42 4eb2 a3a9 c58143e835f9: Unit for expansion ratios expressed as parts per ten million per Kelvin. -- QUDT

PartPerThousand
type: Class
comment: Dimensionless unit for concentration. Recommended practice is to use specific units such as ug/l. -- QUDT
subclass of: Restriction
  has value: 0e+00
subclass of: Restriction
  has value: 1e-03
alternative label: Parts per thousand
qudtReference: http://qudt.org/vocab/unit/PPTH
ucumCode: [ppth]
unitSymbol: ‰
EMMO 967080e5 2f42 4eb2 a3a9 c58143e835f9: Dimensionless unit for concentration. Recommended practice is to use specific units such as ug/l. -- QUDT

PartPerThousandPerHour
type: Class
subclass of: Restriction
  has value: 2.777778e-07
subclass of: Restriction
  has value: 0e+00
alternative label: Parts per thousand per hour
qudtReference: http://qudt.org/vocab/unit/PPTH-PER-HR
ucumCode: [ppth].h-1
unitSymbol: ‰/hr

PartPerTrillion
type: Class
comment: Dimensionless unit for concentration. Recommended practice is to use specific units such as ug/l. -- QUDT
subclass of: Restriction
  has value: 0e+00
subclass of: Restriction
  has value: 1e-12
alternative label: Parts per trillion
qudtReference: http://qudt.org/vocab/unit/PPTR
ucumCode: [pptr]
unitSymbol: PPTR
EMMO 967080e5 2f42 4eb2 a3a9 c58143e835f9: Dimensionless unit for concentration. Recommended practice is to use specific units such as ug/l. -- QUDT

PartPerTrillionByVolume
type: Class
subclass of: Restriction
  has value: 1e-12
subclass of: Restriction
  has value: 0e+00
alternative label: Parts per trillion by volume
qudtReference: http://qudt.org/vocab/unit/PPTR_VOL
ucumCode: [pptr]{vol}
unitSymbol: pptr

PascalMetre
type: Class
comment: Pascal metre.
subclass of: Restriction
  has value: 1e+00
subclass of: Restriction
  has value: 0e+00
qudtReference: http://qudt.org/vocab/unit/PA-M
ucumCode: Pa.m
unitSymbol: Pa⋅m
EMMO 967080e5 2f42 4eb2 a3a9 c58143e835f9: Pascal metre.

PascalMetrePerSecond
type: Class
comment: Pascal metre per second.
subclass of: Restriction
  has value: 1e+00
subclass of: Restriction
  has value: 0e+00
qudtReference: http://qudt.org/vocab/unit/PA-M-PER-SEC
ucumCode: Pa.m.s-1
unitSymbol: Pa⋅m/s
EMMO 967080e5 2f42 4eb2 a3a9 c58143e835f9: Pascal metre per second.

PascalMetrePerSquareSecond
type: Class
comment: Pascal metre per square second.
subclass of: Restriction
  has value: 1e+00
subclass of: Restriction
  has value: 0e+00
qudtReference: http://qudt.org/vocab/unit/PA-M-PER-SEC2
ucumCode: Pa.m.s-2
unitSymbol: Pa⋅m/s²
EMMO 967080e5 2f42 4eb2 a3a9 c58143e835f9: Pascal metre per square second.

PascalPerMetre
type: Class
comment: SI derived unit pascal divided by the SI base unit metre -- QUDT
subclass of: Restriction
  has value: 1e+00
subclass of: Restriction
  has value: 0e+00
alternative label: Pascal Per Metre
qudtReference: http://qudt.org/vocab/unit/PA-PER-M
ucumCode: Pa.m-1
ucumCode: Pa/m
unitSymbol: Pa/m
EMMO 967080e5 2f42 4eb2 a3a9 c58143e835f9: SI derived unit pascal divided by the SI base unit metre -- QUDT

PascalPerMinute
type: Class
comment: A rate of change of pressure measured as the number of Pascals in a period of one minute. -- QUDT
subclass of: Restriction
  has value: 1.666667e-02
subclass of: Restriction
  has value: 0e+00
alternative label: Pascal per Minute
qudtReference: http://qudt.org/vocab/unit/PA-PER-MIN
ucumCode: Pa.min-1
unitSymbol: P/min
EMMO 967080e5 2f42 4eb2 a3a9 c58143e835f9: A rate of change of pressure measured as the number of Pascals in a period of one minute. -- QUDT

PascalPerSecond
type: Class
comment: A rate of change of pressure measured as the number of Pascals in a period of one second. -- QUDT
subclass of: Restriction
  has value: 1e+00
subclass of: Restriction
  has value: 0e+00
alternative label: Pascal per Second
qudtReference: http://qudt.org/vocab/unit/PA-PER-SEC
ucumCode: Pa.s-1
ucumCode: Pa/s
unitSymbol: P/s
EMMO 967080e5 2f42 4eb2 a3a9 c58143e835f9: A rate of change of pressure measured as the number of Pascals in a period of one second. -- QUDT

PascalSecondPerCubicMetre
type: Class
comment: `Pascal Second Per Cubic Meter` (Pa-s/m³) is a unit in the category of Acoustic impedance. It is also known as `pascal-second/cubic meter`. It has a dimension of ML⁻⁴T⁻¹ where M is mass, L is length, and T is time. This unit is the standard SI unit in this category. -- QUDT
subclass of: Restriction
  has value: 1e+00
subclass of: Restriction
  has value: 0e+00
alternative label: Pascal Second Per Cubic Metre
qudtReference: http://qudt.org/vocab/unit/PA-SEC-PER-M3
ucumCode: Pa.s.m-3
unitSymbol: Pa⋅s/m³
EMMO 967080e5 2f42 4eb2 a3a9 c58143e835f9: `Pascal Second Per Cubic Meter` (Pa-s/m³) is a unit in the category of Acoustic impedance. It is also known as `pascal-second/cubic meter`. It has a dimension of ML⁻⁴T⁻¹ where M is mass, L is length, and T is time. This unit is the standard SI unit in this category. -- QUDT

PascalSecondPerMetre
type: Class
comment: Pascal Second Per Meter (Pa-s/m) is a unit in the category of Specific acoustic impedance. It is also known as pascal-second/meter. Pascal Second Per Meter has a dimension of ML²T⁻¹ where M is mass, L is length, and T is time. It essentially the same as the corresponding standard SI unit kg/m2· s. -- QUDT
subclass of: Restriction
  has value: 1e+00
subclass of: Restriction
  has value: 0e+00
alternative label: Pascal Second Per Metre
qudtReference: http://qudt.org/vocab/unit/PA-SEC-PER-M
ucumCode: Pa.s.m-1
unitSymbol: Pa⋅s/m
EMMO 967080e5 2f42 4eb2 a3a9 c58143e835f9: Pascal Second Per Meter (Pa-s/m) is a unit in the category of Specific acoustic impedance. It is also known as pascal-second/meter. Pascal Second Per Meter has a dimension of ML²T⁻¹ where M is mass, L is length, and T is time. It essentially the same as the corresponding standard SI unit kg/m2· s. -- QUDT

PebiByte
type: Class
comment: The pebibyte is a standards-based binary multiple (prefix pebi, symbol Pi) of the byte, a unit of digital information storage. The pebibyte unit symbol is PiB. 1 pebibyte = 1125899906842624bytes = 1024 tebibytes The pebibyte is closely related to the petabyte, which is defined as 10¹⁵ bytes = 1,000,000,000,000,000 bytes. -- QUDT
subclass of: Restriction
  some values from: Byte
subclass of: Restriction
  has value: 6.243315e+15
subclass of: Restriction
  has value: 0e+00
qudtReference: http://qudt.org/vocab/unit/PebiBYTE
unitSymbol: PiB
EMMO 967080e5 2f42 4eb2 a3a9 c58143e835f9: The pebibyte is a standards-based binary multiple (prefix pebi, symbol Pi) of the byte, a unit of digital information storage. The pebibyte unit symbol is PiB. 1 pebibyte = 1125899906842624bytes = 1024 tebibytes The pebibyte is closely related to the petabyte, which is defined as 10¹⁵ bytes = 1,000,000,000,000,000 bytes. -- QUDT
wikipediaReference: http://en.wikipedia.org/wiki/Pebibyte

PennyWeight
type: Class
comment: "Penny Weight" is a unit for 'Mass' expressed as dwt. -- QUDT
subclass of: Restriction
  has value: 1.555174e-03
subclass of: Restriction
  has value: 0e+00
alternative label: Penny Weight
qudtReference: http://qudt.org/vocab/unit/DWT
ucumCode: [pwt_tr]
unitSymbol: dwt
EMMO 967080e5 2f42 4eb2 a3a9 c58143e835f9: "Penny Weight" is a unit for 'Mass' expressed as dwt. -- QUDT
wikipediaReference: http://en.wikipedia.org/wiki/Pennyweight

Pennyweight
type: Class
comment: non SI-conforming unit of mass which comes from the Anglo-American Troy or Apothecaries' Weight System of units according to NIST of 1 pwt = 1.555174 10³ kg -- QUDT
subclass of: Restriction
  has value: 1.555174e-03
subclass of: Restriction
  has value: 0e+00
qudtReference: http://qudt.org/vocab/unit/Pennyweight
ucumCode: [pwt_tr]
unitSymbol: dwt
EMMO 967080e5 2f42 4eb2 a3a9 c58143e835f9: non SI-conforming unit of mass which comes from the Anglo-American Troy or Apothecaries' Weight System of units according to NIST of 1 pwt = 1.555174 10³ kg -- QUDT

PerCentiMetre
type: Class
comment: reciprocal of the 0.01-fold of the SI base unit metre -- QUDT
subclass of: Restriction
  has value: 1e+02
subclass of: Restriction
  has value: 0e+00
alternative label: ReciprocalCentimetre
qudtReference: http://qudt.org/vocab/unit/PER-CentiM
ucumCode: /cm
ucumCode: cm-1
unitSymbol: /cm
EMMO 967080e5 2f42 4eb2 a3a9 c58143e835f9: reciprocal of the 0.01-fold of the SI base unit metre -- QUDT

PerCubicCentiMetre
type: Class
comment: reciprocal of the 0.000001-fold of the power of the SI base unit metre with the exponent 3 -- QUDT
subclass of: Restriction
  has value: 0e+00
subclass of: Restriction
  has value: 1e+06
alternative label: ReciprocalCubicCentiMetre
qudtReference: http://qudt.org/vocab/unit/PER-CentiM3
ucumCode: cm-3
unitSymbol: /cm³
EMMO 967080e5 2f42 4eb2 a3a9 c58143e835f9: reciprocal of the 0.000001-fold of the power of the SI base unit metre with the exponent 3 -- QUDT

PerCubicMetre
type: Class
comment: "Per Cubic Meter" is a denominator unit with dimensions /m³. -- QUDT
subclass of: Restriction
  has value: 1e+00
subclass of: Restriction
  has value: 0e+00
alternative label: Reciprocal Cubic Metre
qudtReference: http://qudt.org/vocab/unit/PER-M3
ucumCode: /m3
ucumCode: m-3
unitSymbol: /m³
EMMO 967080e5 2f42 4eb2 a3a9 c58143e835f9: "Per Cubic Meter" is a denominator unit with dimensions /m³. -- QUDT

PerCubicMetreSecond
type: Class
comment: Per cubic metre and second.
subclass of: Restriction
  has value: 1e+00
subclass of: Restriction
  has value: 0e+00
qudtReference: http://qudt.org/vocab/unit/PER-M3-SEC
ucumCode: m-3.s-1
unitSymbol: /(m³⋅s)
EMMO 967080e5 2f42 4eb2 a3a9 c58143e835f9: Per cubic metre and second.

PerCubicMilliMetre
type: Class
comment: reciprocal value of the 0.000000001-fold of the power of the SI base unit metre with the exponent 3 -- QUDT
subclass of: Restriction
  has value: 1e+09
subclass of: Restriction
  has value: 0e+00
alternative label: ReciprocalCubicMilliMetre
qudtReference: http://qudt.org/vocab/unit/PER-MilliM3
ucumCode: mm-3
unitSymbol: /mm³
EMMO 967080e5 2f42 4eb2 a3a9 c58143e835f9: reciprocal value of the 0.000000001-fold of the power of the SI base unit metre with the exponent 3 -- QUDT

PerHenry
type: Class
comment: Reciprocal Henry.
subclass of: Restriction
  has value: 1e+00
subclass of: Restriction
  has value: 0e+00
alternative label: ReciprocalHenry
qudtReference: http://qudt.org/vocab/unit/PER-H
ucumCode: H-1
unitSymbol: /H
EMMO 967080e5 2f42 4eb2 a3a9 c58143e835f9: Reciprocal Henry.

PerJouleCubicMetre
type: Class
comment: Per Joule cubic metre.
subclass of: Restriction
  has value: 0e+00
subclass of: Restriction
  has value: 1e+00
qudtReference: http://qudt.org/vocab/unit/PER-J-M3
ucumCode: J-1.m-3
unitSymbol: /(J⋅m³)
EMMO 967080e5 2f42 4eb2 a3a9 c58143e835f9: Per Joule cubic metre.

PerKelvin
type: Class
comment: Per Kelvin Unit is a denominator unit with dimensions /K. -- QUDT
subclass of: Restriction
  has value: 1e+00
subclass of: Restriction
  has value: 0e+00
alternative label: Reciprocal Kelvin
qudtReference: http://qudt.org/vocab/unit/PER-K
ucumCode: K-1
unitSymbol: /K
EMMO 967080e5 2f42 4eb2 a3a9 c58143e835f9: Per Kelvin Unit is a denominator unit with dimensions /K. -- QUDT

PerKiloMetre
type: Class
comment: Per Kilometer Unit is a denominator unit with dimensions /km. -- QUDT
subclass of: Restriction
  has value: 1e-03
subclass of: Restriction
  has value: 0e+00
alternative label: ReciprocalKiloMetre
qudtReference: http://qudt.org/vocab/unit/PER-KiloM
ucumCode: /km
ucumCode: km-1
unitSymbol: /km
EMMO 967080e5 2f42 4eb2 a3a9 c58143e835f9: Per Kilometer Unit is a denominator unit with dimensions /km. -- QUDT

PerMetre
type: Class
comment: Per Meter Unit is a denominator unit with dimensions /m. -- QUDT
subclass of: Restriction
  has value: 1e+00
subclass of: Restriction
  has value: 0e+00
alternative label: Reciprocal metre
qudtReference: http://qudt.org/vocab/unit/PER-M
ucumCode: /m
ucumCode: m-1
unitSymbol: /m
EMMO 967080e5 2f42 4eb2 a3a9 c58143e835f9: Per Meter Unit is a denominator unit with dimensions /m. -- QUDT

PerMetreKelvin
type: Class
comment: Per Meter Kelvin Unit is a denominator unit with dimensions /m.k. -- QUDT
subclass of: Restriction
  has value: 1e+00
subclass of: Restriction
  has value: 0e+00
alternative label: ReciprocalMetreKelvin
qudtReference: http://qudt.org/vocab/unit/PER-M-K
ucumCode: m-1.K-1
unitSymbol: /(m⋅K)
EMMO 967080e5 2f42 4eb2 a3a9 c58143e835f9: Per Meter Kelvin Unit is a denominator unit with dimensions /m.k. -- QUDT

PerMetreNanoMetre
type: Class
comment: Per metre and nanometre.
subclass of: Restriction
  has value: 1e+09
subclass of: Restriction
  has value: 0e+00
alternative label: ReciprocalMetreNanoMetre
qudtReference: http://qudt.org/vocab/unit/PER-M-NanoM
ucumCode: m-1.nm-1
unitSymbol: /(m⋅nm)
EMMO 967080e5 2f42 4eb2 a3a9 c58143e835f9: Per metre and nanometre.

PerMetreNanoMetreSteradian
type: Class
comment: Per metre and nanometre and steradian.
subclass of: Restriction
  has value: 1e+09
subclass of: Restriction
  has value: 0e+00
alternative label: ReciprocalMetreNanoMetreSteradian
qudtReference: http://qudt.org/vocab/unit/PER-M-NanoM-SR
ucumCode: m-1.nm-1.sr-1
unitSymbol: /(m⋅nm⋅sr)
EMMO 967080e5 2f42 4eb2 a3a9 c58143e835f9: Per metre and nanometre and steradian.

PerMetreSecond
type: Class
comment: Per metre and second.
subclass of: Restriction
  has value: 1e+00
subclass of: Restriction
  has value: 0e+00
alternative label: ReciprocalMetreSecond
qudtReference: http://qudt.org/vocab/unit/PER-M-SEC
ucumCode: m-1.s-1
unitSymbol: /(m⋅s)
EMMO 967080e5 2f42 4eb2 a3a9 c58143e835f9: Per metre and second.

PerMetreSteradian
type: Class
comment: Per metre and steradian.
subclass of: Restriction
  has value: 1e+00
subclass of: Restriction
  has value: 0e+00
alternative label: ReciprocalMetreSteradian
qudtReference: http://qudt.org/vocab/unit/PER-M-SR
ucumCode: m-1.sr-1
unitSymbol: /(m⋅sr)
EMMO 967080e5 2f42 4eb2 a3a9 c58143e835f9: Per metre and steradian.

PerMicroMetre
type: Class
comment: Per Micrometer Unit is a denominator unit with dimensions /microm. -- QUDT
subclass of: Restriction
  has value: 1e+06
subclass of: Restriction
  has value: 0e+00
alternative label: ReciprocalMicroMetre
qudtReference: http://qudt.org/vocab/unit/PER-MicroM
ucumCode: /um
ucumCode: um-1
unitSymbol: /µm
EMMO 967080e5 2f42 4eb2 a3a9 c58143e835f9: Per Micrometer Unit is a denominator unit with dimensions /microm. -- QUDT

PerMilliMetre
type: Class
comment: Per Millimeter Unit is a denominator unit with dimensions /mm. -- QUDT
subclass of: Restriction
  has value: 1e+03
subclass of: Restriction
  has value: 0e+00
alternative label: ReciprocalMilliMetre
qudtReference: http://qudt.org/vocab/unit/PER-MilliM
ucumCode: /mm
ucumCode: mm-1
unitSymbol: /mm
EMMO 967080e5 2f42 4eb2 a3a9 c58143e835f9: Per Millimeter Unit is a denominator unit with dimensions /mm. -- QUDT

PerMilliSecond
type: Class
comment: Per millisecond.
subclass of: Restriction
  has value: 1e+03
subclass of: Restriction
  has value: 0e+00
alternative label: ReciprocalMilliSecond
qudtReference: http://qudt.org/vocab/unit/PER-MilliSEC
ucumCode: ms-1
unitSymbol: /ms
EMMO 967080e5 2f42 4eb2 a3a9 c58143e835f9: Per millisecond.

PerMole
type: Class
comment: Per Mole Unit is a denominator unit with dimensions mol⁻¹. -- QUDT
subclass of: Restriction
  has value: 0e+00
subclass of: Restriction
  has value: 1e+00
alternative label: ReciprocalMole
qudtReference: http://qudt.org/vocab/unit/PER-MOL
ucumCode: mol-1
unitSymbol: /mol
EMMO 967080e5 2f42 4eb2 a3a9 c58143e835f9: Per Mole Unit is a denominator unit with dimensions mol⁻¹. -- QUDT

PerNanoMetre
type: Class
comment: Per Nanometer Unit is a denominator unit with dimensions /nm. -- QUDT
subclass of: Restriction
  has value: 1e+09
subclass of: Restriction
  has value: 0e+00
alternative label: ReciprocalNanoMetre
qudtReference: http://qudt.org/vocab/unit/PER-NanoM
ucumCode: /nm
ucumCode: nm-1
unitSymbol: /nm
EMMO 967080e5 2f42 4eb2 a3a9 c58143e835f9: Per Nanometer Unit is a denominator unit with dimensions /nm. -- QUDT

PerPascal
type: Class
comment: Per Pascal.
subclass of: Restriction
  has value: 0e+00
subclass of: Restriction
  has value: 1e+00
alternative label: ReciprocalPascal
qudtReference: http://qudt.org/vocab/unit/PER-PA
ucumCode: Pa-1
unitSymbol: /Pa
EMMO 967080e5 2f42 4eb2 a3a9 c58143e835f9: Per Pascal.
wikipediaReference: http://en.wikipedia.org/wiki/Pascal

PerPascalSecond
type: Class
comment: Per Pascal and Second.
subclass of: Restriction
  has value: 1e+00
subclass of: Restriction
  has value: 0e+00
qudtReference: http://qudt.org/vocab/unit/PER-PA-SEC
ucumCode: Pa-1.s-1
unitSymbol: /(Pa⋅s)
EMMO 967080e5 2f42 4eb2 a3a9 c58143e835f9: Per Pascal and Second.

PerPicoMetre
type: Class
comment: Per Picoometer Unit is a denominator unit with dimensions /pm. -- QUDT
subclass of: Restriction
  has value: 1e+12
subclass of: Restriction
  has value: 0e+00
alternative label: ReciprocalPicoMetre
qudtReference: http://qudt.org/vocab/unit/PER-PicoM
ucumCode: /pm
ucumCode: pm-1
unitSymbol: /pm
EMMO 967080e5 2f42 4eb2 a3a9 c58143e835f9: Per Picoometer Unit is a denominator unit with dimensions /pm. -- QUDT

PerSecond
type: Class
comment: A reciprical unit of time for `reciprocal second` or `inverse second`. The `Per Second` is a unit of rate. -- QUDT
subclass of: Restriction
  has value: 1e+00
subclass of: Restriction
  has value: 0e+00
alternative label: ReciprocalSecond
qudtReference: http://qudt.org/vocab/unit/PER-SEC
ucumCode: /s
ucumCode: s-1
unitSymbol: /s
EMMO 967080e5 2f42 4eb2 a3a9 c58143e835f9: A reciprical unit of time for `reciprocal second` or `inverse second`. The `Per Second` is a unit of rate. -- QUDT

PerSecondSquareMetre
type: Class
comment: `Per Second Square Meter` is a measure of flux with dimensions /sec-m². -- QUDT
subclass of: Restriction
  has value: 1e+00
subclass of: Restriction
  has value: 0e+00
alternative label: ReciprocalSecondSquareMetre
qudtReference: http://qudt.org/vocab/unit/PER-SEC-M2
ucumCode: /(s1.m2)
ucumCode: s-1.m-2
unitSymbol: /s⋅m²
EMMO 967080e5 2f42 4eb2 a3a9 c58143e835f9: `Per Second Square Meter` is a measure of flux with dimensions /sec-m². -- QUDT

PerSecondSquareMetreSteradian
type: Class
comment: Per Second Square Meter Steradian is a denominator unit with dimensions /sec-m²-sr. -- QUDT
subclass of: Restriction
  has value: 1e+00
subclass of: Restriction
  has value: 0e+00
alternative label: ReciprocalSecondSquareMetreSteradian
qudtReference: http://qudt.org/vocab/unit/PER-SEC-M2-SR
ucumCode: /(s.m2.sr)
ucumCode: s-1.m-2.sr-1
unitSymbol: /s⋅m²⋅sr
EMMO 967080e5 2f42 4eb2 a3a9 c58143e835f9: Per Second Square Meter Steradian is a denominator unit with dimensions /sec-m²-sr. -- QUDT

PerSecondSteradian
type: Class
comment: Per Second Steradian Unit is a denominator unit with dimensions /sec-sr. -- QUDT
subclass of: Restriction
  has value: 1e+00
subclass of: Restriction
  has value: 0e+00
alternative label: ReciprocalSecondSteradian
qudtReference: http://qudt.org/vocab/unit/PER-SEC-SR
ucumCode: /(s.sr)
ucumCode: s-1.sr-1
unitSymbol: /s⋅sr
EMMO 967080e5 2f42 4eb2 a3a9 c58143e835f9: Per Second Steradian Unit is a denominator unit with dimensions /sec-sr. -- QUDT

PerSquareJoule
type: Class
comment: Per Square Joule is a denominator unit with dimensions /eV². -- QUDT
subclass of: Restriction
  has value: 1e+00
subclass of: Restriction
  has value: 0e+00
alternative label: ReciprocalSquareJoule
qudtReference: http://qudt.org/vocab/unit/PER-J2
ucumCode: J-2
unitSymbol: /J²
EMMO 967080e5 2f42 4eb2 a3a9 c58143e835f9: Per Square Joule is a denominator unit with dimensions /eV². -- QUDT

PerSquareKilogram
type: Class
comment: Per Square Kilogram is a denominator unit with dimensions /kg². -- QUDT
subclass of: Restriction
  has value: 0e+00
subclass of: Restriction
  has value: 1e+00
alternative label: ReciprocalSquareKilogram
qudtReference: http://qudt.org/vocab/unit/PER-KiloGM2
ucumCode: kg-2
unitSymbol: /kg²
EMMO 967080e5 2f42 4eb2 a3a9 c58143e835f9: Per Square Kilogram is a denominator unit with dimensions /kg². -- QUDT

PerSquareMetre
type: Class
comment: "Per Square Meter" is a denominator unit with dimensions /m². -- QUDT
subclass of: Restriction
  has value: 1e+00
subclass of: Restriction
  has value: 0e+00
alternative label: ReciprocalSquareMetre
qudtReference: http://qudt.org/vocab/unit/PER-M2
ucumCode: /m2
ucumCode: m-2
unitSymbol: /m²
EMMO 967080e5 2f42 4eb2 a3a9 c58143e835f9: "Per Square Meter" is a denominator unit with dimensions /m². -- QUDT

PerSquareMetreSecond
type: Class
comment: Per square metre and second.
subclass of: Restriction
  has value: 1e+00
subclass of: Restriction
  has value: 0e+00
alternative label: ReciprocalSquareMetreSecond
qudtReference: http://qudt.org/vocab/unit/PER-M2-SEC
ucumCode: m-2.s-1
unitSymbol: /(m²⋅s)
EMMO 967080e5 2f42 4eb2 a3a9 c58143e835f9: Per square metre and second.

PerSquareSecond
type: Class
comment: Per square second.
subclass of: Restriction
  has value: 1e+00
subclass of: Restriction
  has value: 0e+00
alternative label: ReciprocalSquareSecond
qudtReference: http://qudt.org/vocab/unit/PER-SEC2
ucumCode: s-2
unitSymbol: /s²
EMMO 967080e5 2f42 4eb2 a3a9 c58143e835f9: Per square second.

PerSteradian
type: Class
comment: Per steradian.
subclass of: Restriction
  has value: 1e+00
subclass of: Restriction
  has value: 0e+00
alternative label: ReciprocalSteradian
qudtReference: http://qudt.org/vocab/unit/PER-SR
ucumCode: sr-1
unitSymbol: /sr
EMMO 967080e5 2f42 4eb2 a3a9 c58143e835f9: Per steradian.

PerTeslaMetre
type: Class
comment: Per Tesla Meter Unit is a denominator unit with dimensions /m .· T. -- QUDT
subclass of: Restriction
  has value: 1e+00
subclass of: Restriction
  has value: 0e+00
alternative label: ReciprocalTeslaMetre.
qudtReference: http://qudt.org/vocab/unit/PER-T-M
ucumCode: T-1.m-1
unitSymbol: /t⋅m
EMMO 967080e5 2f42 4eb2 a3a9 c58143e835f9: Per Tesla Meter Unit is a denominator unit with dimensions /m .· T. -- QUDT

PerTeslaSecond
type: Class
comment: Per Tesla Second Unit is a denominator unit with dimensions /s . T. -- QUDT
alternative label: Per Tesla and Second unit.
qudtReference: http://qudt.org/vocab/unit/PER-T-SEC
ucumCode: T-1.s-1
unitSymbol: /T⋅s
EMMO 967080e5 2f42 4eb2 a3a9 c58143e835f9: Per Tesla Second Unit is a denominator unit with dimensions /s . T. -- QUDT

PerWeber
type: Class
comment: Per Weber unit.
subclass of: Restriction
  has value: 1e+00
subclass of: Restriction
  has value: 0e+00
alternative label: ReciprocalWeber
qudtReference: http://qudt.org/vocab/unit/PER-WB
ucumCode: Wb-1
unitSymbol: /Wb
EMMO 967080e5 2f42 4eb2 a3a9 c58143e835f9: Per Weber unit.

Percent
type: Class
comment: "Percent" is a unit for 'Dimensionless Ratio' expressed as %. -- QUDT
subclass of: Restriction
  has value: 1e+00
subclass of: Restriction
  has value: 0e+00
qudtReference: http://qudt.org/vocab/unit/PERCENT
ucumCode: %
unitSymbol: %
EMMO 967080e5 2f42 4eb2 a3a9 c58143e835f9: "Percent" is a unit for 'Dimensionless Ratio' expressed as %. -- QUDT
wikipediaReference: http://en.wikipedia.org/wiki/Percentage

PercentPerDay
type: Class
subclass of: Restriction
  has value: 1.157407e-05
subclass of: Restriction
  has value: 0e+00
alternative label: Percent per day
qudtReference: http://qudt.org/vocab/unit/PERCENT-PER-DAY
ucumCode: %.d-1
unitSymbol: %/day

PercentPerHour
type: Class
subclass of: Restriction
  has value: 0e+00
subclass of: Restriction
  has value: 2.777778e-04
alternative label: Percent per hour
qudtReference: http://qudt.org/vocab/unit/PERCENT-PER-HR
ucumCode: %.h-1
unitSymbol: %/day

PercentPerMetre
type: Class
subclass of: Restriction
  has value: 1e+00
subclass of: Restriction
  has value: 0e+00
alternative label: Percent per metre
qudtReference: http://qudt.org/vocab/unit/PERCENT-PER-M
ucumCode: %.m-1
unitSymbol: %/m

PercentPerWeek
type: Class
comment: A rate of change in percent over a period of 7 days -- QUDT
subclass of: Restriction
  has value: 1.653439e-06
subclass of: Restriction
  has value: 0e+00
alternative label: Percent per week
qudtReference: http://qudt.org/vocab/unit/PERCENT-PER-WK
ucumCode: %.wk-1
unitSymbol: %/wk
EMMO 967080e5 2f42 4eb2 a3a9 c58143e835f9: A rate of change in percent over a period of 7 days -- QUDT

PercentRelativeHumidity
type: Class
comment: Percent relative humidity is the ratio of the partial pressure of water vapor to the equilibrium vapor pressure of water at a given temperature, expressed as a percentage. -- QUDT
subclass of: Restriction
  has value: 1e-02
subclass of: Restriction
  has value: 0e+00
alternative label: Percent Relative Humidity
qudtReference: http://qudt.org/vocab/unit/PERCENT_RH
unitSymbol: %RH
EMMO 967080e5 2f42 4eb2 a3a9 c58143e835f9: Percent relative humidity is the ratio of the partial pressure of water vapor to the equilibrium vapor pressure of water at a given temperature, expressed as a percentage. -- QUDT

PetaByte
type: Class
comment: A petabyte is a unit of information equal to one quadrillion bytes, or 1024 terabytes. The unit symbol for the petabyte is PB. The prefix peta (P) indicates the fifth power to 1000: 1 PB = 1000000000000000B, 1 million gigabytes = 1 thousand terabytes The pebibyte (PiB), using a binary prefix, is the corresponding power of 1024, which is more than 12% greater (2⁵⁰ bytes = 1,125,899,906,842,624 bytes). -- QUDT
subclass of: Restriction
  has value: 0e+00
subclass of: Restriction
  some values from: Byte
subclass of: Restriction
  has value: 5.545177e+15
qudtReference: http://qudt.org/vocab/unit/PetaBYTE
ucumCode: PBy
unitSymbol: PB
EMMO 967080e5 2f42 4eb2 a3a9 c58143e835f9: A petabyte is a unit of information equal to one quadrillion bytes, or 1024 terabytes. The unit symbol for the petabyte is PB. The prefix peta (P) indicates the fifth power to 1000: 1 PB = 1000000000000000B, 1 million gigabytes = 1 thousand terabytes The pebibyte (PiB), using a binary prefix, is the corresponding power of 1024, which is more than 12% greater (2⁵⁰ bytes = 1,125,899,906,842,624 bytes). -- QUDT
wikipediaReference: http://en.wikipedia.org/wiki/Petabyte

PetaCoulomb
type: Class
comment: A PetaCoulomb is 10¹⁵ C. -- QUDT
subclass of: Restriction
  has value: 0e+00
subclass of: Restriction
  has value: 1e+15
subclass of: Restriction
  some values from: Coulomb
qudtReference: http://qudt.org/vocab/unit/PetaC
ucumCode: PC
unitSymbol: PC
EMMO 967080e5 2f42 4eb2 a3a9 c58143e835f9: A PetaCoulomb is 10¹⁵ C. -- QUDT

PetaJoule
type: Class
comment: 1,000,000,000,000,000-fold of the derived SI unit joule -- QUDT
subclass of: Restriction
  some values from: Joule
subclass of: Restriction
  has value: 1e+15
subclass of: Restriction
  has value: 0e+00
qudtReference: http://qudt.org/vocab/unit/PetaJ
ucumCode: PJ
unitSymbol: PJ
EMMO 967080e5 2f42 4eb2 a3a9 c58143e835f9: 1,000,000,000,000,000-fold of the derived SI unit joule -- QUDT

Phot
type: Class
comment: A phot (ph) is a photometric unit of illuminance, or luminous flux through an area. It is not an SI unit, but rather is associated with the older centimetre gram second system of units. Metric dimensions: illuminance = luminous intensity × solid angle / length. -- QUDT
subclass of: Restriction
  has value: 1e+04
subclass of: Restriction
  has value: 0e+00
qudtReference: http://qudt.org/vocab/unit/PHOT
ucumCode: ph
unitSymbol: ph
EMMO 967080e5 2f42 4eb2 a3a9 c58143e835f9: A phot (ph) is a photometric unit of illuminance, or luminous flux through an area. It is not an SI unit, but rather is associated with the older centimetre gram second system of units. Metric dimensions: illuminance = luminous intensity × solid angle / length. -- QUDT
wikipediaReference: http://en.wikipedia.org/wiki/Phot

Pica
type: Class
comment: A pica is a typographic unit of measure corresponding to 1/72 of its respective foot, and therefore to 1/6 of an inch. The pica contains 12 point units of measure. Notably, Adobe PostScript promoted the pica unit of measure that is the standard in contemporary printing, as in home computers and printers. Usually, pica measurements are represented with an upper-case 'P' with an upper-right-to-lower-left virgule (slash) starting in the upper right portion of the 'P' and ending at the lower left of the upright portion of the 'P'; essentially drawing a virgule (/) through a 'P'. Note that these definitions are different from a typewriter's pica setting, which denotes a type size of ten characters per horizontal inch. -- QUDT
subclass of: Restriction
  has value: 4.2333e-03
subclass of: Restriction
  has value: 0e+00
qudtReference: http://qudt.org/vocab/unit/PCA
ucumCode: [pca]
unitSymbol: pc
EMMO 967080e5 2f42 4eb2 a3a9 c58143e835f9: A pica is a typographic unit of measure corresponding to 1/72 of its respective foot, and therefore to 1/6 of an inch. The pica contains 12 point units of measure. Notably, Adobe PostScript promoted the pica unit of measure that is the standard in contemporary printing, as in home computers and printers. Usually, pica measurements are represented with an upper-case 'P' with an upper-right-to-lower-left virgule (slash) starting in the upper right portion of the 'P' and ending at the lower left of the upright portion of the 'P'; essentially drawing a virgule (/) through a 'P'. Note that these definitions are different from a typewriter's pica setting, which denotes a type size of ten characters per horizontal inch. -- QUDT
wikipediaReference: http://en.wikipedia.org/wiki/Pica

PicoAmpere
type: Class
subclass of: Restriction
  some values from: Ampere
subclass of: Restriction
  has value: 1e-12
subclass of: Restriction
  has value: 0e+00
alternative label: picoampere
qudtReference: http://qudt.org/vocab/unit/PicoA
ucumCode: pA
unitSymbol: pA

PicoAmpsPerMicroMolePerLitre
type: Class
subclass of: Restriction
  has value: 1e-03
subclass of: Restriction
  has value: 0e+00
alternative label: Picoamps per micromole per litre
qudtReference: http://qudt.org/vocab/unit/PicoA-PER-MicroMOL-L
ucumCode: pA.umol-1.L-1
unitSymbol: pA/(mmol⋅L)

PicoCoulomb
type: Class
comment: A PicoCoulomb is 10⁻¹² C. -- QUDT
subclass of: Restriction
  some values from: Coulomb
subclass of: Restriction
  has value: 1e-12
subclass of: Restriction
  has value: 0e+00
qudtReference: http://qudt.org/vocab/unit/PicoC
ucumCode: pC
unitSymbol: pC
EMMO 967080e5 2f42 4eb2 a3a9 c58143e835f9: A PicoCoulomb is 10⁻¹² C. -- QUDT

PicoFarad
type: Class
comment: "PicoF" is a common unit of electric capacitance equal to 10⁻¹² farad. This unit was formerly called the micromicrofarad. -- QUDT
subclass of: Restriction
  some values from: Farad
subclass of: Restriction
  has value: 1e-12
subclass of: Restriction
  has value: 0e+00
qudtReference: http://qudt.org/vocab/unit/PicoFARAD
ucumCode: pF
unitSymbol: pF
EMMO 967080e5 2f42 4eb2 a3a9 c58143e835f9: "PicoF" is a common unit of electric capacitance equal to 10⁻¹² farad. This unit was formerly called the micromicrofarad. -- QUDT
wikipediaReference: http://en.wikipedia.org/wiki/Farad

PicoFaradPerMetre
type: Class
comment: 1e-12 fold of the SI derived unit farad divided by the SI base unit metre. -- QUDT
subclass of: Restriction
  some values from: FaradPerMetre
subclass of: Restriction
  has value: 1e-12
subclass of: Restriction
  has value: 0e+00
alternative label: Picofarad Per Metre
qudtReference: http://qudt.org/vocab/unit/PicoFARAD-PER-M
ucumCode: pF.m-1
unitSymbol: pF/m
EMMO 967080e5 2f42 4eb2 a3a9 c58143e835f9: 1e-12 fold of the SI derived unit farad divided by the SI base unit metre. -- QUDT

PicoGram
type: Class
comment: 10**-12 grams or one 10**-15 of the SI standard unit of mass (kilogram). -- QUDT
subclass of: Restriction
  some values from: Gram
subclass of: Restriction
  has value: 1e-15
subclass of: Restriction
  has value: 0e+00
qudtReference: http://qudt.org/vocab/unit/PicoGM
ucumCode: pg
unitSymbol: pg
EMMO 967080e5 2f42 4eb2 a3a9 c58143e835f9: 10**-12 grams or one 10**-15 of the SI standard unit of mass (kilogram). -- QUDT

PicoGramPerGram
type: Class
comment: One part per 10**12 (trillion) by mass of the measurand in the matrix. -- QUDT
subclass of: Restriction
  has value: 1e-12
subclass of: Restriction
  some values from: GramPerGram
subclass of: Restriction
  has value: 0e+00
alternative label: Picograms per gram
qudtReference: http://qudt.org/vocab/unit/PicoGM-PER-GM
ucumCode: pg.g-1
unitSymbol: pg/g
EMMO 967080e5 2f42 4eb2 a3a9 c58143e835f9: One part per 10**12 (trillion) by mass of the measurand in the matrix. -- QUDT

PicoGramPerKilogram
type: Class
comment: One part per 10**15 by mass of the measurand in the matrix. -- QUDT
subclass of: Restriction
  has value: 1e-15
subclass of: Restriction
  has value: 0e+00
subclass of: Restriction
  some values from: GramPerKilogram
alternative label: Picograms per kilogram
qudtReference: http://qudt.org/vocab/unit/PicoGM-PER-KiloGM
ucumCode: pg.kg-1
unitSymbol: pg/kg
EMMO 967080e5 2f42 4eb2 a3a9 c58143e835f9: One part per 10**15 by mass of the measurand in the matrix. -- QUDT

PicoGramPerMilliLitre
type: Class
comment: One 10**15 part of the SI standard unit of mass of the measurand per millilitre volume of matrix. -- QUDT
subclass of: Restriction
  some values from: GramPerMilliLitre
subclass of: Restriction
  has value: 1e-09
subclass of: Restriction
  has value: 0e+00
alternative label: Picograms per millilitre
qudtReference: http://qudt.org/vocab/unit/PicoGM-PER-MilliL
ucumCode: pg.mL-1
unitSymbol: pg/mL
EMMO 967080e5 2f42 4eb2 a3a9 c58143e835f9: One 10**15 part of the SI standard unit of mass of the measurand per millilitre volume of matrix. -- QUDT

PicoHenry
type: Class
comment: 0.000000000001-fold of the SI derived unit henry -- QUDT
subclass of: Restriction
  some values from: Henry
subclass of: Restriction
  has value: 1e-12
subclass of: Restriction
  has value: 0e+00
qudtReference: http://qudt.org/vocab/unit/PicoH
ucumCode: pH
unitSymbol: pH
EMMO 967080e5 2f42 4eb2 a3a9 c58143e835f9: 0.000000000001-fold of the SI derived unit henry -- QUDT

PicoLitre
type: Class
comment: 0.000000000001-fold of the unit litre -- QUDT
subclass of: Restriction
  some values from: Litre
subclass of: Restriction
  has value: 1e-15
subclass of: Restriction
  has value: 0e+00
qudtReference: http://qudt.org/vocab/unit/PicoL
ucumCode: pL
unitSymbol: pL
EMMO 967080e5 2f42 4eb2 a3a9 c58143e835f9: 0.000000000001-fold of the unit litre -- QUDT

PicoMetre
type: Class
comment: 0.000000000001-fold of the SI base unit metre -- QUDT
subclass of: Restriction
  has value: 0e+00
subclass of: Restriction
  some values from: Metre
subclass of: Restriction
  has value: 1e-12
qudtReference: http://qudt.org/vocab/unit/PicoM
ucumCode: pm
unitSymbol: pm
EMMO 967080e5 2f42 4eb2 a3a9 c58143e835f9: 0.000000000001-fold of the SI base unit metre -- QUDT

PicoMole
type: Class
subclass of: Restriction
  some values from: Mole
subclass of: Restriction
  has value: 1e-12
subclass of: Restriction
  has value: 0e+00
qudtReference: http://qudt.org/vocab/unit/PicoMOL
unitSymbol: pmol

PicoMolePerCubicMetre
type: Class
subclass of: Restriction
  some values from: MolePerCubicMetre
subclass of: Restriction
  has value: 1e-12
subclass of: Restriction
  has value: 0e+00
alternative label: Picomoles per cubic metre
qudtReference: http://qudt.org/vocab/unit/PicoMOL-PER-M3
ucumCode: pmol.m-3
unitSymbol: pmol/m³

PicoMolePerCubicMetrePerSecond
type: Class
subclass of: Restriction
  some values from: MolePerCubicMetrePerSecond
subclass of: Restriction
  has value: 1e-12
subclass of: Restriction
  has value: 0e+00
alternative label: Picomoles per cubic metre per second
qudtReference: http://qudt.org/vocab/unit/PicoMOL-PER-M3-SEC
ucumCode: pmol.m-3.s-1
unitSymbol: pmol/(m³⋅s)

PicoMolePerKilogram
type: Class
subclass of: Restriction
  has value: 1e-12
subclass of: Restriction
  has value: 0e+00
alternative label: Picomoles per kilogram
qudtReference: http://qudt.org/vocab/unit/PicoMOL-PER-KiloGM
ucumCode: pmol.kg-1
unitSymbol: pmol/kg

PicoMolePerLitre
type: Class
subclass of: Restriction
  some values from: MolePerLitre
subclass of: Restriction
  has value: 1e-09
subclass of: Restriction
  has value: 0e+00
alternative label: Picomoles per litre
qudtReference: http://qudt.org/vocab/unit/PicoMOL-PER-L
ucumCode: pmol.L-1
unitSymbol: pmol/L

PicoMolePerLitrePerDay
type: Class
comment: A change in the quantity of matter of 10⁻¹² moles in the SI unit of volume scaled by 10⁻³ over a period of 86400 seconds. -- QUDT
subclass of: Restriction
  has value: 1.157407e-14
subclass of: Restriction
  has value: 0e+00
alternative label: Picomoles per litre per day
qudtReference: http://qudt.org/vocab/unit/PicoMOL-PER-L-DAY
ucumCode: pmol.L-1.d-1
unitSymbol: pmol/day
EMMO 967080e5 2f42 4eb2 a3a9 c58143e835f9: A change in the quantity of matter of 10⁻¹² moles in the SI unit of volume scaled by 10⁻³ over a period of 86400 seconds. -- QUDT

PicoMolePerLitrePerHour
type: Class
comment: A change in the quantity of matter of 10⁻¹² moles in the SI unit of volume scaled by 10⁻³ over a period of 3600 seconds. -- QUDT
subclass of: Restriction
  has value: 2.777778e-13
subclass of: Restriction
  has value: 0e+00
alternative label: Picomoles per litre per hour
qudtReference: http://qudt.org/vocab/unit/PicoMOL-PER-L-HR
ucumCode: pmol.L-1.h-1
unitSymbol: pmol/(L⋅h)
EMMO 967080e5 2f42 4eb2 a3a9 c58143e835f9: A change in the quantity of matter of 10⁻¹² moles in the SI unit of volume scaled by 10⁻³ over a period of 3600 seconds. -- QUDT

PicoMolePerMetrePerWattPerSecond
type: Class
subclass of: Restriction
  has value: 1e-12
subclass of: Restriction
  has value: 0e+00
alternative label: Picomoles per metre per watt per second
qudtReference: http://qudt.org/vocab/unit/PicoMOL-PER-M-W-SEC
ucumCode: pmol.m-1.W-1.s-1
unitSymbol: pmol/(m⋅W⋅s)

PicoMolePerSquareMetrePerDay
type: Class
subclass of: Restriction
  some values from: MolePerSquareMetrePerDay
subclass of: Restriction
  has value: 1.157407e-17
subclass of: Restriction
  has value: 0e+00
alternative label: Picomoles per square metre per day
qudtReference: http://qudt.org/vocab/unit/PicoMOL-PER-M2-DAY
ucumCode: pmol.m-2.d-1
unitSymbol: pmol/(m²⋅day)

PicoPascal
type: Class
subclass of: Restriction
  some values from: Pascal
subclass of: Restriction
  has value: 1e-12
subclass of: Restriction
  has value: 0e+00
qudtReference: http://qudt.org/vocab/unit/PicoPA
unitSymbol: pPa

PicoPascalPerKiloMetre
type: Class
comment: 0.000000000001-fold of the SI derived unit pascal divided by the 1 000-fold of the SI base unit metre -- QUDT
subclass of: Restriction
  has value: 1e-15
subclass of: Restriction
  has value: 0e+00
alternative label: Picopascal Per Kilometre
qudtReference: http://qudt.org/vocab/unit/PicoPA-PER-KiloM
ucumCode: pPa.km-1
unitSymbol: pPa/km
EMMO 967080e5 2f42 4eb2 a3a9 c58143e835f9: 0.000000000001-fold of the SI derived unit pascal divided by the 1 000-fold of the SI base unit metre -- QUDT

PicoSecond
type: Class
comment: 0.000000000001-fold of the SI base unit second -- QUDT
subclass of: Restriction
  some values from: Second
subclass of: Restriction
  has value: 1e-12
subclass of: Restriction
  has value: 0e+00
qudtReference: http://qudt.org/vocab/unit/PicoSEC
ucumCode: ps
unitSymbol: ps
EMMO 967080e5 2f42 4eb2 a3a9 c58143e835f9: 0.000000000001-fold of the SI base unit second -- QUDT

PicoSiemens
type: Class
subclass of: Restriction
  some values from: Siemens
subclass of: Restriction
  has value: 1e-12
subclass of: Restriction
  has value: 0e+00
qudtReference: http://qudt.org/vocab/unit/PicoS
unitSymbol: pS

PicoSiemensPerMetre
type: Class
comment: 0.000000000001-fold of the SI derived unit Siemens divided by the SI base unit metre -- QUDT
subclass of: Restriction
  has value: 1e-12
subclass of: Restriction
  some values from: SiemensPerMetre
subclass of: Restriction
  has value: 0e+00
alternative label: Picosiemens Per Metre
qudtReference: http://qudt.org/vocab/unit/PicoS-PER-M
ucumCode: pS.m-1
unitSymbol: pS/m
EMMO 967080e5 2f42 4eb2 a3a9 c58143e835f9: 0.000000000001-fold of the SI derived unit Siemens divided by the SI base unit metre -- QUDT

PicoWatt
type: Class
comment: 0.000000000001-fold of the SI derived unit watt -- QUDT
subclass of: Restriction
  some values from: Watt
subclass of: Restriction
  has value: 1e-12
subclass of: Restriction
  has value: 0e+00
qudtReference: http://qudt.org/vocab/unit/PicoW
ucumCode: pW
unitSymbol: pW
EMMO 967080e5 2f42 4eb2 a3a9 c58143e835f9: 0.000000000001-fold of the SI derived unit watt -- QUDT

PicoWattPerSquareCentiMetrePerLitre
type: Class
comment: The power (scaled by 10⁻¹²) per SI unit of area (scaled by 10⁻⁴) produced per SI unit of volume (scaled by 10⁻³). -- QUDT
subclass of: Restriction
  has value: 1e-05
subclass of: Restriction
  has value: 0e+00
alternative label: Picowatts per square centimetre per litre
qudtReference: http://qudt.org/vocab/unit/PicoW-PER-CentiM2-L
ucumCode: pW.cm-2.L-1
unitSymbol: pW/(cm²⋅L)
EMMO 967080e5 2f42 4eb2 a3a9 c58143e835f9: The power (scaled by 10⁻¹²) per SI unit of area (scaled by 10⁻⁴) produced per SI unit of volume (scaled by 10⁻³). -- QUDT

PicoWattPerSquareMetre
type: Class
comment: 0.000000000001-fold of the SI derived unit watt divided by the power of the SI base unit metre with the exponent 2 -- QUDT
subclass of: Restriction
  some values from: WattPerSquareMetre
subclass of: Restriction
  has value: 1e-12
subclass of: Restriction
  has value: 0e+00
alternative label: Picowatt Per Square Metre
qudtReference: http://qudt.org/vocab/unit/PicoW-PER-M2
ucumCode: pW.m-2
unitSymbol: pW/m²
EMMO 967080e5 2f42 4eb2 a3a9 c58143e835f9: 0.000000000001-fold of the SI derived unit watt divided by the power of the SI base unit metre with the exponent 2 -- QUDT

Pint_Uk
type: Class
comment: unit of the volume (both for fluids and for dry measures) according to the Imperial system of units -- QUDT
subclass of: Restriction
  has value: 5.682613e-04
subclass of: Restriction
  has value: 0e+00
alternative label: Pint (UK)
qudtReference: http://qudt.org/vocab/unit/PINT_UK
ucumCode: [pt_br]
unitSymbol: pt{UK}
EMMO 967080e5 2f42 4eb2 a3a9 c58143e835f9: unit of the volume (both for fluids and for dry measures) according to the Imperial system of units -- QUDT

Pint_Uk_Per_Day
type: Class
comment: unit of the volume pint (UK) (both for fluids and for dry measures) according to the Imperial system of units divided by the unit for time day -- QUDT
subclass of: Restriction
  has value: 6.577098e-09
subclass of: Restriction
  has value: 0e+00
alternative label: Pint (UK) Per Day
qudtReference: http://qudt.org/vocab/unit/PINT_UK-PER-DAY
ucumCode: [pt_br].d
unitSymbol: pt{UK}/day
EMMO 967080e5 2f42 4eb2 a3a9 c58143e835f9: unit of the volume pint (UK) (both for fluids and for dry measures) according to the Imperial system of units divided by the unit for time day -- QUDT

Pint_Uk_Per_Hr
type: Class
comment: unit of the volume pint (UK) (both for fluids and for dry measures) according to the Imperial system of units divided by the unit for time hour -- QUDT
subclass of: Restriction
  has value: 1.578504e-07
subclass of: Restriction
  has value: 0e+00
alternative label: Pint (UK) Per Hour
qudtReference: http://qudt.org/vocab/unit/PINT_UK-PER-HR
ucumCode: [pt_br].h-1
unitSymbol: pt{UK}/hr
EMMO 967080e5 2f42 4eb2 a3a9 c58143e835f9: unit of the volume pint (UK) (both for fluids and for dry measures) according to the Imperial system of units divided by the unit for time hour -- QUDT

Pint_Uk_Per_Min
type: Class
comment: unit of the volume pint (UK) (both for fluids and for dry measures) according to the Imperial system of units divided by the unit for time minute -- QUDT
subclass of: Restriction
  has value: 9.471022e-06
subclass of: Restriction
  has value: 0e+00
alternative label: Pint (UK) Per Minute
qudtReference: http://qudt.org/vocab/unit/PINT_UK-PER-MIN
ucumCode: [pt_br].min-1
unitSymbol: pt{UK}/min
EMMO 967080e5 2f42 4eb2 a3a9 c58143e835f9: unit of the volume pint (UK) (both for fluids and for dry measures) according to the Imperial system of units divided by the unit for time minute -- QUDT

Pint_Uk_Per_Sec
type: Class
comment: unit of the volume pint (UK) (both for fluids and for dry measures) according to the Imperial system of units divided by the SI base unit second -- QUDT
subclass of: Restriction
  has value: 5.682613e-04
subclass of: Restriction
  has value: 0e+00
alternative label: Pint (UK) Per Second
qudtReference: http://qudt.org/vocab/unit/PINT_UK-PER-SEC
ucumCode: [pt_br].s-1
unitSymbol: pt{UK}/s
EMMO 967080e5 2f42 4eb2 a3a9 c58143e835f9: unit of the volume pint (UK) (both for fluids and for dry measures) according to the Imperial system of units divided by the SI base unit second -- QUDT

Pint_Us_Per_Day
type: Class
comment: unit of the volume pint (US liquid) according to the Anglo-American system of units divided by the unit for time day -- QUDT
subclass of: Restriction
  has value: 5.47658e-09
subclass of: Restriction
  has value: 0e+00
alternative label: Pint (US Liquid) Per Day
qudtReference: http://qudt.org/vocab/unit/PINT_US-PER-DAY
ucumCode: [pt_us].d-1
unitSymbol: pt{US}/day
EMMO 967080e5 2f42 4eb2 a3a9 c58143e835f9: unit of the volume pint (US liquid) according to the Anglo-American system of units divided by the unit for time day -- QUDT

Pint_Us_Per_Hr
type: Class
comment: unit of the volume pint (US liquid) according to the Anglo-American system of units divided by the unit for time hour -- QUDT
subclass of: Restriction
  has value: 1.314379e-07
subclass of: Restriction
  has value: 0e+00
alternative label: Pint (US Liquid) Per Hour
qudtReference: http://qudt.org/vocab/unit/PINT_US-PER-HR
ucumCode: [pt_us].h-1
unitSymbol: pt{US}/hr
EMMO 967080e5 2f42 4eb2 a3a9 c58143e835f9: unit of the volume pint (US liquid) according to the Anglo-American system of units divided by the unit for time hour -- QUDT

Pint_Us_Per_Min
type: Class
comment: unit of the volume pint (US liquid) according to the Anglo-American system of units divided by the unit for time minute -- QUDT
subclass of: Restriction
  has value: 7.886275e-06
subclass of: Restriction
  has value: 0e+00
alternative label: Pint (US Liquid) Per Minute
qudtReference: http://qudt.org/vocab/unit/PINT_US-PER-MIN
ucumCode: [pt_us].min-1
unitSymbol: pt{US}/min
EMMO 967080e5 2f42 4eb2 a3a9 c58143e835f9: unit of the volume pint (US liquid) according to the Anglo-American system of units divided by the unit for time minute -- QUDT

Pint_Us_Per_Sec
type: Class
comment: unit of the volume pint (US liquid) according to the Anglo-American system of units divided by the SI base unit second -- QUDT
subclass of: Restriction
  has value: 4.731765e-04
subclass of: Restriction
  has value: 0e+00
alternative label: Pint (US Liquid) Per Second
qudtReference: http://qudt.org/vocab/unit/PINT_US-PER-SEC
ucumCode: [pt_us].s-1
unitSymbol: pt{US}/s
EMMO 967080e5 2f42 4eb2 a3a9 c58143e835f9: unit of the volume pint (US liquid) according to the Anglo-American system of units divided by the SI base unit second -- QUDT

Pk_Uk
type: Class
comment: unit of the volume according to the Imperial system of units -- QUDT
subclass of: Restriction
  has value: 9.092181e-03
subclass of: Restriction
  has value: 0e+00
alternative label: Peck (UK)
qudtReference: http://qudt.org/vocab/unit/PK_UK
ucumCode: [pk_br]
unitSymbol: peck{UK}
EMMO 967080e5 2f42 4eb2 a3a9 c58143e835f9: unit of the volume according to the Imperial system of units -- QUDT

Pk_Uk_Per_Day
type: Class
comment: unit of the volume peck (UK) according to the Imperial system of units divided by the unit for time day -- QUDT
subclass of: Restriction
  has value: 1.052336e-07
subclass of: Restriction
  has value: 0e+00
alternative label: Peck (UK) Per Day
qudtReference: http://qudt.org/vocab/unit/PK_UK-PER-DAY
ucumCode: [pk_br].d-1
unitSymbol: peck{UK}/day
EMMO 967080e5 2f42 4eb2 a3a9 c58143e835f9: unit of the volume peck (UK) according to the Imperial system of units divided by the unit for time day -- QUDT

Pk_Uk_Per_Hr
type: Class
comment: unit of the volume peck (UK) according to the Imperial system of units divided by the unit for time hour -- QUDT
subclass of: Restriction
  has value: 2.525606e-06
subclass of: Restriction
  has value: 0e+00
alternative label: Peck (UK) Per Hour
qudtReference: http://qudt.org/vocab/unit/PK_UK-PER-HR
ucumCode: [pk_br].h-1
unitSymbol: peck{UK}/hr
EMMO 967080e5 2f42 4eb2 a3a9 c58143e835f9: unit of the volume peck (UK) according to the Imperial system of units divided by the unit for time hour -- QUDT

Pk_Uk_Per_Min
type: Class
comment: unit of the volume peck (UK) according to the Imperial system of units divided by the unit for time minute -- QUDT
subclass of: Restriction
  has value: 0e+00
subclass of: Restriction
  has value: 1.515364e-04
alternative label: Peck (UK) Per Minute
qudtReference: http://qudt.org/vocab/unit/PK_UK-PER-MIN
ucumCode: [pk_br].min-1
unitSymbol: peck{UK}/min
EMMO 967080e5 2f42 4eb2 a3a9 c58143e835f9: unit of the volume peck (UK) according to the Imperial system of units divided by the unit for time minute -- QUDT

Pk_Uk_Per_Sec
type: Class
comment: unit of the volume peck (UK) according to the Imperial system of units divided by the SI base unit second -- QUDT
subclass of: Restriction
  has value: 9.092181e-03
subclass of: Restriction
  has value: 0e+00
alternative label: Peck (UK) Per Second
qudtReference: http://qudt.org/vocab/unit/PK_UK-PER-SEC
ucumCode: [pk_br].s-1
unitSymbol: peck{UK}/s
EMMO 967080e5 2f42 4eb2 a3a9 c58143e835f9: unit of the volume peck (UK) according to the Imperial system of units divided by the SI base unit second -- QUDT

Pk_Us_Dry_Per_Day
type: Class
comment: unit of the volume peck (US dry) as dry measure according to the Anglo-American system of units divided by the unit for time day -- QUDT
subclass of: Restriction
  has value: 1.019649e-07
subclass of: Restriction
  has value: 0e+00
alternative label: Peck (US Dry) Per Day
qudtReference: http://qudt.org/vocab/unit/PK_US_DRY-PER-DAY
ucumCode: [pk_us].d-1
unitSymbol: peck{US}/day
EMMO 967080e5 2f42 4eb2 a3a9 c58143e835f9: unit of the volume peck (US dry) as dry measure according to the Anglo-American system of units divided by the unit for time day -- QUDT

Pk_Us_Dry_Per_Hr
type: Class
comment: unit of the volume peck (US dry) as dry measure according to the Anglo-American system of units divided by the unit for time hour -- QUDT
subclass of: Restriction
  has value: 2.447158e-06
subclass of: Restriction
  has value: 0e+00
alternative label: Peck (US Dry) Per Hour
qudtReference: http://qudt.org/vocab/unit/PK_US_DRY-PER-HR
ucumCode: [pk_us].h-1
unitSymbol: peck{US}/hr
EMMO 967080e5 2f42 4eb2 a3a9 c58143e835f9: unit of the volume peck (US dry) as dry measure according to the Anglo-American system of units divided by the unit for time hour -- QUDT

Pk_Us_Dry_Per_Min
type: Class
comment: unit of the volume peck (US dry) as dry measure according to the Anglo-American system of units divided by the unit for time minute -- QUDT
subclass of: Restriction
  has value: 0e+00
subclass of: Restriction
  has value: 1.468295e-04
alternative label: Peck (US Dry) Per Minute
qudtReference: http://qudt.org/vocab/unit/PK_US_DRY-PER-MIN
ucumCode: [pk_us].min-1
unitSymbol: peck{US}/min
EMMO 967080e5 2f42 4eb2 a3a9 c58143e835f9: unit of the volume peck (US dry) as dry measure according to the Anglo-American system of units divided by the unit for time minute -- QUDT

Pk_Us_Dry_Per_Sec
type: Class
comment: unit of the volume peck (US dry) as dry measure according to the Anglo-American system of units divided by the SI base unit second -- QUDT
subclass of: Restriction
  has value: 8.809768e-03
subclass of: Restriction
  has value: 0e+00
alternative label: Peck (US Dry) Per Second
qudtReference: http://qudt.org/vocab/unit/PK_US_DRY-PER-SEC
ucumCode: [pk_us].s-1
unitSymbol: peck{US}/s
EMMO 967080e5 2f42 4eb2 a3a9 c58143e835f9: unit of the volume peck (US dry) as dry measure according to the Anglo-American system of units divided by the SI base unit second -- QUDT

PlanckAngularFrequency
type: Class
subclass of: Restriction
  has value: 1.85487e+43
subclass of: Restriction
  has value: 0e+00
alternative label: Planck Angular Frequency
qudtReference: http://qudt.org/vocab/unit/PlanckFrequency_Ang
unitSymbol: planckangularfrequency

PlanckArea
type: Class
subclass of: Restriction
  has value: 2.61223e-70
subclass of: Restriction
  has value: 0e+00
alternative label: Planck Area
qudtReference: http://qudt.org/vocab/unit/PlanckArea
unitSymbol: planckarea

PlanckCharge
type: Class
comment: In physics, the Planck charge, denoted by, is one of the base units in the system of natural units called Planck units. It is a quantity of electric charge defined in terms of fundamental physical constants. The Planck charge is defined as: coulombs, where: is the speed of light in the vacuum, is Planck's constant, is the reduced Planck constant, is the permittivity of free space is the elementary charge = (137.03599911) is the fine structure constant. The Planck charge is times greater than the elementary charge e carried by an electron. -- QUDT
subclass of: Restriction
  has value: 1.875546e-18
subclass of: Restriction
  has value: 0e+00
alternative label: Planck Charge
qudtReference: http://qudt.org/vocab/unit/PlanckCharge
unitSymbol: planckcharge
EMMO 967080e5 2f42 4eb2 a3a9 c58143e835f9: In physics, the Planck charge, denoted by, is one of the base units in the system of natural units called Planck units. It is a quantity of electric charge defined in terms of fundamental physical constants. The Planck charge is defined as: coulombs, where: is the speed of light in the vacuum, is Planck's constant, is the reduced Planck constant, is the permittivity of free space is the elementary charge = (137.03599911) is the fine structure constant. The Planck charge is times greater than the elementary charge e carried by an electron. -- QUDT
wikipediaReference: https://en.wikipedia.org/wiki/Planck_units

PlanckCurrent
type: Class
comment: The Planck current is the unit of electric current, denoted by Iₚ, in the system of natural units known as Planck units. ≈ 3.479 × 10 A, where: the Planck time is the permittivity in vacuum and the reduced Planck constant G is the gravitational constant c is the speed of light in vacuum. The Planck current is that current which, in a conductor, carries a Planck charge in Planck time. Alternatively, the Planck current is that constant current which, if maintained in two straight parallel conductors of infinite length and negligible circular cross-section, and placed a Planck length apart in vacuum, would produce between these conductors a force equal to a Planck force per Planck length. -- QUDT
subclass of: Restriction
  has value: 3.4789e+25
subclass of: Restriction
  has value: 0e+00
alternative label: Planck Current
qudtReference: http://qudt.org/vocab/unit/PlanckCurrent
unitSymbol: Iₚ
EMMO 967080e5 2f42 4eb2 a3a9 c58143e835f9: The Planck current is the unit of electric current, denoted by Iₚ, in the system of natural units known as Planck units. ≈ 3.479 × 10 A, where: the Planck time is the permittivity in vacuum and the reduced Planck constant G is the gravitational constant c is the speed of light in vacuum. The Planck current is that current which, in a conductor, carries a Planck charge in Planck time. Alternatively, the Planck current is that constant current which, if maintained in two straight parallel conductors of infinite length and negligible circular cross-section, and placed a Planck length apart in vacuum, would produce between these conductors a force equal to a Planck force per Planck length. -- QUDT
wikipediaReference: http://en.wikipedia.org/wiki/Planck_current

PlanckCurrentDensity
type: Class
subclass of: Restriction
  has value: 0e+00
subclass of: Restriction
  has value: 1.331774e+95
alternative label: Planck Current Density
qudtReference: http://qudt.org/vocab/unit/PlanckCurrentDensity
unitSymbol: planckcurrentdensity